##TITLE=$$ Begin of the data block
##JCAMP-DX=5.00 $$ ACD/SpecManager v 10.08
##SPECTROMETER/DATA SYSTEM=Varian
##DATE=04 Dec 2012 13:37:16
##DATA TYPE=INFRARED SPECTRUM
##DATA CLASS=XYDATA
##ORIGIN=
##OWNER=
##NPOINTS=3735
##FIRSTX=399.26403809
##LASTX=4000.35498047
##MAXX=4000.35498047
##MINX=399.26403809
##MAXY=69.71475983
##MINY=26.62225151
##XFACTOR=1.0000000000
##YFACTOR=0.000000100000000
##FIRSTY=50.10611725
##DELTAX=0.96440572
##XUNITS=1/CM
##YUNITS=TRANSMITTANCE
##XYDATA=(X++(Y..Y))
399.3E01061172P226334K1000176J1733055R131775M225196j7635574q746033K176438
407E30172539k432289M144783N323524m035911m041443L778381k867546n132828M580956
415.7E29490166J316948r311753j7428932L886910J5822982K736054n485535O405678
423.4E27432518R823799p383385l346366J561889j863365M591827o71920n509072P34024
432.1E25369949R65615p41272j466523J379700k200889l346024L808937j836471k832222
440.7E19100800M932899K163467L66898N66101k642898l566628J599999M928741L368263
449.4E30817642J571350j670685m465522j998520Q71315q33016k650566l538208L329926
458.1E21433716L419075k202606J472854L598519N32760m590416j613884J066628l828240
$$ plain form
399.3 501061172 508287506 529287682 541020737 550152512 554377708 536742134 527996101 530172539
407 530172539 527740250 531885033 537208557 533172646 529131203 532909584 530042038 524909210 529490166
415.7 529490166 530807114 521495361 504066429 507953339 523776321 526512375 521026840 527432518
423.4 527432518 537256317 529872932 526526566 528088455 526225090 530816917 530144997 524635925 525369949
432.1 525369949 526335564 525594292 524127769 525507469 523306580 519960556 523769493 521933022 519100800
440.7 519100800 524033699 526197166 526564064 527130165 524487267 520920639 522520638 527449379 530817642
449.4 530817642 532388992 530718307 526252785 524254265 525125580 524292564 521641998 518103790 521433716
458.1 521433716 524852791 522650185 524123039 527721558 528254318 523663902 522050018 523116646 519288406
466.8E19288406J023484l010483j222763O454544k722092n749397j226463J826820
474.5E14662056K632675P41768l064423o894188k408714j366463K492409O199913J537247
483.2E14532280k293015l921699j990395J248474L649216r1629k482223m45328j221199
491.8E06984482P72552L17345o30531K031173p88002l852195o46325j46789k31171
500.5E03810539j907m065476p11593J702881p14455l593369m278259r04617j777611
509.2D89466133j664886k26708O36444O21338m03404j68800j821862l524208j277694
517.9D81636353R4451j714248j016350N8289N33142L27491j187744n42030q45261m07447
527.5D76936646J49993o0997l68652o31142M1085K23999J745872J608772P75681n39284
$$ plain form
466.8 519288406 520311890 517301407 516078644 522533188 519811096 514061699 512835236 514662056
474.5 514662056 517294731 518036499 514972076 508077888 505669174 504302711 506795120 512995033 514532280
483.2 514532280 512239265 508317566 506327171 507575645 511224861 511133232 508651009 508205681 506984482
491.8 506984482 507757034 508074379 507443848 509475021 508687019 504834824 504188499 504041710 503810539
500.5 503810539 503808632 499743156 499031563 500734444 500019989 496426620 492148361 491243744 489466133
509.2 489466133 487801247 487574539 488210983 488832321 488428917 488260117 486438255 482914047 481636353
517.9 481636353 481730804 480016556 479000206 479058495 479591637 479919128 478731384 478189354 477344093 476936646
527.5 476936646 477086639 477025642 476656990 476025848 476066933 476290932 478036804 479645576 480421257 479881973
537.2D79881973o16569J449852Q55674J114731J435967J280594J88102j63040Q85811
545.9D86313095M0436R55200k72522k114677k114525j354027J019211Q40835J209603
554.5D84522629J155052j057625q18786L33557r89418j961937j752587j812439L62397
563.2D77980843L59306n87006r11598j653709j661148k411728j659165k251243j299439
571.9D65905113j244163j043740K111779O89125K022590K033463j118126j455803L66135
580.6D68266373J548347N89409J844940J025810R35097L277588K614288J053734J064530
589.3D82220116O3858k239991j005592P34902J442794P40853j69182K605667K322273
597.9D86715698R0065j385422k557334j687432K79427J299171J50337R50356J327515
$$ plain form
537.2 479881973 479265404 480715256 481570930 482685661 484121628 485402222 485590324 485427284 486313095
545.9 486313095 486353531 487308731 487036209 484921532 482807007 481452980 482472191 483313026 484522629
554.5 484522629 485677681 484620056 483801270 484134827 483145409 481183472 479430885 477618446 477980843
563.2 477980843 478340149 477753143 476841545 475187836 473526688 471114960 469455795 467204552 465905113
571.9 465905113 464660950 463617210 465728989 466418114 468440704 470474167 469356041 467900238 468266373
580.6 468266373 469814720 470404129 472249069 473274879 474209976 477487564 480101852 481155586 482220116
589.3 482220116 482283974 480043983 479038391 479773293 481216087 481956940 481787758 484393425 486715698
597.9 486715698 486805763 485420341 482863007 481175575 481455002 482754173 482904510 483854866 485182381
606.6D85182381M81071R94492N99289o89278j286697r83735l15284R95369J400375
615.3D86377983J001091J765671K775307K039718J029167q2512q93936R78356K217445
624D97208290J776161Q04558J375504K512703K258186K790718J044922r0981K20261
632.7E09900322n57022n87998k74734J310692J825790J912613J721611J012917j81198
641.3E16082993j505661l35198m53644L25127J450043P04498J690254J733704J455993
650E21148109j50566j586609q14170p98378R0980O08788P1296L00446J016617R43260
659.7E20829773J130600N55992j066818j184883j375809r3269Q36677k452469n279159
668.3E11900635N558243M144592J845436L39737n38025j639748r40513Q69598P82547
$$ plain form
606.6 485182381 485663452 486657944 487257233 486567955 485281258 484297523 483982239 484977608 486377983
615.3 486377983 487379074 489144745 491920052 493959770 494988937 494906425 494012489 494990845 497208290
624 497208290 498984451 499789009 501164513 503677216 505935402 508726120 509771042 509680061 509900322
632.7 509900322 509343300 508755302 508480568 509791260 511617050 513529663 515251274 516264191 516082993
641.3 516082993 514577332 514242134 513788490 514113617 515563660 516268158 517958412 519692116 521148109
650 521148109 520997543 519410934 518596764 517798386 517889366 518498154 518569450 518869896 519886513 520829773
659.7 520829773 521960373 522516365 521449547 520264664 518888855 518795586 519632263 517179794 511900635
668.3 511900635 517458878 521603470 523448906 523788643 523250618 521610870 520670357 521539955 522322502
677E22322502m31938J097374J369896Q04939J949463J200295O8740j204147j291847
685.7E25885277l46794l36418P50808J912575J537247J18332J17988L33328j170959
694.4E28801384j770515j292229q62351q30764o7139Q87794Q88291L93638k25639q44879
704E25077591j600266j132927l99398j103859j554337k49862J447677K047310K196426
712.7E24728355J529656N2986m50478j89476o96067m23661J056099J113968R47685
721.4E27669067J715889K291222K086830J537171J174392M61731O21796J757660K223472
730.1E41539230K444687K758675K845154J765899J148606K199783J406708o72112r18236
738.7E54518394Q50487J145287l91007L51715K490464L129463J344948n68085p74727
$$ plain form
677 522322502 521890564 522987938 524357834 525162773 527112236 528312531 528381271 527177124 525885277
685.7 525885277 525538483 525202065 525952873 527865448 529402695 529521027 529639015 529972343 528801384
694.4 528801384 527030869 525738640 524876289 524045525 523978386 524866180 525754471 526148109 525922470 525077591
704 525077591 523477325 522344398 521945000 520841141 519286804 519036942 520484619 522531929 524728355
712.7 524728355 526258011 526310997 525860519 525671043 524974976 524551315 525607414 526721382 527669067
721.4 527669067 529384956 531676178 533763008 535300179 536474571 536936302 537558098 539315758 541539230
730.1 541539230 543983917 546742592 549587746 551353645 552502251 554702034 556108742 555436630 554518394
738.7 554518394 555368881 556514168 556123161 556474876 558965340 562094803 563439751 562871666 562096939
747.4E62096939j188660j433410r02863j196594n65453R24759J000443J080017M07371
756.1E60222549r98611k880135k973136m72298l17955K22168R31701P78809J324043
764.8E55837135P95746J375504J054992j12953k34375Q2169J357689J098137J213836
773.5E62467880K683182L619766L106194J894111J849366J462631R20792m73710l76052
782.1E77154160J251869J067848J880951K956123J745224J078224J830254K9411j682663
790.8E87311401o26640M19426O19659N91050K210083K917633K250786J962318Q71010
799.5E98526726k21215m87747j24550p38830j21994J605110K180481K651138K616120
808.2F05885239J658516N23529m60930j434212k67220Q84781R57604J76086m19655
$$ plain form
747.4 562096939 560908279 559474869 558572006 557375412 556809959 557734718 558735161 559815178 560222549
756.1 560222549 559223938 556343803 553370667 552898369 552580414 552802582 553734283 554513092 555837135
764.8 555837135 556632881 558008385 559063377 558950424 558716049 558798218 560155907 561254044 562467880
773.5 562467880 565151062 568770828 571877022 573771133 575620499 577083130 578003922 577530212 577154160
782.1 577154160 578406029 579473877 581354828 584310951 586056175 587134399 588964653 588994064 587311401
790.8 587311401 586684761 587104187 587723846 588314896 590524979 593442612 595693398 597655716 598526726
799.5 598526726 598305511 597817764 597693214 596954384 596832390 598437500 600617981 603269119 605885239
808.2 605885239 607543755 608067284 607606354 606172142 605904922 606789703 607747307 607923393 607503738
816.9F07503738J659508J489487J070938P09839j209450j803474k337914j942062j204872
825.5F03935738J8539N38139J020089Q85353j498185k402229k734756k710190k399521
834.2E94652977j816864j146889L5553N98717m47464k14424m31366o91948k143097
842.9E88395195l574524k751503j359062K84119k10267K02599N26581N150o4164m16374
852.5E81037750k37045k101173j605111J34735Q89588R37805k70386J772347K201385
861.2E82759895P83997M50325N76095P47567j97029L34739J102333K792015M366532
869.9E93716469L985328L232193K618943J937217Q14286R61418K0981K55775N02777
878.6F08045387k746J313209R56459O78826k35443j116601j905174l192215k936172
$$ plain form
816.9 607503738 609163246 610652733 611723671 612433510 611224060 609420586 607082672 605140610 603935738
825.5 603935738 603954277 604492416 605512505 606397858 604899673 602497444 599762688 597052498 594652977
834.2 594652977 592836113 591689224 591724777 592323494 591876030 591661606 591230240 590538292 588395195
842.9 588395195 584820671 582069168 580710106 580994225 580783958 580986557 581513138 581518288 581454124 581037750
852.5 581037750 580800705 578699532 577094421 577229156 578118744 579056549 578786163 580558510 582759895
861.2 582759895 583543892 583994217 584570312 585317879 585120850 585455589 586557922 589349937 593716469
869.9 593716469 597701797 600933990 603552933 605490150 606304436 607265854 607286835 607542610 608045387
878.6 608045387 608042641 609355850 610312309 610991135 610755692 609639091 607733917 604541702 601605530
887.3F01605530j930008j081886j554413j012497n92880o85387j235352k633476k477531
895.9E88402100k418480k041130j985283j984329r43146K80876M53682j416626k196961
904.6E76150703k187957k499504l275795l983765l269997k013244n82390m99954j544457
913.3E56293640j958542k412605k704353k343788k828026l296509k264099j799813
921E36685905j523742m47693J03798L93753K12746m38500n51491n45273n97076j84097
930.7E33108330O28357M51660l40424M67453J868592J474914p9689p85293m04969o9122
940.3E36319809l77464Q0833J495323K146607J460113J37024n52788r55352j440049
949E38314056j420021j468315j856842j782913k055931k438240k281990k525940k728234
$$ plain form
887.3 601605530 599675522 598593636 597039223 596026726 595433846 594748459 593513107 590879631 588402100
895.9 588402100 585983620 583942490 581957207 579972878 579029732 579310608 579764290 578347664 576150703
904.6 576150703 573962746 571463242 568187447 564203682 560933685 558920441 558338051 557838097 556293640
913.3 556293640 554335098 551922493 549218140 546874352 544046326 540749817 538485718 536685905
921 536685905 535162163 534714470 534818268 535212021 535424767 534986267 534434776 533889503 533292427 533108330
930.7 533108330 533736687 534188347 533847923 534315376 536183968 537658882 537579193 536793900 536388931 536319809
940.3 536319809 535942345 536023178 537518501 539665108 541125221 541262245 540709457 539754105 538314056
949 538314056 536894035 535425720 533568878 531785965 529730034 527291794 525009804 522483864 519755630
957.7E19755630k550888k987976m450607n071106m136658l663864l877029l236923
965.4D89780579l072815m079247m972572n038185m772644o269226p424050p012214
973.1D47139626o085434n749741n786552n789681o623535n648041o272316o674919
980.8C98509407o437454p242012n746536n498200m574089m634666m207993l329315
988.5C56839142l526840k391549k673645k064704k400895q12339j58272r48944M0245
997.2C41902199n17884J17455n77660P28913N92727o98967k03552j359215l39469k77215
1006.8C39367332Q18100J43509j263618q10814j299706j166648j889000Q011q48961
1015.5C33058205j871605o09818l85818J99089r01070L99895M05273J26839k88391
$$ plain form
957.7 519755630 517204742 514216766 509766159 504695053 500558395 496894531 493017502 489780579
965.4 489780579 486707764 482628517 477655945 472617760 467845116 461575890 454151840 447139626
973.1 447139626 441054192 435304451 429517899 423728218 417104683 411456642 405184326 398509407
980.8 398509407 392071953 384829941 379083405 373585205 369011116 364376450 360168457 356839142
988.5 356839142 353312302 350920753 348247108 346182404 343781509 342969170 342810898 341861954 341902199
997.2 341902199 341384315 341501770 340924110 341653023 342245750 341546783 341343231 339984016 339644547 339367332
1006.8 339367332 340185432 340328941 339065323 338254509 336954803 335788155 333899155 333907166 333058205
1015.5 333058205 331186600 330576782 330190964 330390053 329488983 329888878 330294151 330420990 330132599
1024.2C30132599q21152J10970j70327Q67615M61273Q25310M33388J25542l02926q95996
1033.8C30766296M54178o97746l93715j120682m98810Q2284J32942L46985j858025
1042.5C27213707L88336j66664R7809J92489j120529k65655r67865R20028N0354Q72193
1052.2C27214203J265907J314812K025032M57344K533417K022094K163735K127914
1059.9C41124458K864037K837143J808281L231659R82170J508941J487885J405869
1067.6C57250443P46078j122665j099244k497634j594201k564621k190513k305412
1075.3C44622231j915627n59006j444854R8800j858368J83411J579170J214867K041626
1084C43962250O24161J522254J203537K765770J695328K162171K944259R03473J854744
$$ plain form
1024.2 330132599 329311447 329422417 329252090 330119705 330580978 331406288 331839676 331965218 331662292 330766296
1033.8 330766296 331220474 330522728 330129013 329008331 328509521 328591805 328724747 329071732 327213707
1042.5 327213707 327602043 327435379 327533188 327725677 326605148 326339493 325371628 326291656 326342010 327214203
1052.2 327214203 328480110 329794922 331819954 332277298 334810715 336832809 338996544 341124458
1059.9 341124458 343988495 346825638 348633919 351865578 352847748 354356689 355844574 357250443
1067.6 357250443 357996521 356873856 355774612 353276978 351682777 349118156 346927643 344622231
1075.3 344622231 342706604 342147598 340702744 340801544 338943176 339126587 340705757 341920624 343962250
1084 343962250 344586411 346108665 347312202 350077972 351773300 353935471 356879730 357783203 359637947
1092.7C59637947J252518K466621J227455K53487N54275R03740J454430n62744Q97636
1101.4C68085365M16718L3073L19138P51877J528091J047974J584892L78838J686821
1110C75832787R10644M06799J175003O80504J417771M9019Q75282M05922R41429J293526
1119.7C83988686L44238J392784L70445J164475P65533J171646J388817R45740J773262
1128.4C93305626Q55484J288299P86438R52187O9313k39792N70374n39093o59218r53255
1138C95436363l33938j980782k312202j374970j172867n96046k090874j110725j631966
1146.7C82831993j606064j412925j869736j667214k567176p69577j394768j130600
1154.4C70413933o87943J43662N05981j237411N15556j13296R21707J547546J370735
$$ plain form
1092.7 359637947 360890465 363357086 364584541 364838028 365392303 366296043 367750473 367187729 368085365
1101.4 368085365 368502083 368535156 368854294 369606171 371134262 372182236 373767128 374145966 375832787
1110 375832787 376743431 377150230 378325233 379005737 380423508 380472527 381347809 381753731 382695160 383988686
1119.7 383988686 384332924 385725708 386096153 387260628 388026161 389197807 390586624 391532364 393305626
1128.4 393305626 394161110 395449409 396235847 397188034 397257347 397017555 397587929 397048836 396389618 395436363
1138 395436363 395102425 393121643 390809441 389434471 388261604 387665558 385574684 384463959 382831993
1146.7 382831993 381225929 379813004 377943268 376276054 373708878 372939301 371544533 370413933
1154.4 370413933 369725990 369869652 370375633 369138222 369653778 369540482 370462189 372009735 373380470
1163.1C73380470K070389J881752L466072L145943L774681L219948L203354L735199
1170.8C97877808L830833M719353L911133M648513M597893M820862M352837L894615
1178.5D32653847M735336M253731L936348L399505L595887K753410K833519L613472
1186.2D61775055L048897K898521K472878K766761K122612J524163J228752O21986
1193.9D78459625Q03643R45472J355324Q60748M66843O95648J243134P67097J9226
1202.6D85616760M09661l06702J35345P68967R05991R88998P23801J267051J196328
1211.3D91706200J317138O17714K03247M85535L52058O73333M22172N11589L13225
1220D96602211J11427r2468n12772m75235r59701j279526j490288p51838l94554q13218
$$ plain form
1163.1 373380470 375450859 377332611 380798683 383944626 387719307 390939255 394142609 397877808
1170.8 397877808 401708641 406427994 410339127 414987640 419585533 424406395 428759232 432653847
1178.5 432653847 437389183 441642914 445579262 448978767 452574654 455328064 458161583 461775055
1186.2 461775055 464823952 467722473 470195351 472962112 475084724 476608887 477837639 478459625
1193.9 478459625 479263268 480208740 481564064 482424812 482891655 483587303 484830437 485597534 485616760
1202.6 485616760 486026421 485719719 485855064 486624031 487530022 488519020 489242821 490509872 491706200
1211.3 491706200 493023338 493641052 493844299 494329834 494681892 495355225 495777397 496288986 496602211
1220 496602211 496713638 496621170 496108398 495633163 494673462 493393936 491903648 491151810 490757256 489944038
1229.6D89944038o68068m59632m61884j508980j428833j352119r96590r7046l29780
1238.3D82641106J6136j8654L25165M06303L96576K39220j09024K86598M24385J266937
1247.9D85874748J238594J709290J920929J113930J221389J027756R52568N37148O63490
1256.6D96259842N55572L59078R09729J154404J723671R44709N73311P14150L9062
1265.3E03233528m6882N07087J082611O87676R01680J194649R69123J051865J032791
1274E10614128P85484L09601M21524J46981J85546O60134N01327R51996J010475Q46024
1283.6E16433220Q47435P94105P52869J80245M64592R21592N22995M28810O32553O79512
1293.3E22657928L14713o8550n29175n76134j70211j56861n3062k19460k83851k84233
$$ plain form
1229.6 489944038 489275970 488816338 488354454 486845474 485416641 484064522 483067932 482970886 482641106
1238.3 482641106 482657242 482638588 482963753 483370056 483766632 484005852 483896828 484183426 484607811 485874748
1247.9 485874748 487113342 488822632 490743561 491857491 493078880 494106636 495059204 495596352 496259842
1256.6 496259842 496815414 497174492 498084221 499238625 500962296 501907005 502480316 503194466 503233528
1265.3 503233528 503186646 503693733 504776344 505464020 506365700 507560349 508529472 509581337 510614128
1274 510614128 511399612 511709213 512130737 512277718 512463264 513123398 513624725 514576721 515587196 516433220
1283.6 516433220 517280655 518074760 518827629 519007874 519472466 520394058 520917053 521345863 521978416 522657928
1293.3 522657928 522972641 522904091 522374916 521798782 521628571 521471710 521418648 521199188 520915337 520631104
1302.9E20631104j0720N63698J40533k46353l68957m86336o25420p40547m54101l94326
1312.5E18008575l0021J48659l07503p32842o95038m13589j014938p06444K46963o6375
1322.2E14437447l60871j59683Q8997o2637l39165m03404o08483p49283o53152k35939
1331.8E10953827j63574m18969m16069m48570n70335j018219j428452j352081K0142
1340.5E05157700J121482Q70552O05202j40610k09159o8283l6850K39639n6534K8610
1350.2E07511749J89629q6365n10025m60167m04320m26178j81350m21639m50287r40628
1359.8E03820419j427154j209831j730538o32362Q16040j4305j196442j246834r29909
1368.5D96249084K49901J002350l61824r20563j422767j982270n32417K33383l86543
$$ plain form
1302.9 520631104 520620384 521184082 521324615 521078262 520709305 520222969 519597549 518857002 518402901 518008575
1312.5 518008575 517978554 518127213 517819710 517086868 516391830 515978241 514963303 514256859 514503822 514437447
1322.2 514437447 514076576 513916893 514005890 513943253 513604088 513200684 512592201 511842918 511189766 510953827
1331.8 510953827 510790253 510371284 509955215 509506645 508936310 507918091 506489639 505137558 505157700
1340.5 505157700 506279182 507149734 507754936 507614326 507405167 507336884 507300034 507539673 507483139 507511749
1350.2 507511749 507701378 507615013 507104988 506644821 506240501 505814323 505632973 505211334 504761047 503820419
1359.8 503820419 502393265 501183434 499452896 498820534 499636574 499622269 498425827 497178993 496249084
1368.5 496249084 496498985 497501335 497139511 496218948 494796181 492813911 492281494 492514877 492128334
1377.2D92128334j253052K45934J308632J580734J293068N12276N71785N69953M64173
1385.8D97421837m61311L62205K580338J930122R82895R84764M82521n93147k036476
1394.5E01653748j667061J401863L49502j509246r09958J490440J740379N40047N55191
1403.2E03644905k29416j296615L47404M65508m21791o57845k34261n06897k3651J89934
1412.8E01277275k59895n38864j061707j438980j660385j141243j710282K875176L407822
1421.5D99748917J446075N3711k80380J671104Q15468o16569n84031j182747n83915
1430.2E00487633q0261K83775k35939k57073l6506j320992k918205N97496K057610
1438.9D98577538k32430o28014K785k19269O28167j90125L6087q50525j812019j302147
$$ plain form
1377.2 492128334 490875282 491121216 492429848 494010582 495303650 495815926 496387711 496957664 497421837
1385.8 497421837 496960526 497322731 499903069 501833191 502816086 503800850 504283371 503690224 501653748
1394.5 501653748 499986687 501388550 501738052 500228806 499318848 500809288 502549667 503089714 503644905
1403.2 503644905 503415489 502118874 502466278 502931786 502509995 501852150 501617889 501110992 501087341 501277275
1412.8 501277275 501017380 500478516 499416809 497977829 496317444 495176201 493465919 496341095 499748917
1421.5 499748917 501194992 501248703 500968323 502639427 503454895 502838326 502254295 501071548 500487633
1430.2 500487633 500407372 500691147 500455208 500198135 500161629 498840637 495922432 496519928 498577538
1438.9 498577538 498345108 497717094 497719879 497500610 498128777 497938652 497974739 497124214 495312195 494010048
1448.5D94010048J85890k37083k063485j499443j724433j374588k710152k380371l653603
1457.2D78552780k559738M765358J564827K300873O37626N36118L16849k641182K999725
1465.9D86473236K608223M914818N151939P319565O331024K543411O195145P261391
1473.6E28798752R187622M354782M599533O719017M961281L605957J484909J968155
1481.3E65680008J911278K600441J785125R62525O93054n11780J038170j47552k734681
1490E71276588P39747L148651J621933l68805p58400j994324l466110J571045L08609
1498.7E72078934o32859J074410p31087j568413r00421j637230m108429j2121276m725380
1507.3E46728249M850692L189812Q08373L04603k084541k889099j112976k876015k696228
$$ plain form
1448.5 494010048 494195938 493958855 491895370 490395927 488671494 487296906 484586754 482206383 478552780
1457.2 478552780 475993042 480758400 482323227 484624100 485261726 485797844 486114693 483473511 486473236
1465.9 486473236 489081459 493996277 499148216 506467781 512798805 515342216 521537361 528798752
1473.6 528798752 537986374 542341156 546940689 553659706 558620987 562226944 563711853 565680008
1481.3 565680008 567591286 570191727 571976852 572939377 573632431 573120651 574158821 574011269 571276588
1490 571276588 572016335 575164986 576786919 576418114 575659714 573665390 570199280 571770325 572078934
1498.7 572078934 571446075 572520485 571789398 570220985 569320564 567683334 563574905 551453629 546728249
1507.3 546728249 551578941 554768753 555577126 555881729 553797188 550908089 549795113 546919098 544222870
1516E44222870l907700J132813L744812m2839n734101k786254K850837K725945Q82759
1524.7E43089142j882401j20315K40173j24206J782302Q84476j582565j929970k929916
1533.4E37426720j549950K414322P03278o60897j596985p811317m670029M956932K301941
1542.1E31514015K46544J345825K44332J815300L198433J283645k97928j146087J387176
1550.7E39591255L544655J862183J23138j183700J336555K562904j494865r369545
1558.5E36972580J793404J0609474O250419L033638K111206N55611j6212K069053J726113
1567.1E65105286J2245j982346j381607L479614K993355J095581J84784j73111k044983
1575.8E67288818l682022L031540L076973N63965Q659j66359P0191Q6784o99806o70586
$$ plain form
1516 544222870 540315170 541447983 545192795 545149956 539415855 536629601 539480438 542206383 543089142
1524.7 543089142 541206741 541086426 541326599 541202393 542984695 543869171 542286606 540356636 537426720
1533.4 537426720 535876770 538291092 538994370 538333473 536736488 528925171 524255142 529212074 531514015
1542.1 531514015 531760559 533106384 533350716 535166016 538364449 539648094 539350166 538204079 539591255
1550.7 539591255 543135910 544998093 545121231 543937531 545274086 547836990 546342125 536972580
1558.5 536972580 538765984 549375458 555625877 558659515 560770721 561326332 561310120 563379173 565105286
1567.1 565105286 565117531 563135185 561753578 565233192 568226547 569322128 569506912 569333801 567288818
1575.8 567288818 563606796 566638336 569715309 570279274 570287933 570121574 570191765 570278549 569578743 568908157
1585.5E68908157j112556r30100j280212j234322j346969j122399q15086q44727j643371
1594.1E58578415k434883q89244j231003j316223j958885k229691k261581k618332
1601.9E43638573j346741j860962j527252k148209k695732k834015k544174k820015
1609.6E25861473l242874j501007k749748k673684l595695l057175m051933q649597
1617.3D96339760Q91647j068878k191353l772125l064385m676933n718460J27869j974182
1626D74892960k407456n599747k564544j376839k789307k699699m049606j893769l263588
1634.6D48248405n417747l072853j6213j87721j043663K96173j923027j98173j538201
1643.3D35146980m73709q27980m819870q08258j392670M081879Q72803R87396l13072
$$ plain form
1585.5 568908157 567795601 566865501 565585289 564350967 563003998 561881599 561066513 560221786 558578415
1594.1 558578415 556143532 555254288 554023285 552707062 550748177 548518486 546256905 543638573
1601.9 543638573 542291832 540430870 538903618 536755409 534059677 531225662 528681488 525861473
1609.6 525861473 522618599 521117592 518367844 515694160 512098465 509041290 504989357 496339760
1617.3 496339760 497231407 496162529 493971176 490199051 487134666 482457733 476739273 476867142 474892960
1626 474892960 472485504 466885757 464321213 462944374 460155067 457455368 453405762 451511993 448248405
1634.6 448248405 442830658 439757805 439741592 439553871 438510208 438806381 436883354 436685181 435146980
1643.3 435146980 434673271 433845291 429025421 428217163 426824493 430906372 431779175 432766571 432453499
1652D32453499r490166K46773M308395O088333J634407K256546J386681J225586J442986
1660.7D41553040N25360J738701J476326M427413K348786K378845J753540j69678J498261
1669.4D57530594K339630M288979K004852L377151K833825R83047K946587L445854
1677.1D79750519L843040J632080J858216J799049L331337J917076n571937L689918
1684.8D92249298P516785N901108K735290K171478L178063K923202M131508L084717
1692.5E23891449K475090J799545J531105r75113L918534M853973L065605P26700j083641
1701.2E40203247N967789M192505J199188l78533R6741J049652K710724J916161m89578
1709.9E56467896M07295J502113P29065j65710k001915n44243J506729l06130j916847
$$ plain form
1652 432453499 422963333 423210106 427518501 433606834 435241241 437497787 438884468 440110054 441553040
1660.7 441553040 442078400 443817101 445293427 449720840 452069626 454448471 456202011 456032333 457530594
1669.4 457530594 459870224 464159203 466164055 469541206 472375031 473358078 476304665 479750519
1677.1 479750519 483593559 485225639 487083855 488882904 492214241 494131317 488559380 492249298
1684.8 492249298 499766083 505667191 508402481 510573959 513752022 516675224 520806732 523891449
1692.5 523891449 526366539 528166084 529697189 528722076 532640610 537494583 540560188 541286888 540203247
1701.2 540203247 546171036 550363541 551562729 551184196 551280937 552330589 555041313 556957474 556467896
1709.9 556467896 556875191 558377304 559106369 558940659 556938744 556394501 557901230 557595100 555678253
1718.5E55678253N493279L903656J500854K6322j198388l94058j71890j146622j949577
1727.2E61741829k135887k522583n224419l509292j373902l438911j0514908q635330
1734.9E24386597R00573k702636n430413n667266q471833p188682j905480l071518
1742.7D90849342o466713p33757J12076Q93326J731606L307037P821197O061631J0903892
1751.3E14479637J1841240J2240982J1711693J0384521R996872R747734J2157555Q838234
1759F01398468P822075N977135M829216P588882O003647N055160L596001L290329K202225
1767.7F47763138J235428L042831J415100j723938m33121M414750M598159K300644
1775.4F62612991J145172K484055R56039O37970K18735m08554K077026J765290Q76159
$$ plain form
1718.5 555678253 561171532 565075188 566576042 566602364 565403976 565009918 564838028 563691406 561741829
1727.2 561741829 559605942 557083359 551858940 548349648 546975746 543536835 533021927 524386597
1734.9 524386597 525287170 522584534 517154121 511486855 503015022 495826340 493920860 490849342
1742.7 490849342 484382629 483648872 483760948 484654274 486385880 489692917 497514114 503575745 514479637
1751.3 514479637 526320877 538561859 550273552 560658073 570654945 580402679 592560234 601398468
1759 601398468 609220543 615197678 620026894 627615776 633619423 638674583 642270584 645560913 647763138
1767.7 647763138 648998566 652041397 653456497 651732559 651299438 655714188 660312347 662612991
1775.4 662612991 663758163 666242218 667198257 667836227 668054962 667646408 669723434 671488724 672364883
1784.1F72364883j85928J149063J919174K19880L76358L96804j162948j253433p41730
1792.8F73082123K135849K980652L86734k06299J937637Q75931j132050n97610J513824
1801.5F80976791O68412R71222J459198R4528N26657J68075m8065O84510l67203j019898
1811.1F84114227Q07801J587524Q49075O33698M89349J93558j32370M62723L80020
1819.8F89385605l23715Q6670n80674K62604O5765j696090J651916J945038J60980
1828.5F90958099j889648k067185J945115K034912P94677M77982P1106m31061n31616
1837.2F91362381N59692J294403O9046j27334o61240n95093j662216l043365L379822
1845.8F90576096K201995m30297M10156J003570P50428j64032k63062j19476P7057
$$ plain form
1784.1 672364883 672178955 673328018 675247192 675467072 675843430 676240234 675077286 673823853 673082123
1792.8 673082123 675217972 678198624 678585358 678379059 680316696 681192627 680060577 679462967 680976791
1801.5 680976791 681645203 682616425 684075623 684170151 684696808 684864883 684816818 685501328 685134125 684114227
1811.1 684114227 684922028 686509552 687358627 687992325 688481674 688675232 688542862 689005585 689385605
1819.8 689385605 689061890 689148560 688567886 688830490 688896255 687200165 688852081 690797119 690958099
1828.5 690958099 689068451 687001266 688946381 690981293 691775970 692253952 692325058 691893997 691362381
1837.2 691362381 691922073 693216476 693285522 693158188 692496948 691901855 690239639 687196274 690576096
1845.8 690576096 692778091 692347794 692757950 693761520 694511948 694347916 694084854 693965378 694042435
1854.5F94042435K57492K15759K68860k2965L34320K16675l31649n58396l5553q2626
1864.2F94304352n12314l71780p97501l99551q69065K97241K196351J577224L96195
1872.8F95821152m22516j96228J07956L36075O6146j09939R2621M90875L63235o84661
1882.5F95864716j47324l01132l26004K12021J12915N90057q52814o33697J416473
1891.2F95935211O20423l39966k30866q24814n54046J064377J62887J65024P07245
1899.8F96705475K64969J77154m46548l17078m69055j88446k37045p34330q2244J34887
1909.5F94807739K85721P33643R92050j90582o87714n47333l16086l18374k086335
1918.2F92672729P44629J689759K24456l96881j103973M11453R87931L72543k58484
$$ plain form
1854.5 694042435 694299927 694515686 694784546 694761581 695095901 695312576 694980927 694422531 694386978 694304352
1864.2 694304352 693792038 693420258 692622757 692223206 691354141 691651382 693847733 695424957 695821152
1872.8 695821152 695398636 695202408 695310364 695646439 695712585 695602646 695695267 696186142 696549377 695864716
1882.5 695864716 695717392 695416260 695090256 695302277 695415192 696005249 695152435 694518738 695935211
1891.2 695935211 696555634 696215668 695984802 695159988 694605942 695670319 695833206 695998230 696705475
1899.8 696705475 696970444 697147598 696701050 696383972 695914917 695726471 695489426 694755096 694672852 694807739
1909.5 694807739 695093460 695827103 696819153 696628571 695940857 695393524 695077438 694759064 692672729
1918.2 692672729 693417358 695107117 695331573 694934692 693830719 694242172 695230103 695602646 695344162
1926.8F95344162l51563k62146l45611K59552N97916K47573k17437L65295Q8806m03366
1936.5F95323181n43747p35016q3999j97907l2425j410675p62405K116775P09534k47421
1946.1F94135895m6082P0420N950k83279j65100p6141J99508J63269K33231J14975
1955.8F94352646J58539j97831q62655n50919j64642K68402J05133L31497M73175k09045
1965.4F93704300o11115o07147K85034L12958J25504k594j43967K22855K55890L86886
1975.1F93928604J09711k03476j37940p1411j84021o62918q58078m46777N14221N28717
1984.7F92516632j41373J29242K85950k20337k10724j54953j022262j351319K10877
1993.4F90041733J022720M68063J28098r9640P2098N04532j79444n65719p52640n34134
$$ plain form
1926.8 695344162 694992599 694730453 694384842 694644394 695242310 695489883 695272446 695637741 695726547 695323181
1936.5 695323181 694779434 694044418 693960419 693762512 693730087 692319412 691557007 693673782 694383316 694135895
1946.1 694135895 694089813 694160233 694166183 693882904 693717804 693641663 693841171 694004440 694237671 694352646
1955.8 694352646 694511185 694313354 693450699 692899780 692735138 693003540 693108673 693440170 693913345 693704300
1965.4 693704300 693093185 692486038 692771072 693084030 693209534 693206940 693062973 693285828 693541718 693928604
1975.1 693928604 694038315 693834839 693696899 693625488 693441467 692778549 691920471 691473694 691987915 692516632
1984.7 692516632 692375259 692504501 692790451 692570114 692359390 692204437 691182175 689830856 690041733
1993.4 690041733 691064453 691532516 691660614 691560974 691633072 692137604 691958160 691392441 690639801 690105667
2003F90105667k26898l64227K19040N04608L66287o0272l95584m85688m85153j69983
2012.7F89007797l54843o38122o22406k93427K23236P07855N67856M1428j45645p86820
2022.3F87706909r43069o21186k97851j01013N5923L47824K20185K44522r1858m12216
2032F86108170o32172n94101j17569m72794m70504K1209L08915M18701K00958k87094
2041.6F84483719k56729k86789q71659n40466l62472J11465M12903L76129O40564o8130
2051.2F83638535j52588l42789n43900o35833p31049l8299Q8043N70144M27781K73742
2060.9F82553787K92053j11618J44196p14493j047668k92054M2649J42593L36609O97327
2070.5F82043381P24258L60336m31289l71628m49295m84695m18931q00705O2562O51474
$$ plain form
2003 690105667 689878769 689514542 689733582 690238190 690604477 690544205 690148621 689662933 689177780 689007797
2012.7 689007797 688652954 688014832 687392426 687098999 687322235 688030090 688597946 688639374 688493729 687706909
2022.3 687706909 686763840 686142654 685844803 685743790 685799713 686147537 686367722 686612244 686520386 686108170
2032 686108170 685475998 684881897 684764328 684291534 683821030 683842239 684151154 684569855 684770813 684483719
2041.6 684483719 684226990 683940201 683068542 682528076 682165604 682277069 682689972 683066101 683706665 683638535
2051.2 683638535 683485947 683143158 682599258 681963425 681232376 681194077 681282120 681852264 682280045 682553787
2060.9 682553787 682845840 682734222 682878418 682163925 681116257 680824203 680866852 681009445 681346054 682043381
2070.5 682043381 682767639 683127975 682696686 682325058 681875763 681391068 680972137 680171432 680233994 680885468
2080.2F80885468O74438N40390M29153M3641n90134m94385n66101m34570l26157J52359
2089.8F80314102K93884L50953Q91647L91998K33002l40881o24314m99725p70874l02200
2099.5F79937592j21689L66058O01959M73252L69568Q773j55258m62112o03714n91660
2109.1F79822769k8839L10135L29056L53851K75650L91235r384k33383m82407o23931
2118.7F80104752m82407n0964L48129K32391N59159J49841j67694L3493m0589j33819
2128.4F80552292o23551o27441l04413J98593K28424K70462N02930K5177N6992j04981
2138F80174484n43899m65317p629M8294j2513K09732l6697L63541K34985l29132O0730
2148.6F79696579j99432o30417k13394J41525j18866p248N74570O14700M5776p0190
$$ plain form
2080.2 680885468 681559906 682100296 682529449 682573090 681982956 681488571 680922470 680487900 680161743 680314102
2089.8 680314102 680607986 680958939 681850586 682242584 682475586 682134705 681510391 681010666 680239792 679937592
2099.5 679937592 679815903 680181961 680783920 681257172 681626740 681635513 681480255 681018143 680414429 679822769
2109.1 679822769 679793930 680104065 680433121 680786972 681062622 681453857 681444473 681211090 680728683 680104752
2118.7 680104752 679622345 679571381 679919510 680151901 680711060 680860901 680693207 680726700 680686111 680552292
2128.4 680552292 679928741 679301300 678996887 679195480 679423904 679694366 680197296 680222473 680279465 680174484
2138 680174484 679630585 679165268 679157639 679205933 679193420 679403152 679366455 679729996 679964981 679635849 679696579
2148.6 679696579 679497147 678866730 678653336 678794861 678675995 678668747 679243317 679858017 679903793 679833603
2158.3F79833603J39847l13874n38635k94342q4686K41852N38787K45514K30103L68195
2167.9F80366364J33056p2632q18939k26364L96347k8000J23444J15051M56238J10855
2177.6F80555420K02942N37109j62048j98898l23410r3613j03989q5754L37982L13187
2187.2F80978928K87704J92871M37164j42135m15573M9286j03455m15268k81830N34516
2196.9F81122208N10101M28162M56008L73307J24740o31485j78222K06833j58463l55377
2206.5F81897812o4011J68610M52804O26221Q698J48544l1738l82767l68195l40805
2216.1F82115173K09732K49100K10648K39715L64075P5073j68075j9684j76773M6539
2225.8F83145523k6474j62964l61175j49231M60815N86777L38364l8453K29m78744
$$ plain form
2158.3 679833603 679973450 679659576 679120941 678826599 678741913 678983765 679522552 679768066 679998169 680366364
2167.9 680366364 680499420 680426788 679607849 679381485 679777832 679749832 679873276 679988327 680444565 680555420
2177.6 680555420 680758362 681295471 681133423 680934525 680611115 680517502 680413513 680327759 680665741 680978928
2187.2 680978928 681266632 681459503 681896667 681754532 681338959 681388245 681284790 680869522 680587692 681122208
2196.9 681122208 681632309 682060471 682516479 682889786 683014526 682383041 682204819 682411652 682253189 681897812
2206.5 681897812 681833801 682002411 682455215 683081436 683090134 683238678 683206940 682824173 682455978 682115173
2216.1 682115173 682324905 682574005 682784653 683024368 683388443 683463516 683295441 683275757 683098984 683145523
2225.8 683145523 683119049 682956085 682594910 682445679 682906494 683493271 683831635 683793182 683793411 683314667
2235.4F83314667n06058m11530k59552J32447K18200P57904k6321N570L32717l58352
2245.1F83199692l00827l31192p63m65317m07791J01471J81274O35910K14310N1346
2254.7F82878113j97144k75345j56860l97720k74430K4720p5074k26211P85446P65610
2264.4F82851105J55105j53503o32248n79834m55856K6779l1891K23770K37656J75705
2274F81816788M94766j13525k91443m34952K9983q7738m56314P4158L59497M59290
2283.7F81850510m48685l53012p1259J88294K49481n66559l34625n42984N8212J72882
2293.3F80202255k88238J4267K05002L62701n89981l66974k23770j82419k48260q25119
2302.9F78059464j25733k44369N32302K74582q57620n41305l85514l40805p47986K82059
$$ plain form
2235.4 683314667 682808609 682397079 682137527 682269974 682488174 683246078 683219757 683225327 683558044 683199692
2245.1 683199692 682898865 682567673 682566910 682101593 681693802 681795273 681976547 682612457 682826767 682878113
2254.7 682878113 682680969 682405624 682248764 681851044 681576614 681601334 681526260 681300049 682085495 682851105
2264.4 682851105 683006210 682852707 682220459 681640625 681184769 681211548 681179657 681403427 681641083 681816788
2274 681816788 682311554 682198029 681906586 681471634 681501617 681413879 680957565 681031723 681391220 681850510
2283.7 681850510 681401825 681048813 680977554 681165848 681415329 680848770 680514145 679971161 680029373 680202255
2293.3 680202255 679914017 679928284 680133286 680495987 679906006 679539032 679315262 679132843 678884583 678059464
2302.9 678059464 677933731 677689362 678221664 678496246 677638626 677097321 676711807 676371002 675623016 675905075
2312.6F75905075K01035m22287l20664l03345N57633l7918q36487j319199o31103n37567
2322.2F72255173q60672L13873J21384R7732n4397L66668k96783r58252o32401p34863
2331.9F69617462K50931l67661N4398o4011k8991L62014n94406K42844k31628n87006
2341.5F68653946o34232k82898n26886j77764J614303O62308Q24051R20334K00119
2350.2F71253281q78830j805725j365281j055221o77414j183853k20413j71586q25653
2358.9F63069305M72413k90070L01437n722j135635m01535J073685J175918L2272J09101
2368.5F64401169K67792R73281J367493P34558m6539j8311l92074l62244R32999J100921
2378.2F68959045R69086O80542N09796L69187O86m9514j29242j984j65329J61667J18484
$$ plain form
2312.6 675905075 676106110 675683823 675363159 675059814 675617447 675579529 674743042 673423843 672792740 672255173
2322.2 672255173 671394501 671708374 671829758 671927490 671873093 672239761 671942978 670984726 670352325 669617462
2331.9 669617462 669868393 669500732 669555130 669491119 669462128 669824142 669229736 669472580 669240952 668653946
2341.5 668653946 668019714 667736816 667209930 667032166 668646469 669308777 670132828 671053162 671253281
2350.2 671253281 670374451 668568726 667203445 666148224 665470810 664286957 664066544 663894958 663069305
2358.9 663069305 663541718 663251648 663553085 663547363 662411728 662010193 663083878 664259796 664292068 664401169
2368.5 664401169 664668961 665642242 667009735 667744293 667697754 667679443 667287369 666925125 667858124 668959045
2378.2 668959045 669928131 670608673 671118469 671487656 671488342 671438828 671309586 671307602 671142273 671303940 671422424
2388.8F71422424l27606O8131r16J98364J52665m49601o71920l40195M5242k94571
2398.4F69802017l04413o6299N2719j39770k10724Q2550K00424o4621o81381n84488
2408.1F68086014n54581k17514L60260L38211L37525k97852l27683j44195o75736o56890
2417.7F66247559l21579k53449j38016O0349j93787J62430N98908j14518p34176m94080
2427.3F64819641l49274m15420q9493m24957l25394J40991Q4916K40249m40445q20389
2437F62420425m25720j66244j54038l66287l73840l93143m6463M02298M57001j01090
2446.6F61252899o29959p56302o25000J12534J46942l67890n01098j6327K57797l41110
2456.3F58532486l45688j81732l02734k90528j29776j03760k76489k3651n9128j94320
$$ plain form
2388.8 671422424 671094818 671162949 671162033 671360397 671513062 671063461 670391541 670051346 670096588 669802017
2398.4 669802017 669497604 669431305 669484024 669344254 669133530 669216080 669416504 669351883 668670502 668086014
2408.1 668086014 667531433 667313919 667674179 668012390 668349915 668052063 667724380 667580185 666904449 666247559
2417.7 666247559 665925980 665672531 665534515 665594864 665401077 665563507 666162415 666047897 665313721 664819641
2427.3 664819641 664470367 664054947 663965454 663540497 663215103 663356094 663441010 663681259 663240814 662420425
2437 662420425 661994705 661828461 661674423 661308136 660934296 660541153 660494690 660896988 661353989 661252899
2446.6 661252899 660622940 659866638 659241638 659354172 659501114 659133224 658632126 658615799 658873596 658532486
2456.3 658532486 658186798 658005066 657702332 657411804 657282028 657178268 656901779 656878128 656819000 656624680
2465.9F56624680J00174q5450k81982j06354n33142n72739j13449l30047l21198K5025
2475.6F54405518J80206k24381m94384k71454k31858Q774N7755l22342q32367m33045
2485.2F51842422L11509N9433n8823K27203j02310r37195m61502r8648l54080L3798
2494.8F50461807j80130N9586J46179r7351j3580j87989O714q0566l53775o19278p7057
2505.5F49064560L49045j85547j03150j31835l25776l25393o2409k80990m46473p2402
2515.1F47479630k11106J28403r8419k35672K80761k55508o81381k68250J08185k05231
2524.7F46041412k40097j60827j09024K822l97033m12216j05515L19595K4338o16684
2534.4F44346771o55441m88434J28861K24685k56347l68576k09504j68762m7226k00348
$$ plain form
2465.9 656624680 656724854 656639404 656357422 656251068 655717926 655145187 655031738 654701691 654380493 654405518
2475.6 654405518 654585724 654361343 653866959 653595505 653363647 653372421 653430176 653107834 652275467 651842422
2485.2 651842422 652153931 652213364 652154541 652381744 652279434 651342239 650880737 650782089 650428009 650461807
2494.8 650461807 650281677 650341263 650487442 650390091 650376511 650188522 650195236 650114670 649760895 649141617 649064560
2505.5 649064560 649413605 649228058 649124908 648993073 648667297 648341904 648279495 647998505 647552032 647479630
2515.1 647479630 647268524 647396927 647298508 647062836 647343597 647088089 646406708 646138458 646246643 646041412
2524.7 646041412 645801315 645640488 645531464 645534286 645137253 644725037 644619522 644939117 644963455 644346771
2534.4 644346771 643691330 643202896 643331757 643556442 643300095 642931519 642722015 642553253 642506027 642305679
2544F42305679m43420k39105l90854L586J2512n98602l36228j86539l433K5253k6702
2554.6F40122147j72844n26505k31590k33574l93829j6404J12420k2088k36358m70505
2564.3F37930870k12059j54343m8980p2403q55751n43022Q8882P4539l34549n15632
2573.9F35357552p782m9096K5216l63160p63855k94075j28822o5002j99585q622J5984
2584.5F33518753j82419j97639m65203j97677m0474m25186l54805M3754l48091n56335
2594.2F30794678k63596k53372j4763j83372m81148m08325N1078Q9302k49633j70861
2603.8F28909988l05442L1929m0131k28004l0747m09622o61469o53419k62566l44734
2613.5F26005783j12381j14708p68661p7210o409l34663k66342l61519l21045n46913
$$ plain form
2544 642305679 641862259 641623154 641232300 641235886 641248398 640649796 640313568 640127029 640123596 640148849 640122147
2554.6 640122147 639949303 639422798 639191208 638957634 638563805 638547401 638659821 638637733 638401375 637930870
2564.3 637930870 637718811 637564468 637515488 637443085 636587334 636044312 636133194 636207733 635873184 635357552
2573.9 635357552 635349770 635300674 635325890 634962730 634198875 633904800 633775978 633710976 633511391 633502769 633518753
2584.5 633518753 633336334 633138695 632673492 632475815 632435341 632010155 631655350 631699104 631351013 630794678
2594.2 630794678 630531082 630277710 630262947 630079575 629598427 629190102 629241180 629330482 629080849 628909988
2603.8 628909988 628604546 628636475 628596344 628368340 628337593 627927971 627266502 626613083 626350517 626005783
2613.5 626005783 625893402 625778694 625010033 624932823 624926414 624591751 624325409 623963890 623642845 623095932
2623.1F23095932l19786k9373m55094q84437l61862m1848n33676n79529o6833J48544
2632.8F19972038m33922l24058l39890q07838j52931j97144p63550m62761l29322m29154
2642.4F15731468k78778m56467n12580k78511m34571l74412q4343L5934k45666n27153
2652F12574921o21949m93507j8272j16310l65563l71246j03340k59324r00535o44875
2661.7F08680000q1978O1150n32684o94618k96898l78533l06816l84750k99073j54151
2671.3F05611649k50016l65143n14946k31742R3460O8016l72315n55610l35541k74315
2681F02873497n47295p61489j74218K99034j21460n81741k16217q7852m80042m86908
2690.6E99715309k63748R3460k97012n60265k0027q2588l95622j38283j33209p06292
$$ plain form
2623.1 623095932 622776146 622746773 622291679 621407242 621045380 621003532 620469856 619890327 619823494 619972038
2632.8 619972038 619538116 619214058 618874168 618066330 617913399 617716255 616952705 616489944 616160622 615731468
2642.4 615731468 615452690 614996223 614483643 614205132 613770561 613396149 613311806 613347740 613102074 612574921
2652 612574921 611952972 611459465 611441193 611324883 610959320 610588074 610484734 610225410 609324875 608680000
2661.7 608680000 608598022 608659172 608126488 607431870 607134972 606756439 606449623 606064873 605765800 605611649
2671.3 605611649 605361633 604996490 604481544 604249802 604343262 604411278 604038963 603483353 603147812 602873497
2681 602873497 602326202 601564713 601390495 601689529 601568069 600986328 600770111 600682259 600202217 599715309
2690.6 599715309 599451561 599545021 599248009 598687744 598667717 598585129 598189507 598051224 597918015 597211723
2700.3E97211723m92859m8065L9902k32086m13857j53351o57615n85098k52953j76926
2709.9E94238815q583n58777n87463m52576k88314k96059o80580n82886m23508q4762
2719.5E90275307p4768k11869m44641o03409O5995J58424n77774q42628l57171p5683
2729.2E87311783l48282m90456j7738M7035o59218m58488K18124k1209p32117l06511
2738.8E84542923J37444n07203m75616k84729j01509N9471k10114l37486m39606k29454
2748.5E82154121k06222l89786n51948m62265O3552q3541n24025n51033k25449j06850
2758.1E79116554l96919k77596l40499m76532J41143j1825o10809l02811j77384l9672
2767.8E76623650j05362o94275p79915n99632l05786k25144j19743P1182l57895o36597
$$ plain form
2700.3 597211723 596718864 596670799 596710701 596478615 596064758 595911407 595253792 594668694 594415741 594238815
2709.9 594238815 594230232 593671455 593083992 592631416 592343102 592047043 591366463 590783577 590360069 590275307
2719.5 590275307 590200539 589988670 589544029 588940620 589006615 589165039 588587265 587744637 587387466 587311783
2729.2 587311783 586963501 586473045 586455307 586502342 585843124 585384636 585602760 585581551 584849434 584542923
2738.8 584542923 584680367 584173164 583697548 583412819 583311310 583370781 583160667 582823181 582383575 582154121
2748.5 582154121 581947899 581558113 581006165 580543900 580607452 580523911 579999886 579448853 579223404 579116554
2758.1 579116554 578719635 578442039 578101540 577625008 577766151 577754326 577143517 576840706 576663322 576623650
2767.8 576623650 576518288 575824013 575044098 574444466 574138680 573913536 573793793 573864975 573507080 572870483
2777.4E72870483m08859l52325l53127j30768m54673q20733m52079k86827o37207n18952
2787E68454933j39694n29594l20855k1667p52487q53157m20418m29115p08847j51902
2796.7E64127197M1466r63325j014596n89103o58303q15734p88498p28226o63147m22363
2806.3E57525368l88794k91748n86815j292954j287994r03320o50368n68237q98819
2815E50656319j028023r39598j181221r87702q51516j190338j298905j186523j095314
2823.7E40897179j141281j316033j868172j735916j355133j589165j646385j922340
2831.4E28322754j964798k234154k500229k130584k006073k036019l073845m125023
2839.1E08252029m441833m736176m878311n899429p260742q061371q591538r076461
$$ plain form
2777.4 572870483 572461624 572109299 571756172 571625404 571170731 570349998 569897919 569611092 568973885 568454933
2787 568454933 568315239 567785645 567464790 567443123 566690636 565837479 565417061 564987946 564279099 564127197
2796.7 564127197 564168663 563205338 562190742 561601639 560943336 560127602 559339104 558610878 557947731 557525368
2806.3 557525368 557136574 556844826 556258011 554965057 553677063 552773743 552123375 551555138 550656319
2815 550656319 549628296 548688698 547507477 546519775 545668259 544477921 543179016 541992493 540897179
2823.7 540897179 539755898 538439865 536571693 534835777 533480644 531891479 530245094 528322754
2831.4 528322754 526357956 524123802 521623573 519492989 517486916 515450897 512377052 508252029
2839.1 508252029 503810196 499074020 494195709 488296280 481035538 472974167 464382629 455306168
2846.8D55306168r763451r965591r844361r447479p838745n928536m238205k014503
2854.6C96265297M80537K511864L732338M472771N546264N795250N737686O215439
2862.3D30757446N251961L859596L221665K620582J789551J060639O47315n4740r07631
2870.9D48246384n26085Q82873J163292N24636M77600P39898M83818P0572m2381j02119
2880.6D51918488m68789j098594q92372q37174j197471j317292j853409j762390j624145
2889.3D40866852j833229k025070k336159k278481k188759k076187k494888k591934
2897D23042145k237663k322083k094688k490960l271675l272590l034516l533058l866081
2905.7C96918831l279953l536797m441108m722519m626427n480957o370354o473617
$$ plain form
2846.8 455306168 445542717 435577126 425732765 416285286 408446541 402518005 398279800 396265297
2854.6 396265297 396745834 399257698 402990036 407462807 413009071 418804321 424542007 430757446
2862.3 430757446 436009407 439869003 443090668 445711250 447500801 448561440 449208755 449154015 448246384
2870.9 448246384 447720299 448603172 449766464 450291100 450768700 451508598 451992416 452062988 452020607 451918488
2880.6 451918488 451449699 450351105 449458733 448621559 447424088 446106796 444253387 442490997 440866852
2889.3 440866852 439033623 437008553 434672394 432393913 430205154 428128967 425634079 423042145
2897 423042145 420804482 418482399 416387711 413896751 410625076 407352486 404317970 400784912 396918831
2905.7 396918831 393638878 390102081 385660973 380938454 376312027 370831070 364460716 357987099
2913.4C57987099o842957o683616o953698p423515p470818p616539o551303n617810
2921.1C02826843n112838m356747l086453j447448j76354O10447R39503K112675K943668
2929.8B95253296L284721L880005M874993N598983N466175O033230O129341O462555
2937.5C36983299O850281O120644N833549O175957O346969N670548M909821L985290
2945.2C82876358L424225L506126L002816K210960J599731P60880K40936Q84972M53453
2953.9C98960457Q6937R60502Q13294J401787K404670K108994K084541L295822L904801
2962.6D16021805L534355L782196M291916M771385M482308L927917M016228M425506
2970.3D49253616M357796L760071L903274L894539L059769K397842K743988K719269
$$ plain form
2913.4 357987099 351144142 344460526 337506828 330083313 322612495 314995956 308444653 302826843
2921.1 302826843 297714005 293357258 290270805 288823357 288647003 289257450 290196953 292309628 295253296
2929.8 295253296 298538017 302418022 307293015 312891998 318358173 324391403 330520744 336983299
2937.5 336983299 343833580 349954224 355787773 361963730 368310699 373981247 378891068 382876358
2945.2 382876358 386300583 389806709 392809525 395020485 396620216 397381096 397622032 398507004 398960457
2953.9 398960457 399047394 400007896 400821190 402222977 404627647 406736641 408821182 412117004 416021805
2962.6 416021805 419556160 423338356 427630272 432401657 436883965 440811882 444828110 449253616
2970.3 449253616 453611412 457371483 461274757 465169296 468229065 470626907 473370895 476090164
2978D76090164K125969K330170K310142K037888J753082J982269K064591J317520J173401
2986.7D93185196J117973P84302P93419J307869R74693K9335J79253K47078N3329Q0452
2996.3D98752899n00603j081504r76029j140289j276016j415482j871338j610374j281052
3005D87600212q54034q83217j397019o43653k0905J85699J012764J322022J084747
3013.7D87406616J465531J426925J233101J663704J497002J319389R27239P44514Q48007
3022.4D98532028R04846J035805J90125j04256k89726j46256M46587l90968o59409
3031D99518776k11678L9368O8321k07634k96325o19355q37860k96516J29509o14510
3040.7D96672096j071319p92237n63812k79312m72717r92241j163216p24449m17366
$$ plain form
2978 476090164 478216133 480546303 482856445 484894333 486647415 488629684 490694275 492011795 493185196
2986.7 493185196 494303169 495087471 495880890 497188759 498163452 498192787 498372040 498619118 498672447 498752899
2996.3 498752899 498252296 497170792 496194763 495054474 493778458 492362976 490491638 488881264 487600212
3005 487600212 486746178 485862961 484465942 483822289 483801384 483987083 484999847 486321869 487406616
3013.7 487406616 488872147 490299072 491532173 493195877 494692879 496012268 496939507 497684021 498532028
3022.4 498532028 499436874 500472679 500662804 500558548 500268822 500122566 500569153 500178185 499518776
3031 499518776 499307098 499346466 499414787 499207153 498910828 498291473 497453613 497157097 497286606 496672096
3040.7 496672096 495600777 494808540 494244728 493965416 493492699 492500458 491337242 490612793 490195427
3049.4D90195427l02467l64037p40662n81894o37283r33838q48846q63037q99048p10983
3059D83313332m85650k32048l94668j055489j078682o46095j93634m14543q14438o21681
3068.6D77376404q43964m34112o4621n61982p66868n49927l22685n53398o67954p60650
3078.3D71850243l70789m32243j004944m66995n59464q62656p99980p42836n44166
3087D66066170n78804n15900k83623j05438j141701j419639m61579m52957m35295o16646
3096.6D60054588o38771m13704p66296r82552o63643m74166q65670p07397m58374l49808
3106.2D53734207k69623r58213j127129p06940p85599o03828j09787o06651j201515
3114.9D47364922r96132n51758k44370p74002j120071l53127l24211j282882j123505
$$ plain form
3049.4 490195427 489892960 489528923 488788261 488206367 487569084 486635246 485786400 484923363 484024315 483313332
3059 483313332 482827682 482595634 482200966 481145477 480066795 479420700 479227066 478812523 477998085 477376404
3068.6 477376404 476532440 476098328 476033707 475471725 474704857 474154930 473832245 473278847 472610893 471850243
3078.3 471850243 471479454 471047211 470042267 469575272 469015808 468153152 467353172 466610336 466066170
3087 466066170 465487366 464971466 464687843 464582405 463440704 462021065 461559486 461106529 460671234 460054588
3096.6 460054588 459415817 459002113 458235817 457253265 456589622 456115456 455249786 454542389 454084015 453734207
3106.2 453734207 453464584 452506371 451379242 450672302 449886703 449282875 449173088 448566437 447364922
3114.9 447364922 446368790 445817032 445572662 444798660 443678589 443325462 443001251 441718369 440594864
3123.6D40594864o53038r03130r05990o20194l29628q03680p91168n21508j179046
3132.3D33887482o23131k16446j030159j058846o17637o20728q67881j152611q67310
3141D26832733k37884p64923j006928r38950j250534p67898o29654n97992n69420q08563
3150.6D19259987o54755o32934r33113j257172r01718m56162m41055p68929j271362
3159.3D11942787j040954o85425p39060p56569n99632m14505n59959j131897j463623
3168D04551163j217881q99963o60324m18053n82695j177520r89304n44701o44302r40933
3177.6C96475487j027603n67208q64753p66564k97317n92842p32651j430207j321983
3186.3C88874359o72188n22384k40860o42281r14993r98345j365661j434860q58117
$$ plain form
3123.6 440594864 439941826 439038696 438132706 437512512 437182884 436379204 435588036 435066528 433887482
3132.3 433887482 433264351 433047905 432017746 430958900 430341263 429720535 428852654 427700043 426832733
3141 426832733 426594849 425829926 424822998 423884048 422633514 421865616 421235962 420637970 420068550 419259987
3150.6 419259987 418605232 417972298 417039185 415782013 414880295 414424133 413983078 413214149 411942787
3159.3 411942787 410901833 410216408 409477348 408720779 408121147 407706642 407146683 406014786 404551163
3168 404551163 403333282 402433319 401772995 401354942 400772247 399594727 398605423 398060722 397416420 396475487
3177.6 396475487 395447884 394880676 394015923 393249359 392952042 392359200 391626549 390196342 388874359
3186.3 388874359 388202171 387679787 387438927 386796646 385881653 384883308 383517647 382082787 381224670
3195C81224670m22515m41475l29514n81207o99425o22215q24509j341247r45893O1875
3204.6C75078545m08554p82166o30913p06711q42743r68437o83365o51054q45985r18045
3214.3C67640572n09224m88930o93398l14865r60159j361580m98047m37889p66601
3222.9C61609879q06199q66661m11415k07138n23529o69708p49169o47850q45031o12755
3232.6C55270424o84281j298370o14700l14980o70318p05605n65796o19240p24296
3241.3C49072838m30451o63375o97365n44777m72222n11741j032181j074677o66847
3249.9C42979202l84102o80809n39550k10572o58912j221848j104851l51562n82733
3258.6C37244263n85862n06248p26852m01268p96891o29730m40597p19147m94270m72374
$$ plain form
3195 381224670 380802155 380360680 380031166 379449959 378750534 378128319 377303810 375962563 375016670 375078545
3204.6 375078545 374669991 373887825 373256912 372550201 371707458 370739021 370055656 369404602 368558617 367640572
3214.3 367640572 367131348 366642418 365949020 365634155 364673996 363312416 362814369 362376480 361609879
3222.9 361609879 360803680 359937019 359525604 359318466 358794937 358125229 357376060 356728210 355883179 355270424
3232.6 355270424 354586143 353287773 352673073 352358093 351687775 350982170 350416374 349797134 349072838
3241.3 349072838 348642387 347979012 347281647 346736870 346264648 345752907 344720726 343646049 342979202
3249.9 342979202 342595100 341914291 341374741 341164169 340505257 339283409 338178558 337826996 337244263
3258.6 337244263 336658401 336152153 335425301 335024033 334227142 333597412 333156815 332437668 331943398 331471024
3268.3C31471024m75731n59540q75778q99277l24326m73823o44341l82538n64270l99665
3277.9C25871735o24657o92940l85704j51100l60374j038399p52259l87802k12288
3286.6C21266212l92684n61028j95847l31840n12810m42142l11585n18627k39620k43550
3296.2C17516479j199512o71329J98898l8815o76784r67083k44999J73969k87857m88434
3305.9C13314533n79834p20157m02890l13625n60551p33375m23489k70309p50218m21428
3315.5C08138657j54210l03096n29938r96437n29270R2926J28479l22399q47798m64859
3325.2C04212055m37546q55751m60376l66326l12309k91061q01278m56123n03788p55215
3334.8B98972282k77233l06091l28980n66120p44857l27836j98516m12064m13933p02305
$$ plain form
3268.3 331471024 330995293 330435753 329559975 328660698 328336372 327862549 327218208 326835670 326271400 325871735
3277.9 325871735 325247078 324554138 324168434 324017334 323656960 322618561 321866302 321478500 321266212
3286.6 321266212 320873528 320312500 320116653 319784813 319272003 318829861 318518276 317999649 317760029 317516479
3296.2 317516479 316316967 315645638 315844536 315805721 315128937 314161854 313916855 314090824 313802967 313314533
3305.9 313314533 312734699 312014542 311611652 311298027 310737476 310004101 309580612 309310303 308560085 308138657
3315.5 308138657 307984447 307681351 307151413 306154976 305625706 305718632 305847111 305524712 304676914 304212055
3325.2 304212055 303774509 302918758 302458382 302092056 301779747 301488686 300687408 300231285 299727497 298972282
3334.8 298972282 298695049 298388958 298059978 297493858 296749001 296421165 296222649 295810585 295396652 294694347
3344.4B94694347q08258p8754k99511o46725m87480o16321o65894p15275l33996j97658
3354.1B89844475m19655p25346o25133j98136k99568n06687p97367m51393l84064l76072
3363.7B85061054k84519r03091o45352o79645p62902p08160n71613J02386k45514n96924
3373.4B79765720p12890m89788l44658n19867j50814n28908j108856j041088m05197
3382.1B74463654K81314J58616m67282p90901o23550k76852k842j85223q7223j10607
3391.7B72359104l35464l41454n91774l86143j28288l49541o51798j60541J45836j18981
3401.3B69440956K3041l76072j26629M86794J6079m02737l12767l98960n43213m215
3411B67802277M59652K99911n60093p68700k60334j77078o1321j1406J93539l12023
$$ plain form
3344.4 294694347 293886089 293807335 293507824 292861099 292373619 291757298 291091404 290376129 290042133 289844475
3354.1 289844475 289424820 288699474 288074341 287876205 287576637 287069950 286272583 285821190 285437126 285061054
3363.7 285061054 284776535 283873444 283228092 282548447 281785545 281077385 280505772 280608158 280362644 279765720
3373.4 279765720 279052830 278563042 278218384 277698517 277547703 277018795 275909939 274868851 274463654
3382.1 274463654 274744968 274903584 274436302 273645401 273021851 272744999 272742157 272556934 272469711 272359104
3391.7 272359104 272023640 271682186 271090412 270704269 270575981 270226440 269574642 269414101 269559937 269440956
3401.3 269440956 269463997 269087925 268961296 269448090 269464169 269061432 268748665 268349705 267806492 267802277
3411 267802277 268261929 268561840 268001747 267233047 266972713 266795635 266734314 266722908 266916447 266604424
3420.6B66604424l81909M81110L30238j63670O7959O59180p4501k94590K57988P9193
3430.3B67565422K1610K12193N80082K60277N41725M6768n74493L75785J09711J37920
3439.9B69277000K78931L51238M44966M25033R27887N58472K41718k63500J82819L06950
3449.6B72731514O3057P09686L27034O07186P30438K89955M50153P26185N99728l1033
3459.2B77203903L26500O45924N38349M98123P69882O80828L14789J98651J66244J236954
3468.8B82580147J083221L71723J97812J62868Q14343P89623R72938Q40073N70259
3477.5B88383007J97926j32714N57747R35440R79958N09243O00395Q51631R97372R10778
3487.2B94790783Q9397M94442R98822R21783R07993Q93689O66236J009598P49951j06125
$$ plain form
3420.6 266604424 266222515 266703625 267033863 266870193 266938152 267597332 267522831 267228241 267486229 267565422
3430.3 267565422 267587032 267799225 268379307 268639584 269181309 269228077 268653584 269029369 269139080 269277000
3439.9 269277000 269555931 269907169 270352135 270777168 271705055 272263527 272505245 272241745 272424564 272731514
3449.6 272731514 272794571 273504257 273831291 274438477 275168915 275458870 275909023 276635208 277234936 277203903
3459.2 277203903 277530403 278176327 278714676 279212799 279982681 280663509 280978298 281176949 281343193 282580147
3468.8 282580147 283663368 284035091 284232903 284395771 285210114 285999737 286972675 287812748 288383007
3477.5 288383007 288580933 288448219 289005966 289941406 290921364 291430607 292031002 292882633 293880005 294790783
3487.2 294790783 294880180 295374622 296373444 297295227 298203220 299096909 299763145 300772743 301522694 301416569
3496.8C01416569O01940M92039Q50982J040230Q68759J454335N63621J99375M44336
3505.5C07932186J539459J418667O01597P30038N70659J307354P95384J153316Q94337
3514.2C16942997k04773Q07648R18464J065674R34773O11152O62766J067200R14115
3522.9C23720016j23863R40590J683960J685295L01628k56309J271095J905022J329651
3531.5C32457085O88781J333847J033822J541290Q87718l49808J362686J017838Q95653
3540.2C40868912J141815J254082J091461P94411O47239p9117J214028J188354K225952
3548.9C50347137J613656O14280J513520N3215J643257J236267N18684J305275Q90503
3557.6C59735794J746368Q18978N91926P52221J438980J239242J056099K525597o65589
$$ plain form
3496.8 301416569 302018509 302510548 303361530 304401760 305270519 306724854 307288475 307487850 307932186
3505.5 307932186 309471645 310890312 311491909 312221947 312792606 314099960 314895344 316048660 316942997
3514.2 316942997 316738224 317545872 318464336 319530010 320464783 321075935 321738701 322805901 323720016
3522.9 323720016 323596153 324536743 326220703 327905998 328207626 327951317 329222412 331127434 332457085
3531.5 332457085 333145866 334479713 335513535 337054825 337942543 337592735 338955421 339973259 340868912
3540.2 340868912 342010727 343264809 344356270 345150681 345797920 345718803 346932831 348121185 350347137
3548.9 350347137 351960793 352575073 354088593 354141808 355785065 357021332 357540016 358845291 359735794
3557.6 359735794 361482162 362301140 362893066 363645287 365084267 366323509 367379608 369905205 369239616
3566.2C69239616J07842J126938J602707L722076K088738J593971K044868K129174
3574C83655930J131782J748695K343369R42001K093468J430588O48155J239967J833611
3582.6C97067566K066040J409340K908096L95928p64237K183266J240692L587074K852326
3591.3D12946091J939583J079750R91554K101288r94034K389297L459511R10568J722985
3600D26546593Q42857K278023K750397J599350J510620J972236J854592L96919L329658
3608.7D43081245o07338L25051N910301P60269O08635L050575q85086L415375L155670
3617.4D58814697k38456K134285R34638R61991L109093K843132K064552K072449J139679
3626D73836060J215057L496170k256279n707054N192947N829201M550209R0294p35550
$$ plain form
3566.2 369239616 369347458 370474396 372077103 375799179 377887917 379481888 381526756 383655930
3574 383655930 384787712 386536407 388879776 389821777 391915245 393345833 393993988 395233955 397067566
3582.6 397067566 399133606 400542946 403451042 403846970 403082733 405265999 406506691 410093765 412946091
3591.3 412946091 414885674 415965424 416956978 419058266 418064232 420453529 423913040 424823608 426546593
3600 426546593 427389450 429667473 432417870 434017220 435527840 437500076 439354668 439751587 443081245
3608.7 443081245 442473907 442798958 448709259 449469528 450078163 453128738 452243652 455659027 458814697
3617.4 458814697 458576241 460710526 461645164 462607155 465716248 468559380 470623932 472696381 473836060
3626 473836060 475051117 478547287 476291008 470583954 475776901 481606102 486156311 486246605 485511055
3634.7D85511055L232269L186798J735154K64930J434861K230491J974182J211968
3642.4E00781708P95326J560822J671142K800026k204170j696930M783783m33006q75435
3651.1E07183266J709709M655113L155785K646866K566261n201912L570518M958802
3658.8E25244408J199188J668968P30629J303825P67823Q52546J423645J292000K664871
3667.5E37147903j00669j885910k37122l008919L354035O360740M212685n339127j1318702
3676.2E29184914N662994Q288078M134636j231765J143722K872429J209297L62015
3683.9E51626320K38266O3743K942505M357262q293114k279892N910492l349457K322464
3692.6E53538589M775315M10499J670113N40466k15110Q87069K72103J699524M52346
$$ plain form
3634.7 485511055 488743324 491930122 493665276 493930206 495365067 497595558 499569740 500781708
3642.4 500781708 501577034 503137856 504808998 507609024 505404854 503707924 508491707 508058701 507183266
3651.1 507183266 508892975 513548088 516703873 519350739 521917000 516715088 520285606 525244408
3658.8 525244408 526443596 528112564 528843193 530147018 530914841 531767387 533191032 534483032 537147903
3667.5 537147903 537047234 535161324 534924202 531915283 535269318 541630058 545842743 540503616 529184914
3676.2 529184914 534847908 543135986 547270622 546038857 547182579 550055008 551264305 551626320
3683.9 551626320 551864586 551928329 554870834 559228096 550934982 548655090 554565582 551216125 553538589
3692.6 553538589 558313904 558724403 560394516 560934982 560719872 561606941 561879044 563578568 564030914
3701.3E64030914m677658N49278M236908N80559M74282O52999J346932J534729p301178
3709.9E61427765K483864K237434q101158M852142L943291J105728M67606R19304k51694
3718.6E69084282k495384K562332L921280m923477k790261M939728J268807l37830
3726.3E71229477k395706O5765K631645M30985L822098m708100n637474P309990p89642
3735E71959038o763115J221733K893143O93206J721955J617088k502174L060760Q426285
3743.7E82327919j0413628j2310104R915047M693565L325424m773254r253845R112129
3751.4E72623253m173775l372307O668549N437126L443756n208931J468544L164826
3759.1E80051041p033921N54314M021721J036606K68478J897583l100891k665024L051682
$$ plain form
3701.3 564030914 559353256 559902534 564139442 564720001 565194283 565847282 567194214 568728943 561427765
3709.9 561427765 563911629 566149063 558047905 562900047 566843338 567949066 568416672 569335976 569084282
3718.6 569084282 566588898 569151230 573072510 568149033 565358772 570298500 571567307 571229477
3726.3 571229477 568833771 568899536 571531181 571962166 575784264 571076164 565438690 572748680 571959038
3735 571959038 565195923 566417656 569310799 570004005 571725960 573343048 570840874 573901634 582327919
3743.7 582327919 571914291 559604187 569519234 574212799 577538223 572764969 563511124 572623253
3751.4 572623253 568449478 565077171 571745720 577182846 580626602 575417671 576886215 580051041
3759.1 580051041 573017120 573571434 577593155 578629761 578898239 580795822 577694931 575029907 578081589
3767.8E78081589L085022p64885n983010K146035K912254R80415N62668l90968Q16383
3776.5E81445503j81541J637687l80325n023651J834641J220474R39369J418228k371826
3785.2E80538559n95512J409530J323242N41993q25768j65253M17443N29480o03371
3793.8E82570343k18811Q35915l812600j603050K852745J958580J775856n900421o149063
3802.5E72309494M401321L463288L630104L494186q044319k042084M714547J340103
3810.2E83266640J38244J76850j67008J056443L762931l579788j1478233N304184M731254
3818.9E83211517K116928j175193j1971894L512192M829788J922150J561394j168404
3826.6E82838478k869987J498756K352219K043228o85845p271118L123169N262756
$$ plain form
3767.8 578081589 581166611 580401726 574418716 576564751 579477005 580457420 581020088 580629120 581445503
3776.5 581445503 581263962 582901649 582521324 577497673 579332314 580552788 581492157 582910385 580538559
3785.2 580538559 579943047 581352577 582675819 583217812 582392044 582226791 582644234 583173714 582570343
3793.8 582570343 582351532 583187447 579374847 577771797 580624542 582583122 584358978 578458557 572309494
3802.5 572309494 576710815 580174103 583804207 587298393 579254074 577211990 581926537 583266640
3810.2 583266640 583404884 583581734 583414726 584471169 588234100 584654312 573176079 578480263 583211517
3818.9 583211517 585328445 584153252 572181358 575693550 580523338 582445488 584006882 582838478
3826.6 582838478 579968491 581467247 583819466 585862694 585176849 577905731 581028900 586291656
3834.3E86291656n653152M87022N492173r183388k793579O710853k321815J249084
3842.1E80278854M923020k682572k339859K358666J286735J96762P11098j519089J236802
3850.7E84450417K254142p656746J739083r624520K533226Q742257n27764l55377K108459
3859.4E83663177J584054J205406m704438M07982L779908o277199k242928M241791
3867.1E81657753L426285L520508o521759n931740M142341M667740J292305p629661
3874.8E78623772J258773L593827L94439J535378J035347o137047k956505N282631
3882.6E82630615P46308Q33702K094726r148597K739868L953056O84395K112808l121872
3891.2E83525009n702972K993469K841759j147347J046334O60095R44366r56116o944656
$$ plain form
3834.3 586291656 580638504 581125526 586617699 577434311 574640732 581351585 579029770 580278854
3842.1 580278854 585201874 582519302 580179443 582538109 583824844 584021606 584732704 583213615 584450417
3850.7 584450417 586704559 579047813 580786896 571162376 573695602 582437859 581910095 581554718 583663177
3859.4 583663177 585247231 586452637 581748199 582156181 585936089 579658890 577415962 581657753
3867.1 581657753 585084038 588604546 582082787 576151047 580293388 584961128 586253433 578623772
3874.8 578623772 579882545 583476372 583870811 585406189 586441536 580304489 577347984 582630615
3882.6 582630615 583376923 584210625 586305351 577156754 579896622 583849678 584534073 586646881 583525009
3891.2 583525009 577822037 580815506 583657265 582509918 583556252 584216347 585160713 584204597 577259941
3899.9E77259941N172653K79770l873291M304161l505287j176453K166748J707116
3907.6E82335358J304931m82368N73845j97716m14734l0785j63345P30324R43184k178497
3917.3E82420197k342530K900772j17416k539978J955490J070747M11911j740608j853866
3926E80164719J688423N91888P057j260566m76647J590882j583481k81906J243629
3934.6E81683998J94054R59053K49748o38695m66842q6403O62040r01985k410164J457177
3944.3E80701981J548080l51410m61655j384582Q73146j70250j365890K196235O20346
3953E82206001m79355J21727l55339j56173m8218P26890p88116l39508K08015j772956
3962.6E79322968K11143J514664R08622m62265q33511N61180n77965q47473J80970
$$ plain form
3899.9 577259941 582432594 582712364 578839073 583143234 579637947 578461494 580628242 582335358
3907.6 582335358 583640289 583157921 583731766 583534050 583119316 583088531 582925186 583655510 584598694 582420197
3917.3 582420197 580077667 582978439 582861023 580321045 582276535 583347282 583759193 582018585 580164719
3926 580164719 581853142 582445030 582452087 581191521 580714874 582305756 580722275 580440369 581683998
3934.6 581683998 581878052 582837105 583086853 582448158 581981316 581894913 582556953 581654968 579244804 580701981
3944.3 580701981 582250061 581898651 581436996 580052414 580925560 580755310 579389420 581585655 582206001
3953 582206001 581726646 581848373 581493034 581336861 581288643 582015533 581227417 580887909 581095924 579322968
3962.6 579322968 579534111 581048775 581957397 581495132 580661621 581222801 580644836 579797363 579978333
3971.3E79978333r7771J02959L1433J87683K47230j87340J54915o3362o4125P26776
3980.9E81016731L83225p00608n03311K17476k05078o87K97394k89078m85572j57967
3990.6E79572525L56598j96037j89476j05172l19557Q12760M24041J31417O22978l17345
4000.2E80792732
$$ plain form
3971.3 579978333 579880562 579983521 580014954 580202637 580449867 580262527 580417442 580354080 580289955 581016731
3980.9 581016731 581399956 580699348 580196037 580413513 580208435 580207748 580505142 580216064 579730492 579572525
3990.6 579572525 579929123 579733086 579543610 579438438 579118881 579931641 580355682 580487099 581110077 580792732
4000.2 580792732
##END=$$ End of the data block
