##TITLE=$$ Begin of the data block
##JCAMP-DX=5.00 $$ ACD/SpecManager v 10.08
##SPECTROMETER/DATA SYSTEM=Varian
##DATE=04 Dec 2012 13:37:08
##DATA TYPE=INFRARED SPECTRUM
##DATA CLASS=XYDATA
##ORIGIN=
##OWNER=
##NPOINTS=3735
##FIRSTX=399.26403809
##LASTX=4000.35498047
##MAXX=4000.35498047
##MINX=399.26403809
##MAXY=70.03510284
##MINY=26.86805534
##XFACTOR=1.0000000000
##YFACTOR=0.000000100000000
##FIRSTY=54.51063538
##DELTAX=0.96440572
##XUNITS=1/CM
##YUNITS=TRANSMITTANCE
##XYDATA=(X++(Y..Y))
399.3 545106354 526052399 531506233 536883392 534982376 533036652 529469032 530063362 529221802 529134712
407.9 529134712 530265541 530049248 528509483 532099991 541472702 539671783 528729591 525231819
415.7 525231819 527631035 523227806 509239807 500119858 511100960 524446487 525826797 528111916
423.4 528111916 532915726 526302719 525712624 532319565 534123306 530031281 526359558 528737259 528464546
432.1 528464546 524783897 522644043 522469292 524101143 522216721 520165672 522396317 523922119 523321075
440.7 523321075 524207458 523828011 521079025 525551872 529475021 525420914 521976433 521935234 523710442
449.4 523710442 522487068 519603195 523165779 526460228 525613480 525187798 526120567 525769653 522252731
458.1 522252731 523567276 526434021 526112289 523559113 523112450 520513077 518923912 520445557 517678375
466.8 517678375 513251801 511695213 515145340 516091614 508293991 500650864 506838722 514302902 514190483
475.5 514190483 512788010 511431236 509158821 510715904 512149124 512161179 510430717 505878983 503352356
484.1 503352356 505916481 507385063 507634697 507685242 506357574 507009888 508305359 507231216 506069870
492.8 506069870 508692169 510602798 510704803 508379860 500421104 498006783 500015373 499996681 499089279
501.5 499089279 497346497 498656693 497138710 494284134 493128166 491392365 489195251 489226799 493203316
510.2 493203316 494602203 494121094 490792885 485895386 484818420 482884483 480857544 481667786 481389771
518.9 481389771 480385208 480247688 479732170 479990578 478764763 478211441 478969269 476755486 477614708
527.5 477614708 477168427 475509491 475270500 475810280 477597733 476933632 478755455 479856186 479905853
536.2 479905853 481811028 481124992 482258949 484650040 485303726 484658852 485478363 488029671 488809929
544.9 488809929 488584251 487943001 488141289 488467216 486958122 483226280 480590134 482210312 485189018
553.6 485189018 486740227 485593948 483942184 483787613 483951607 482640915 481193047 480812950 479780273
562.3 479780273 479228706 478621902 479459343 479996300 477368431 474515076 471516342 469696846 468605843
570.9 468605843 468178482 467774734 467089844 466910133 466893654 469941521 471659241 469714279 466671982
579.6 466671982 467193298 470176353 471985397 474281311 474493294 476450882 480290604 482153854 482472153
588.3 482472153 481762924 482000542 481187897 479483795 480400238 482564087 483582191 484437828 485594292
597 485594292 486352921 486696205 485609398 484989166 483897934 482564659 483191261 485118904 486556473
605.6 486556473 486587601 487513123 487491837 486690254 485677872 485282516 486805763 486835899 486613007 486701393
615.3 486701393 488068695 490528221 493354645 496807365 498500252 498017120 495917587 496524887 498607788
624 498607788 499636002 500964394 503223152 506804581 507943039 509102592 510717316 510999947 510797081
632.7 510797081 509433403 509173584 509025841 510011101 512520027 515387993 517603493 517616119 517635460
641.3 517635460 517420959 516731300 515560646 515100403 515767517 516612053 518818550 521003418 523459854
650 523459854 523734360 522061615 521753044 520791969 520033989 520426064 520346718 519436836 520727959 523636856
659.7 523636856 524321136 523773651 523182449 522932663 521789780 520714836 521493759 519998512 512210350
668.3 512210350 518266754 523930626 525943680 525919685 524932632 523173256 522546196 522478561 522891960
677 522891960 523944588 524883766 526446991 529191437 531542702 532306862 531317215 529288216 527901497
685.7 527901497 526568108 525811386 526865234 528923302 530684395 531253891 531800156 532120552 531155739
694.4 531155739 529418716 527230148 525082016 523852806 525344810 528068237 528672028 528658028 528239517
703.1 528239517 526091232 525301666 525247574 523985825 522745628 521990089 522827988 524010315 525303307
711.7 525303307 527788239 529499588 528739319 527076797 527063828 527146835 527280006 527821350 527803268 529141426
721.4 529141426 531404114 533751106 536241951 538696404 539865990 540430717 541534767 542293243 544398422
730.1 544398422 546408081 547818298 551491051 554612579 555626335 556832771 557870293 558054924 557817917
738.7 557817917 557771149 558797226 560171013 560978355 562642708 565814667 567132950 565589943 565227089
747.4 565227089 564645424 561782494 560091553 559678268 559963989 560948753 561684723 562185478 561228180
756.1 561228180 559625702 559412651 559441299 557560539 555319023 554638710 554848595 556720657 558768883
764.8 558768883 559575386 560127678 560573463 561500473 561736183 561008453 561313782 562888985 564870491
773.5 564870491 567545204 571526794 574908676 577135887 578745117 578737526 578606758 578989182 579292412
782.1 579292412 579921951 581456223 583666191 585789223 587886543 589477806 590575981 590535393 589502296
790.8 589502296 588985596 589031143 589496765 590065727 591726990 594922638 597539253 598928032 599772415
799.5 599772415 599782753 599457779 599376984 599081764 599613571 601214523 603561974 605894203 608246040
808.2 608246040 610377083 610170097 609616127 609455948 608744545 608311081 608488884 608885269 609652939 611637497
817.8 611637497 612945099 613922310 614699478 613330116 610676498 608334694 607068939 605605774 604793129
826.5 604793129 605311890 606338425 607263260 606926231 604891243 601708870 599782448 597869949 594806709
835.2 594806709 592838631 592620697 593424950 593929443 593671341 592739029 591161308 588724709 585800819
843.9 585800819 583140411 581236534 580335083 581167984 582941170 583013611 583166161 583558006 583089294
852.5 583089294 582811928 581145859 579007530 577882957 578456688 579656334 580174789 582052612 584049110
861.2 584049110 584603233 584905396 585721664 585652580 584301987 584645691 587273712 590757446 594500198
869.9 594500198 598590393 602461891 605480652 607140999 607602158 607852287 607306557 607384148 608099937
878.6 608099937 609344215 610599442 611055756 611915359 611529045 610706253 608602982 604698601 601972275
887.3 601972275 600513191 599305954 597724686 596773262 596064911 595152626 593810616 591859856 589974861
895.9 589974861 587298317 584415054 582500610 581575279 580683098 580457840 580339012 578467979 576406021
904.6 576406021 574398270 571775169 568442230 565112267 562546310 560409584 559130173 558221588 556684761
913.3 556684761 554282608 551713257 550126076 548208694 544755325 541681175 539438095 537386131
921 537386131 536050148 535725937 536299095 536551094 535955162 535373726 535103836 534363632 533212090 532693329
930.7 532693329 533445206 534744606 535169373 535742378 536957130 537510529 537507248 537839546 537829437 536687279
940.3 536687279 536113625 536584549 537981453 539973145 541041183 541705666 541325264 539988213 538816872
949 538816872 536749992 534615135 532994003 531260719 529518890 528005333 526055832 523332825 520540199
957.7 520540199 517466202 513698692 509762001 505962410 501161728 496762543 493504829 489773560
965.4 489773560 485916634 481892815 477376060 472324677 467024498 460837555 454046555 447718010
973.1 447718010 441679420 435529861 429253998 423639297 417515259 411147842 404426117 397844315
980.8 397844315 391654320 385482445 380430870 374700584 369621239 364917641 360974770 357657967
988.5 357657967 353919716 351782303 349595184 347758408 345701065 344251785 343164482 342122116
996.2 342122116 342060776 341753769 342495956 342708244 343200760 343032227 342083664 341100082 340050201 340677299
1005.9 340677299 340429192 340577126 339716187 339316177 339268227 337251205 336477547 334546127 333206291
1014.6 333206291 332017555 331158066 331316338 330876999 330977058 330375099 330578499 330286522 330461273
1023.2 330461273 330388451 330013084 330605927 330102921 330520401 330392952 330643005 330993767 331868591 332073288
1032.9 332073288 330979729 331170044 329736595 329602203 328593140 327762718 328888741 329169731 329527245
1041.6 329527245 328536949 328824043 328253632 328190269 328159599 326994057 326762924 326057129 327242889 327158737
1051.2 327158737 328278351 329421997 330676727 332991028 332667847 334617882 336152267 339041176
1058.9 339041176 342178612 343697624 346164055 348378639 351516266 352896233 354373169 355441895
1066.6 355441895 356562843 357270126 356694984 356678658 353946075 351836014 349928284 347647743 344948959
1075.3 344948959 343061752 342624626 340433235 340132942 339969215 340781212 341737289 342765923 344198837
1084 344198837 344898872 347365685 349009018 351893883 352868309 353727722 356486588 357448616 359470863
1092.7 359470863 361364326 363286476 363713531 364828262 366454391 367048645 368380203 368560638 369062271
1101.4 369062271 368613167 368995743 369184532 369429817 371417580 372578812 374407005 374967155 376099167
1110 376099167 377396736 378754768 379880981 379407158 380749702 381611938 382412796 382857399 383111076
1118.7 383111076 383646774 384192657 385731316 386943436 388588371 389399338 391152382 392339516 392700729
1127.4 392700729 393877831 394004745 395614510 397246170 398518829 398784523 398506699 398391647 397076187
1136.1 397076187 396548462 395991631 395360680 393566818 391805077 390212593 388719597 388060913 385802383
1144.8 385802383 384598808 383196411 382006760 381091156 379374123 377758942 375551872 374550858
1152.5 374550858 372921410 372200279 371336060 370489769 370807686 370454025 371165390 371120148 372481613
1161.1 372481613 373658371 374589119 376873093 379201469 382731323 385781746 389564590 392557945
1168.9 392557945 395678673 399082985 402637138 407791710 411838989 416088371 420169945 424908028
1176.6 424908028 429526939 433451614 437978325 441816406 446157150 450278168 453471336 456015129
1184.3 456015129 459099121 462554893 465796623 468804016 470705872 473199234 475339890 476996307
1192 476996307 478608055 479437637 480335426 481045876 481928902 482822456 483565178 484113235 484980736 486125450
1201.6 486125450 486688919 486796646 486359825 486610031 487224045 488247032 489332008 489942360 491354523
1210.3 491354523 492527275 493352585 493689041 493982315 494562263 494962769 495596085 495966949 496720734
1219 496720734 497463112 497750435 497518158 496871986 496260300 495207825 494157562 492737808 491780396
1227.7 491780396 491280518 490418129 489861526 489089355 488215599 487015152 486056747 485274124 484175110
1236.4 484175110 483512573 483084564 482825851 483039818 483801308 484312935 484706306 484415321 484419899 485128822
1246 485128822 485470161 486894112 488321953 489832268 491423492 492653770 493980637 494857826 495836182
1254.7 495836182 496439438 497340164 497926178 498006706 498856430 499719238 501133232 502448502 503294868
1263.4 503294868 503856239 503990173 504459686 505107880 505464172 505966606 507167091 508280640 509371414
1272 509371414 510634460 511648331 511933174 512034225 512684021 512802582 513121223 513849220 514611778 515879173
1281.7 515879173 516859283 517742996 518606529 519328346 519915848 520042114 520308342 521106415 521907768 522602501
1291.3 522602501 522998314 522989578 523442116 523699722 523124657 522633591 522284393 521974487 521770935 521837349
1301 521837349 522182159 522177582 521925697 522063141 522253189 521807442 521106415 520585823 520405960 520320511
1310.6 520320511 519782867 519309540 519131699 518826103 518567657 518199196 517501793 516915779 516228027 515607834
1320.3 515607834 515524292 515273933 515097580 515194626 515207748 515007477 514766731 514609642 513908043 513191795
1329.9 513191795 512687988 512358131 512026978 511449432 511493416 511085052 509820709 508674927 507800789
1338.6 507800789 507087059 506936684 507676392 507879181 508147011 508502617 508605919 508905258 509104538 509127808
1348.2 509127808 508571510 508418007 508837395 508816872 508377953 507859955 507485313 507192917 507229767 506751366
1357.9 506751366 505955849 505456390 504244766 502707634 501016159 500192223 500800552 500876312 500217209
1366.6 500217209 499284363 498046036 497735519 498442230 498405914 497868690 496433868 494010735 493087730
1375.2 493087730 493468018 493250465 492208862 492811241 493990059 494946442 495857353 496710587 497673759
1383.9 497673759 497954178 498404388 498657608 499212799 501386566 503292732 503857574 504271965 505156784
1392.6 505156784 504781532 502333565 500837097 502377853 502854576 501580658 500776672 501791115 503283501
1401.3 503283501 503966827 504384041 503976517 502659035 503306770 504144020 503996887 503314209 502961807
1409.9 502961807 502836304 502618370 502310753 502177238 501627769 500519676 499246178 497988663 497393532
1418.6 497393532 496111374 498608246 501619644 502658768 502251625 502255096 504257050 505132294 504594116
1427.3 504594116 503689651 501964951 500836792 501242447 502411041 502524605 502237701 501895752 500272636
1436 500272636 497111320 497613602 499805641 499826889 499410820 499231110 498733444 499283791 499223633 499367294
1445.6 499367294 498477097 496937103 495777512 495962524 495820732 493599701 491853561 490106430 489011612
1454.3 489011612 486325912 483444862 479540710 477387505 482399597 483879814 486470871 487360191
1462 487360191 487951164 488478928 485604897 488594398 491113091 495705566 500678253 507560616 513963051
1470.7 513963051 517104454 523578033 531280823 540589066 545430565 550430870 555962143 560083199
1478.4 560083199 563558235 565123672 567054214 569209175 571887817 573412514 574224892 574803314 574155502
1487.1 574155502 575257416 575014305 572026520 573270531 576963120 578515930 577884216 577038460 574556770
1495.8 574556770 571178322 573537750 573955841 572869568 573460617 572690277 571257935 570080185 568559189
1504.5 568559189 564513702 551701126 547727852 552277794 555501137 556500015 557026596 555224380
1512.2 555224380 552784882 551938934 548529053 545361671 541189270 542075272 546373901 546359482 539773598
1520.8 539773598 536283226 540350647 544039345 544937439 542894669 542412529 542540894 542645645 544455719
1529.5 544455719 545372734 543949661 542617416 539716339 537288055 539720764 540568352 540272751 538482018
1538.2 538482018 528549347 524977264 531333199 533268280 533664627 535489426 535496407 537345238 540733681
1546.9 540733681 542229424 541976624 540081444 541307755 544958878 546837769 547280312 545906563 547390175
1555.6 547390175 550347519 549663239 541880531 537454109 547764969 556791000 561024590 563329353
1563.3 563329353 563594093 563923264 566017189 567391853 567582588 565143394 563325768 567962036 571139526
1572 571139526 571958504 572002182 571829033 569656906 566160927 569357452 572307854 572978439 573175926
1580.6 573175926 573048477 572727394 572354431 571869125 571424065 570216331 569353828 568352470 566929283
1589.3 566929283 565355911 564548874 563580246 562464905 561050987 558855858 557949867 556673050 555321350
1598 555321350 553284035 551095161 548919487 546686821 545288391 542900238 541639061 539693718 536960220
1606.7 536960220 533939171 531056824 528533707 525750160 524170151 520930901 518134613 514665070
1614.4 514665070 511656075 507816963 499105988 500180206 499078941 496964989 493430748 490243263
1622.1 490243263 485424538 479382133 479738770 477914619 475444794 469998856 467422028 465823975
1629.8 465823975 462634850 460208473 456618767 454678879 450939064 443276329 440752144 441593742
1637.5 441593742 442360992 441708183 441710052 439920158 440004616 438182144 437228165 436342201 431917801 431936226
1647.2 431936226 430690384 433860512 434457970 435430984 435955048 429798470 427122574 430892487 436542473
1655.9 436542473 438232918 440542297 441715164 442993507 444265633 444553490 446572113 448008614
1663.6 448008614 451927795 454180145 456467628 458250961 458596458 459942474 461798248 465999374
1671.3 465999374 468675041 472418556 474712830 474822235 477706490 481753960 485915489 487396622
1679 487396622 489341125 491376610 494604340 496600342 492000465 493922958 501129913 507554626 510239372
1687.7 510239372 512161179 515395622 518478928 522201385 524824944 527408218 529358368 530745087
1695.4 530745087 529446106 533721962 538688202 541355782 540460434 540059433 546891212 551084404 551840019
1704.1 551840019 551452179 552356644 553496857 555532761 557287025 556715927 557180023 558817825 559526825
1712.8 559526825 559239464 557018356 556986008 558804550 558057518 556342087 562249680 566062698 567592430
1721.4 567592430 567889633 566709595 566176224 566080818 565261345 563633080 561782112 559317741 554011307
1730.1 554011307 550741463 548841248 544841843 535677223 527109680 527762680 525076370 519689903
1737.8 519689903 514200706 505917130 499207153 497525101 494569626 487945786 487310066 487895279 488764572
1746.5 488764572 490737991 494545364 502214279 508834190 520002365 531249008 543409309 554702110
1754.2 554702110 564421387 573987961 583816605 595927620 604592285 612413406 618161850 622849541
1761.9 622849541 630547218 636803970 641991348 645295410 648432922 650319748 651222687 654497681
1769.7 654497681 656455765 655426559 654427109 658626099 663266525 665178146 666194687 669117508
1777.4 669117508 670386887 670856934 670985489 670792007 673238831 675239105 676180954 675833893 676522369
1786 676522369 678256073 678480377 679121780 679426422 677881546 676699982 675365906 677763977 681279449
1794.7 681279449 681906815 681812744 683538437 684436874 683344116 682677841 683830109 684241409 685590897
1803.4 685590897 687056427 687248688 687951736 688220596 688043137 688229294 687896194 687236023 688211517
1812.1 688211517 689780426 690744247 691496658 691726303 691949005 691877594 692440033 693057404 692685852 692671661
1821.7 692671661 692003555 692360916 692413635 690326920 691720505 693514023 693618546 691519318 689693680
1830.4 689693680 692288284 694377060 694676743 695113449 695805740 695841675 695334549 695424042 696406097 696404495
1840.1 696404495 696178207 695595703 695330200 694023743 690647125 693880005 696109619 695472488 695681610
1848.7 695681610 696605148 697523193 697617416 697487106 697416611 697471619 697564163 697685547 698012466 697725677
1858.4 697725677 697994766 698421936 698313446 698182678 698123398 698049164 697683105 697083206 696311722 695694962
1868 695694962 694551468 695096512 696971588 698337097 698876953 698714828 698657227 698553238 698934402 699128799
1877.7 699128799 699079208 699208298 699404373 699755249 699336929 699225082 698796082 698635330 698977280 698642731
1887.3 698642731 699058304 698335419 697853012 699398956 700022125 699787903 699238129 698317261 698194580
1896 698194580 699285278 699722672 699870377 699949265 699835510 699973679 699861679 699739456 699182205 699100571
1905.6 699100571 698924866 698179932 698204880 698572922 699037857 699612732 700351028 700043030 699520950 699037247
1915.3 699037247 698608246 698619232 696643524 697085342 698778305 698868027 698469925 697346039 697701950
1923.9 697701950 698925476 699146652 698679581 698498993 698286819 697903595 698096237 698558960 698797684
1932.6 698797684 698360748 698502045 698833008 698588181 698149796 697578430 697476120 697257690 697189331 696048889
1942.3 696048889 695587158 697454987 697935257 697698364 697687988 697603531 697413177 697062836 697279968 697626648
1951.9 697626648 697724762 697827225 697898483 697751923 697946625 698084183 697816467 697306213 696787491 696933670
1961.6 696933670 696889038 696824265 696951828 697050018 696738129 695987320 696524734 696975403 696697845 696521149
1971.2 696521149 696406250 696411591 696647949 697127151 697291412 697294006 697248611 697107162 696744385 696167908
1980.8 696167908 695747681 695575562 695801086 695943756 696027374 696154938 696353760 696283875 695815506 695838089
1990.5 695838089 695056305 693391876 693529816 694469452 694905548 695402527 695808334 695951691 696156693
1999.2 696156693 695745010 695047836 694410019 693829803 693347473 693275528 693778076 693934937 694089432 694380875
2008.8 694380875 694442520 694033661 693318176 692953415 692456589 691864395 691436844 691163025 691348114 692008362
2018.5 692008362 692303619 692182007 692213135 691523666 690569687 689969406 689639053 689517517 689520416 689903107
2028.1 689903107 690216904 690443573 690451584 690191116 689426651 688535080 688240051 687755585 687438507 687693863
2037.7 687693863 688259735 688862762 689098206 688614273 687871246 687426071 686745224 686325226 686054459 686025314
2047.4 686025314 686297989 686655273 687339630 687653275 687800674 687450027 686862717 686043549 685086060 685030746
2057 685030746 685153732 685741730 686327057 687108459 687917099 687628937 687109833 685866394 684811020 684660492
2066.7 684660492 684645615 684755859 684969177 685387650 685966721 686736069 686663055 686221008 685914307 685412979
2076.3 685412979 684977264 684474182 684667130 685085144 685332260 685719528 686250000 686661072 686380997 685807648
2086 685807648 684975739 684316406 684062195 684203796 684744415 685349274 685884552 686092529 686381760 686250229
2095.6 686250229 685692444 685014572 684218903 683958511 684139099 684700012 685284424 685905991 686483231 686516266
2105.2 686516266 685931244 685051804 684492187 684040985 683928070 684057312 684250412 684697952 685078354 685276031
2114.9 685276031 685321655 685206223 684658966 684020081 683294296 683102722 683735657 684140549 684734116 685337372
2124.5 685337372 685489349 685430908 685169907 684565811 683849792 683420563 683240509 683414459 683504944 684038925
2134.2 684038925 684689713 684620590 684527512 684264069 683821411 683377075 683377304 683333893 682944412 683099289 683646545
2144.8 683646545 684245300 684266357 684078064 684000473 683708572 683318329 683016510 682879028 682728882 683174896
2154.4 683174896 683712997 684110336 684373856 684148941 684062500 683671875 683260193 683263016 683289490 683364792
2164.1 683364792 683617325 683753662 684039688 684726639 684799728 684634247 684312592 684091721 684112778 683713531
2173.7 683713531 683813934 684254227 684649658 684847107 685196152 685620956 685451584 685199814 684754333 684582291
2183.4 684582291 684703522 684961472 685163727 685376816 686065979 686290131 686234055 686106796 686031799 685844498
2193 685844498 685541763 685550232 685386734 685452881 685722046 686325912 687027664 687452164 687395935 686836243 686714859
2203.6 686714859 686657333 686724701 686579361 686514816 686828384 686920242 687350006 687489471 687675095 687660370
2213.3 687660370 687161255 686954803 686609802 686643677 686992035 687207718 687453537 687756958 687819672 687916794
2222.9 687916794 688091507 687712631 687405548 687299957 687228241 687209854 687449341 687798462 687956390 687998962
2232.5 687998962 688034210 688326340 687885590 687246857 686953125 686935196 687309647 687356339 687634659 687740402
2242.2 687740402 687935944 687990417 687337799 686950455 686786652 686908340 686499100 686179123 686507950 686998978
2251.8 686998978 687687759 687770996 687474442 687082748 686856461 686510925 686381683 686414490 685982742 685969315
2261.5 685969315 685991516 686329803 686922379 687072983 686950378 686605835 686136856 685992126 686188965 685877228
2271.1 685877228 686252365 686558914 686243362 686611633 686971436 687040939 686463699 686292038 686031876 685352402
2280.8 685352402 685453568 685615311 685754471 685619583 685789490 685796051 685581055 685523529 684978333 684679794
2290.4 684679794 684447021 684772568 684752655 684301147 684377975 684598923 684588547 684018250 684293060 684036484
2300 684036484 683606262 683534164 682975388 683075485 682635651 682908173 683122253 682416000 682131805 681594543
2309.7 681594543 681209412 680477448 680181656 680076294 680085831 679960937 679754486 680008469 679121552 678727264
2319.3 678727264 677840576 676931152 676979904 676301498 675924683 675735703 676794891 677186203 676426163 675728531
2329 675728531 674895477 673752975 672554016 673097000 672839432 672681503 672825775 673355789 674351273 673824844
2338.6 673824844 674241257 673556824 672392349 672711716 673251343 673148346 672608032 673910294 674920273
2347.3 674920273 675545654 676159363 675739059 674455414 672966919 672014847 671586609 670681839 668203430
2356 668203430 667054749 667735977 667662430 667702103 667990875 669250946 669388428 667457428 666853867 668079071
2365.6 668079071 668271866 668073502 669098587 669990387 671127472 671956787 671745148 671379089 671711044
2374.3 671711044 672193375 672381744 673027496 673911743 674696732 675090866 675444412 675990982 676231918 675999374
2383.9 675999374 676055756 676445160 675935974 675499954 675471497 675425415 675766830 675790024 675768738 675668869 675278625
2394.6 675278625 675038528 674861908 674801712 674681396 674250946 674058990 674391861 674417801 674261932 674051819
2404.2 674051819 673752899 673488312 673089142 672895660 672564926 672389832 672204056 671982956 672341309 672588425
2413.8 672588425 672608795 672362213 671929245 671187134 670684128 670603333 670363388 670493088 670421677 670383606
2423.5 670383606 670474625 670283356 669819870 669154663 668981094 668559265 668112640 667856674 667848434 668200150
2433.1 668200150 668065796 668188171 668282013 667907410 667182922 666317368 665967178 665805817 665863647 665827332
2442.8 665827332 665595551 665644073 665710678 665364914 665006409 664941711 664496536 663978043 663951187 663974762
2452.4 663974762 663724136 663679886 663549805 663004227 662770844 662577362 662440109 662267227 661807632 661670456
2462.1 661670456 661588974 661519394 661692657 661697922 661539001 661205902 660632477 660347137 660059357 659687881
2471.7 659687881 659620285 659516678 659549637 659545593 659364853 659100342 658682404 658152542 657726898 657959213
2481.3 657959213 658221207 657885742 657203445 657111969 657505951 657401581 657223282 656967468 656729050 656265182
2491 656265182 655552979 655269089 655326080 655584717 655544281 655537872 655524216 655265427 654854507 654379959 654414139
2501.6 654414139 654282455 653861465 653394394 653465729 653907852 653693771 653756027 653918915 653691177 653395157
2511.2 653395157 653047714 652773666 652562637 652296219 652070160 652191696 651965485 651749039 652028656 651925201
2520.9 651925201 651458511 651426468 651702347 651255035 650888062 650842667 650656509 650542221 649989243 649521942
2530.5 649521942 649343567 649246902 648869553 648355331 648405762 648314819 648121414 647986908 647690887 647482986
2540.2 647482986 647560577 647564392 647086182 646842117 646741180 646246338 645879822 646145554 646473312 646231537
2549.8 646231537 645769424 645338974 645128326 645112534 645017319 644698181 644148941 643783035 643702164 643584900
2559.5 643584900 643382874 643050919 643025894 643350601 643047867 642662201 642438736 642054520 641750641 641344604
2569.1 641344604 641454010 641476364 641181107 641035080 640622177 640251236 639754791 639632988 639419327 638755875
2578.7 638755875 638787155 638883286 638586845 638230324 638313408 638442917 638251152 638135452 637815323 637380066
2588.4 637380066 636861343 636751442 636936836 636806374 636460686 635866165 635636673 635630302 635330086 634923477
2598 634923477 634598541 634340668 634291840 634523773 634164810 633576736 633491325 633402519 633325043 633159180 632582359
2608.6 632582359 632085495 631664810 631049957 630816650 630706215 630555687 630520439 630062447 629627495 629504280
2618.3 629504280 629526825 629454803 628792114 628035469 627603111 627500572 627542419 627114639 626548805 626193428
2627.9 626193428 625749779 625456009 625059013 624541168 624457626 624198036 623567009 623113632 622830658 622619019
2637.6 622619019 622178116 621530304 621257858 621112022 620713463 620187836 619600945 619263802 619048958 618722153
2647.2 618722153 618399773 618186722 618127060 617978020 617645988 617226982 616736526 616027565 615795059 615851860
2656.9 615851860 615217209 614917564 614852753 614438744 614078026 613725128 613483925 613072014 612459030 611748123
2666.5 611748123 611351624 611316338 611096153 610955925 610798149 610347137 609802666 609578857 609450417 609434700
2676.1 609434700 609446564 608854294 608305893 607859764 607595634 607522926 606926193 606392059 606423950 606413498
2685.8 606413498 605945320 605822563 605837975 605297165 604805603 604611168 604531059 604287643 603917885 603509598
2695.4 603509598 603150826 602999344 603042107 602813873 602305527 602052231 601728973 601731758 601468506 600589943
2705.1 600589943 600113602 599814034 599838791 599634857 599163361 598791504 598356514 598101654 597667999 597353859
2714.7 597353859 596818581 596249466 595996475 595490379 595159264 595121574 595151329 594573288 593859787 593767319
2724.4 593767319 593821564 593454361 592677612 592587852 592311554 591489258 591318169 591340332 591037254 590330162
2734 590330162 589924431 590169945 590304985 590178986 589891319 589176216 588497581 588263931 588072510 588117180
2743.7 588117180 588149757 588111725 588375702 588227043 587514381 586867599 586387825 585936241 585634537 585439987
2753.3 585439987 585245514 585090828 585166359 585018311 584248352 583458748 582848129 582742310 582943916 583074303
2762.9 583074303 582933273 582364235 582076416 581872787 581737900 581452904 580799065 580256920 579776649 579477272
2772.6 579477272 579130096 578953323 578528481 578004303 577994690 577705688 577286568 576716042 576464615 576267738
2782.2 576267738 575584869 575070267 574132843 573197098 573148308 573643074 573573837 573000603 572412224 571252174
2791.9 571252174 570093842 569359665 569296646 569391365 569412804 569471245 568469315 567434959 566865234 565993233
2801.5 565993233 565179672 564523087 563839378 563185234 562614365 561791954 561189690 560905876 560255814 559331131
2811.2 559331131 558346634 557453423 556513939 555529861 554684372 553704910 552517204 551442680 550367165
2819.8 550367165 549360008 548570786 547414207 545963974 544472008 542958221 541471062 539945831
2827.6 539945831 538369751 536498108 534628944 533112411 531569672 529297752 526629639 524179039
2835.3 524179039 521974907 519860725 516346741 512079887 508332291 503713951 498314438 492484398
2843 492484398 485675392 477818565 468978233 459548416 449790916 440168991 430475426 420969009 413018036
2851.7 413018036 406883965 402615776 400370140 400663567 403339157 407171555 411698914 417076225
2859.4 417076225 422843056 428574333 434201508 439320869 443598633 446726952 449295387 451297951
2867.1 451297951 452333221 452635269 452347069 452079735 451777344 452013474 452964630 453788490 454832878
2875.8 454832878 455632324 455872955 456010437 455988922 455650673 455078201 454596863 453973923 452885590 451390343
2885.4 451390343 449661598 447945213 446318398 444590492 442938499 441127052 438634758 436336517
2893.1 436336517 434347916 432190056 429841614 427125320 424689445 422444267 419726448 416655655
2900.8 416655655 413759613 411194305 408420181 405194511 401629105 397882004 393551865 389139595
2908.6 389139595 385011597 379972267 374052773 367688408 361310692 354921875 347916222 340559998
2916.3 340559998 332951813 325306625 318040543 311643295 305915184 300586414 296521816 294241810
2924 294241810 292644386 291275196 291292229 292552719 294887905 297829571 301165085 305510635 310393524
2932.7 310393524 315636711 321433411 327757607 334210587 340703468 347040367 353179398 359394684
2940.4 359394684 365763588 371943054 377193642 382025719 386325150 389933395 393429489 396540527
2948.1 396540527 398851166 400179100 401347809 402074280 401990929 402255402 402554665 402976418 404182510
2956.8 404182510 405925484 408110962 410280762 412730789 415850639 419060936 422761002 427076759
2964.5 427076759 431780815 436603241 440749817 444928703 449337769 453426247 457526970 461696777
2972.2 461696777 465481377 468852692 472118111 475172997 478045998 480280113 482514801 485289230
2979.9 485289230 487599525 489688225 491567421 493348846 495415993 497252426 498449936 499425125
2987.6 499425125 500590363 501499481 502429962 503309784 503849373 504012871 503877296 504147110 504170647 503436127
2997.3 503436127 502417641 501329002 500287285 499311028 498013573 496245880 494574890 492895584
3005 492895584 491598854 490833015 489948730 489443779 489264259 489554825 490306435 490821915 492116356 494226799
3014.6 494226799 495937233 497278519 498792915 500669746 502095718 502812881 503475990 504095039 505023689
3023.3 505023689 505703239 505887146 506129494 506009865 505984344 506228218 506316833 505733833 505211945 505482368
3033 505482368 505172272 504664612 504398193 503937149 503400078 502991943 502903671 502563095 501907387 500997314
3042.6 500997314 500311165 500220528 499752350 498596306 497711639 497466660 497037201 496237717 495408401 494704208
3052.2 494704208 493839111 493054657 492483406 491659546 491299477 491058998 490315552 489109993 488108482
3060.9 488108482 487711830 486963348 486326523 485956306 485529976 484821472 483959160 483600426 483068428 482315102
3070.6 482315102 481505585 480891533 480503769 480229568 480040779 479397163 478837738 478227272 477245293 476252556
3080.2 476252556 475631447 475113945 474551239 474463387 473948936 473120003 472464333 471956711 471489830 470930786
3089.9 470930786 470465469 469318733 468285942 467578468 466898232 466469231 465669289 465327110 465225563
3098.5 465225563 464784622 464097404 463127022 462266769 461610031 461171989 460643501 460028725 459391289 458673172
3108.2 458673172 457743492 456879234 456271286 455691833 455134315 454286118 453724937 452958717 452094536 451829758
3117.8 451829758 450875893 449756966 449145203 448556519 447337685 446166687 445965805 445619774 444865227
3126.5 444865227 443765335 443075294 442928505 442083130 440626640 439298630 438703156 438388710 437818794
3135.2 437818794 437119675 436359444 435567055 434981613 434236145 433161354 432597656 431638641 430481911
3143.9 430481911 429965973 428939362 427807083 427186241 426585464 425950928 425167999 424571609 424421577
3152.5 424421577 423207588 421683464 421254349 420573044 419950638 419092751 417587395 416555176 415950165
3161.2 415950165 415402870 414547119 413676529 412777290 412042007 411282234 410046577 409409103 408984947
3169.9 408984947 408158646 407305641 406195183 405022964 404636345 404268761 403167229 402099648 400843964
3178.6 400843964 399806099 399436531 399065971 398047638 396970100 396500664 395699158 394900970 394133949
3187.3 394133949 393157883 392368507 391670723 391222992 390500450 389404831 388125916 387146454 386510391
3195.9 386510391 385833244 385339241 384642105 383984718 383611145 382981911 381605721 380691986 380631790 379982681
3205.6 379982681 379015045 377942276 377026253 376122589 375247650 374833794 374439583 373997307 372813606
3214.3 372813606 371662407 371378746 371364632 370837708 369665680 368829842 368161011 367635231 366919785
3222.9 366919785 366237946 365862617 365035629 364046402 363191414 363432541 363603172 362257004 360798798
3231.6 360798798 359791451 359106941 358521538 358067017 357524796 356780968 356168976 355499382 354655952
3240.3 354655952 353928413 353375168 352632141 352189522 351909447 351304703 350545502 349525108 348424416
3249 348424416 347547913 347111969 346780090 346268234 345301437 344423485 344070778 343578949 342829399 341914101
3258.6 341914101 341461601 340650673 339677734 339399605 338861008 338492126 337831192 337070847 336815033 336366577
3268.3 336366577 335767365 335218086 334630661 333536301 332950859 332741394 332121239 331770744 331460953
3276.9 331460953 330652733 329439468 328814468 328366776 328055496 327953262 327057800 326117821 325605888
3285.6 325605888 325490532 325013351 324379578 324439049 324251137 323486748 322757988 322470932 322052078 321617851
3295.3 321617851 321075516 320331879 320138397 319938583 319429455 318874149 318585205 318133392 317716103 317800503
3304.9 317800503 317246170 316397247 315986137 315551224 314934750 314415493 314058094 313797588 313205929 312366943
3314.6 312366943 312098560 312070427 311856670 311382904 311040268 310657883 310022049 309499683 309116135 309193344
3324.2 309193344 308657608 307778168 307145329 306425171 305992641 305358753 304889317 304260750 303726273 303489494
3333.8 303489494 303211651 303147678 302616673 302353382 301871243 301198559 300447960 299445629 299456921 299161758
3343.5 299161758 298458652 297755032 297217178 297194977 297056179 296999645 296400375 295382004 294657040 294241962
3353.1 294241962 293559799 292895355 292389984 291418190 290886135 290471821 290214844 289851398 289157600 288616962
3362.8 288616962 287535954 286968975 286792297 286409626 286072254 285517845 285010948 284559345 284136982
3371.4 284136982 283601322 283273888 282747498 282036781 281730061 281348095 280792866 279999199 279275646 278722630
3381.1 278722630 278293324 278094406 278112125 277669258 276780720 276622047 276549397 276289654 275556469 275083656
3390.7 275083656 275631294 275117149 274263248 274431400 274654427 274201412 273275547 272860641 272835197 272684975
3400.4 272684975 272723694 273158512 273060608 272479610 271758518 270833569 270826893 271340656 271157303 270920219
3410 270920219 271070118 271188755 271049538 270363064 269912510 269943466 270027313 270400887 270305519 269513836
3419.7 269513836 268680553 269091072 269812260 269684219 270077877 270358982 270454540 270779743 270840492 270583992
3429.3 270583992 270370655 270667534 270933437 271529064 271875267 272037430 272325516 272086830 272318897 272546253
3439 272546253 272460575 272514782 272807484 273457184 274426804 275133419 275068569 275044708 274900589 275278015 275939102
3449.6 275939102 276608162 277251930 277132893 277722492 278891144 279489613 279299965 279592323 280430069
3458.2 280430069 280818653 281633358 281889114 281969624 282100525 282254181 283300266 284496250 285473061
3466.9 285473061 285822010 286271267 286440697 286940575 288066216 288566151 289386196 289863148 290247936
3475.6 290247936 291205292 292042465 292331734 292564526 293219414 293675156 294297543 294846115 295945606
3484.3 295945606 296846466 297370014 298215027 298355274 299226933 300232849 300994720 301918678 302861176
3493 302861176 303855743 304227829 304948158 305568085 306314678 306915569 307121201 308221626 309305038 310042286
3502.6 310042286 310767307 311755810 312778530 313876820 314686928 315599079 316337719 315999908 316945305
3511.3 316945305 317954788 318916836 320054245 320658875 321806183 322515068 323567162 324689140 325435028
3520 325435028 326359787 327135544 327669792 327844887 329839516 331848335 332382126 332765961 333145447 334396095
3529.6 334396095 336059341 336832314 337444496 338836174 339917641 340889206 341413383 341953545 343497505
3538.3 343497505 344294739 345070610 346201782 347561913 348712997 349517097 349937134 350205269 351739006
3547 351739006 352860298 355012436 356741219 357740669 358896217 358384209 359802475 361129341 362436790
3555.6 362436790 364182320 365236740 367106133 367854767 368301697 369007950 370791779 372025375 372433929
3564.3 372433929 374474182 373877296 374484978 375600090 377191772 381235390 383862038 385744095 387660904
3573 387660904 389625092 390973358 392824059 394347534 394821510 397418976 398820190 399529953 401760864
3581.7 401760864 403955383 404855003 405315094 408789940 409579315 407840767 410132332 411575241 415015564
3590.4 415015564 418391266 420514641 421347389 422569466 425196075 424872475 427523193 430633698 430939369
3599 430939369 433507614 434842033 436006889 438642426 440586205 442616920 445094185 446451340 445704842
3607.7 445704842 448501205 448431435 449514275 456200714 456839600 455461502 458360405 458664055 462780151
3616.4 462780151 466287384 466209488 467558823 467258949 468778534 472465858 475487785 477681274 479505730
3625.1 479505730 480589485 482055893 486500854 486127777 479561272 483467255 488201523 492700920
3632.8 492700920 493782387 493071938 495960312 499071808 501002045 501622772 502766953 504524841 506141090
3641.5 506141090 506947746 508483276 511002274 512638855 515071487 511474113 509211426 514145622
3649.2 514145622 512374802 511808434 514945297 520739098 524303894 527156372 530299110 523931732
3656.9 523931732 527015343 532157097 533377533 534987946 535918121 537723007 538132591 538903465 540047302
3665.6 540047302 540862045 544462280 544825859 543018456 543587227 539410973 542206573 548891182 553205338
3674.3 553205338 548649559 538511047 542337685 550217056 554515877 552731895 553803596 557078552
3682 557078552 558701324 558791466 558687592 558777313 561251831 565083923 556804962 555334282 562476425
3690.6 562476425 559311790 560370636 564848404 565339470 566965790 567530289 567170372 568192329 568666000
3699.3 568666000 570728073 571950722 566821747 566504326 571105843 572257614 572148094 572155266 573874321
3708 573874321 575778809 568870354 572158546 574473724 565264320 570360374 574345779 575327682 575939407
3716.7 575939407 577213631 577938538 575080452 576609306 580981865 576920509 573815002 577877998
3724.4 577877998 577640762 576585655 574938889 575595207 578739967 579429016 583074722 579199066 574579353
3733.1 574579353 581765976 579039421 571830025 574111824 575953979 576546135 579439316 581638374
3740.8 581638374 578478661 581554108 590537071 579448853 566614189 575750084 580524712 585001945
3748.5 585001945 581634750 573994522 582884979 576762810 573309212 580338898 584574547 586727486
3756.2 586727486 582545319 584428787 587427750 581482849 581053619 584156036 585541687 585950470 588121223
3764.9 588121223 585683022 583345680 586453667 589057846 587540169 581684113 584326744 587183113
3772.6 587183113 588153000 589249763 588951111 589347954 589009247 590292511 588790359 583521767 585645905
3781.3 585645905 587167931 588803825 590218239 587439194 587110558 589095154 590193825 590006828 589675369
3790 589675369 590111923 590027237 589907875 589607162 590224190 591276321 587604637 585550804 587216072
3798.7 587216072 589222069 591957664 585085869 578136864 583456459 587413597 591112099 594481926
3806.4 594481926 586767616 584897842 589567337 590950279 591009979 591127205 591060905 592419205 595757065
3815.1 595757065 590506821 579369850 584983101 589515572 592341881 592153587 579523125 583058128
3822.8 583058128 588113289 590101624 592215385 591772537 588764381 589456291 591135826 592979279 592339630
3831.4 592339630 585336266 588563080 593422127 586758766 586793556 593373184 587378464 583625908 587605743
3840.1 587605743 584647827 587316551 592300110 589253616 587849884 590540886 591576767 591454659
3847.8 591454659 591759834 589894371 591044960 594106407 587022438 586473389 576455574 581105995
3855.6 581105995 590535088 590308151 589967155 591363678 592301483 593132439 588797188 590184631 593894882
3864.2 593894882 587394600 585125389 589762840 593532333 595634575 586934319 581309891 586725273
3871.9 586725273 592749176 594509354 587225189 588723373 591791611 591157265 592415962 594465408
3879.7 594465408 588594398 584752693 590016136 590464325 592082329 595668602 585095940 587061577
3887.4 587061577 590927582 591661415 594430122 591774292 585826378 588145256 591377563 590950127 591607056
3896.1 591607056 591641846 592038193 591785660 585357056 589416428 589923973 586776581 590813103 587722664
3904.7 587722664 586187630 587400970 589597893 591432419 590935669 591632729 591079063 590773773 591347504
3913.4 591347504 591243629 592206383 593128166 590081139 587677956 590746307 589629898 586714859 589828377
3922.1 589828377 591481934 591373100 589894485 588611450 589846306 590177269 590108757 588350677 587814598
3930.8 587814598 589817772 588597336 588545074 589898224 589493484 589838829 590183144 589933701 590287209
3939.5 590287209 590070724 590103416 589460526 586474228 587715454 590132790 590550537 590014915 587406158
3948.1 587406158 587980995 588237381 587075119 589064903 588896255 588356056 589389343 589718895 589212036
3956.8 589212036 588694153 589241486 588375702 588464775 588828392 587544518 588687363 589654083 589118271
3965.5 589118271 588991051 588930359 588820190 588651314 588766861 588939857 588280029 587265129 587179451 587603340
3975.1 587603340 587584877 587782860 588725319 588609505 588054352 588447647 588084221 587828865 588049355 588100967
3984.8 588100967 588473625 588841705 589343224 589076691 588093414 587492447 587515259 587902641 587648315 586784706
3994.4 586784706 586218987 586917114 588417244 588711967 588205681 588364182
4000.2 588364182
##END=$$ End of the data block
