##TITLE=$$ Begin of the data block
##JCAMP-DX=5.00 $$ ACD/SpecManager v 10.08
##SPECTROMETER/DATA SYSTEM=Varian
##DATE=04 Dec 2012 13:23:20
##DATA TYPE=INFRARED SPECTRUM
##DATA CLASS=XYDATA
##ORIGIN=
##OWNER=
##NPOINTS=3735
##FIRSTX=399.26403809
##LASTX=4000.35498047
##MAXX=4000.35498047
##MINX=399.26403809
##MAXY=68.72790527
##MINY=33.00702286
##XFACTOR=1.0000000000
##YFACTOR=0.000000100000000
##FIRSTY=56.03039551
##DELTAX=0.96440572
##XUNITS=1/CM
##YUNITS=TRANSMITTANCE
##XYDATA=(X++(Y..Y))
399.3 560303955 573992920 560930099 562142715 562519455 553600616 557931519 565843735 561609993
407 561609993 555674477 558657455 566463814 569165382 561728249 558633270 562515411 558688354 557092781
415.7 557092781 562837524 562432823 555870361 552942467 553816566 559178200 562405472 561065750 561433601
424.3 561433601 563291092 564570465 562300987 556232262 552872810 552524567 548484116 549033394 554107933
433 554107933 552098389 550456696 553877373 556949158 557142830 552591743 547688599 546148224 546959229
441.7 546959229 547600822 547907982 553913040 560648079 562584457 560653801 559337120 558434219 556412086
450.4 556412086 556273613 558261604 559277687 560029030 560179253 558861198 557742996 562910347 568980827
459.1 568980827 566426048 559035301 555140953 552673531 551434669 549631653 549130898 553587303 555211372
467.7 555211372 553635826 554956932 553991852 547191849 538730392 539239731 539655457 537074509 539605255
476.4 539605255 542492371 542113609 541041679 540596504 545581169 552377815 554511719 549692459 544427872
485.1 544427872 543182869 541416206 538787498 535298004 536195068 540765381 542802773 542809143 543056450
493.8 543056450 542997169 540901604 540018616 539497643 537438736 537323456 536385345 533183937 532138481
502.5 532138481 535885353 537405052 534823456 531649475 529095764 531017418 532611008 529146118
510.2 529146118 525855141 525109558 525815811 525801926 524317703 524329872 523651161 522364006 521995316 517292786
519.8 517292786 513414192 513956871 513394051 512382240 513456116 513925285 514121933 515890121 514687157
528.5 514687157 513366966 514839134 514484825 512290306 511751060 512486153 512414474 514253311 516525536
537.2 516525536 517895126 519658737 521326675 523628578 524336014 524441566 524292679 522139053 520177231
545.9 520177231 520063515 521555710 522401199 523614426 525603218 525625801 525060081 525521431 524898682
554.5 524898682 521622849 518390350 517264442 516487770 514852295 515047302 516335602 517143974 518750992
563.2 518750992 517545471 515085068 512762299 509311028 506910973 503180428 500761604 500853310 501234932
571.9 501234932 502002983 502698097 503368683 503515244 504255829 504779129 504382248 504028130 504360466 504840927
581.5 504840927 505531845 506959648 509489441 512900848 514713058 516846962 518208351 517307663 516384773
590.2 516384773 515470276 514908257 514646072 515070000 516552658 518684082 520056190 521596527 522799110
598.9 522799110 520796928 519859848 519875755 518102036 516583824 516524658 516935997 517203064 518922768
607.6 518922768 520886841 522751617 522587662 520861549 521100464 521741600 521248283 519841537 520644112
616.3 520644112 521928406 522795830 525383530 527519226 529739037 531092110 532388344 532994881 531835480
624.9 531835480 531858330 532171974 532683716 534821739 537243309 538136482 539940643 543524055 545709000
633.6 545709000 545304565 544244728 544230919 542645149 540606346 540842590 542713928 544203720 544366913
642.3 544366913 546093826 547711334 548655853 549789124 549269714 548069649 547099037 546936264 547017593
651 547017593 546888351 547148399 548377914 550118904 550932503 551100197 550223274 549808006 550268211 550136185
660.6 550136185 550367279 549638214 548396759 549305229 550854759 551696548 549434471 538693504 546629982
669.3 546629982 553428726 554909401 554393311 553582993 553206978 552345085 550748138 550522728 552162628
678 552162628 555366020 557278709 557917976 558618889 558991547 558471718 556738205 555910721 555866280 556159058
687.6 556159058 556638336 557673988 559829025 561265678 562371979 562843704 561684761 559533424 557398911
696.3 557398911 555864525 553915520 552708130 552549438 552355499 552572670 553894386 555727196 556065559
705 556065559 555084572 553952713 552299652 549990044 548463821 548716774 549068794 549948311 552438736
713.7 552438736 554191208 556491394 559617157 560164337 559774170 558417702 556666298 557100830 557113380
722.3 557113380 557238693 559218788 562746811 567010574 570650673 573184586 574572067 575413322 575378494
731 575378494 575314217 575660820 575014000 574640160 575663071 578525658 582393150 585092583 586637573
739.7 586637573 586928062 586317482 586176643 586323586 585115013 582856979 582147064 582058907 583095818
748.4 583095818 585961761 586802101 585925827 585642891 584879875 582871284 580459137 578803940 578359413
757.1 578359413 577804604 576876793 577102852 577623329 577951736 579375343 580486374 579632988 578758850
765.7 578758850 578930511 578597069 578075485 578282127 579623260 581820374 584040909 586998405 590191765
774.4 590191765 592999153 595246811 595888138 596049919 596484566 597122154 598130684 599100761 600339737
783.1 600339737 602414970 604365120 605895653 608065109 610048981 610668716 610429916 609970856 609067154
791.8 609067154 608896561 609004097 608824692 609949150 611636467 614339027 617414131 619862289 621672096
800.5 621672096 621924667 622257462 622051888 621598930 621611137 621481819 622258492 623841133 625929108 628281670
810.1 628281670 630247993 630117683 628996010 628737450 628467674 627422638 626610107 626950378 626963959
818.8 626963959 628440628 630220795 630752563 631441956 631053543 630669365 629329147 627264786 624827576
827.5 624827576 621898842 620359077 619436417 619821396 620814781 621006737 620599861 620153923 619243851
836.1 619243851 616886368 614586411 612196083 609021492 606190300 605868301 606450806 606402245 607708130
844.8 607708130 608847694 609007607 608529396 606937523 603987656 600793228 599321938 598549614 598254128
853.5 598254128 598503418 599215317 601292381 603162804 603630180 603137550 601848030 599943275 598399239
862.2 598399239 598768044 600257874 601195641 603412018 606275406 609010811 613365822 617166100 619698830
870.9 619698830 620755844 621179657 622499847 622461433 621978683 622230721 623831406 625966339 627506790
879.5 627506790 628810081 629004555 629186020 629472008 628268661 625276108 622877922 620776596 618501968
888.2 618501968 617208290 616306114 616357765 615923920 615647736 615159683 612997742 610948410 608842850
896.9 608842850 606797256 604296303 602809410 602240715 600961952 600409431 599934502 599426880 598522110
905.6 598522110 597026138 595380669 592947350 590274620 587719269 585073776 582377892 580344734
913.3 580344734 579101334 578009872 576250725 574053307 572140007 569950943 567593918 564935379
921 564935379 562260590 560548325 559205513 557998276 557171364 557560730 559180031 560064507 560641594
929.7 560641594 560493088 559397850 559110107 558911781 558529282 558076210 558270874 559746628 561224442
938.4 561224442 563045197 565078773 566709213 567794533 568227119 568647423 568307152 567404099 566442223
947.1 566442223 565407219 565008202 564388618 563297844 562041283 560510330 558719444 556593170 553395920
955.7 553395920 549205704 545209160 540635757 536060333 532742310 529666061 526164856 523021927
963.4 523021927 520074539 516573372 512286758 507004471 500972099 494969521 489326172 483255730
971.2 483255730 477353630 471355515 466114235 462038078 456899147 451039543 444240494 438154488
978.9 438154488 431833496 424379539 417699203 411740341 407719917 403964500 400439301 397015533
986.6 397015533 394196205 391747856 389050980 387218933 384470177 382843742 381415939 380063744
994.3 380063744 379496002 379050522 379566002 379501457 379951134 380374107 381003761 380927277 380145073 379889145
1004 379889145 379318047 379027748 377611542 376997414 376775360 376766663 376816406 375560722 374949532 373658295
1013.6 373658295 372737312 371790657 371166115 370678368 369629631 369764023 369819489 370001144 369944534 371231766
1023.2 371231766 371952438 372111320 372984772 372999535 373849335 373816490 374584541 375215607 375713997 376897278
1032.9 376897278 377035751 378174667 378534584 379320030 379809952 379595947 379458275 378903198 378955154 378819084
1042.5 378819084 379497871 379213524 379339333 379563293 379830322 381272812 381872330 382851372 382906189 383681068
1052.2 383681068 384550591 386421967 388653908 389087715 390971603 392674255 395562477 397992744 400457649
1060.9 400457649 403965530 406946907 410419579 413201866 416319351 417779503 419726677 421188927
1068.6 421188927 420255737 419442101 417517166 416295433 413455429 409359818 405272026 401815643 400415421
1077.2 400415421 398543854 396904526 395234871 395616188 396228714 397255554 399129715 400432281 402549057
1085.9 402549057 403490906 405845184 406942253 407003860 408744087 410675163 412676086 413867569 416517410
1094.6 416517410 418588104 420430145 421763992 422256393 423287392 423283463 423603439 422591591 422321243
1103.3 422321243 423260155 423854332 425162811 426123848 427266121 428424759 430136147 431094971 431832275
1112 431832275 432332191 432224159 432910652 433858452 435716209 437015038 438530197 440206413 441822281
1120.6 441822281 442696609 442515831 443426781 443431740 443959465 444644623 445288467 446968460 448519058 450091896
1130.3 450091896 451473083 453779106 454593849 454830437 454653282 453175049 452132759 450150795 448952866
1139 448952866 447616882 446078720 444624825 442804985 441180954 438821373 437569313 435340080 432513466
1147.6 432513466 429913673 427606239 425847740 423701363 423132820 422132492 421810455 421464005 420988808
1156.3 420988808 421073112 420126877 420037041 419626579 420522614 422078362 423287468 424630699 426975021
1165 426975021 431180000 434605331 438256149 441692963 445221214 448245163 451059113 454597778 458240166
1173.7 458240166 462959862 467016373 471399536 476223297 481208534 485728378 489199486 492662773
1181.4 492662773 496042595 499667892 502108498 504510536 506803131 509027863 512125435 514659233
1189.1 514659233 517210541 519601402 522027130 523517227 524093704 524377441 524214478 524496384 524688225
1197.8 524688225 525450745 525840836 526181984 527542191 528574028 529265709 529744186 530501060 530531158
1206.5 530531158 530430603 530822639 530789719 531027718 531656761 533062325 534657516 536386528 537792130
1215.1 537792130 538632927 539536629 539804344 539590988 539019394 538762016 538589630 538234024 538295403 538096962
1224.8 538096962 537820358 537668686 537383118 536352081 535234032 534397926 533521996 532868195 531473503
1233.5 531473503 530355225 529645500 529076538 529148865 529336281 529842415 529876366 529603119 529208488 528770027
1243.1 528770027 528242340 527768974 528041763 528233032 529033318 530386925 531837463 533601227 535246353
1251.8 535246353 536333427 536717720 536826019 536669807 536670074 536735458 536652908 537117271 538568039 540387077
1261.4 540387077 541532364 542665024 543623734 544103851 544257050 543882561 543666954 543461800 543522339
1270.1 543522339 544493637 545549049 546923103 548652191 549554253 550185738 550624886 550357552 549713326
1278.8 549713326 548898582 548816910 549354134 549796677 550324211 551121979 552288704 553512001 554531746
1287.5 554531746 554988098 554910278 554338341 553532600 552625160 551653481 551610718 552228241 552521820 552753868
1297.1 552753868 553126907 553634949 553795853 553177338 552317352 551240616 550166397 549610176 549419823
1305.8 549419823 549666138 549829140 549690971 549853134 550282516 550626030 550212708 549205360 548314552
1314.5 548314552 547605095 546620216 545421791 545043983 545236282 545407295 545690460 545961227 546012077 545391464
1324.1 545391464 544379768 543577614 542655640 541314163 540040131 539168053 538466797 538056908 538148804
1332.8 538148804 538332520 537754288 536988220 536863174 536351318 535461197 534305687 533642273 533880386
1341.5 533880386 533621292 533555222 534136124 534959831 535489044 535876465 536038208 535495110 534808731 534022675
1351.1 534022675 533446007 532912750 532397614 532268219 532322769 532704086 532718239 532688599 532727509 532155075
1360.8 532155075 531279259 530239525 528488579 527342682 527107315 526974792 526889267 526560440 526394234
1369.4 526394234 527110634 527500839 527546539 527115059 526146011 524928055 523986816 523552437 522920647 523247070
1379.1 523247070 524168739 525218773 526369820 527457809 528543091 529452820 530232353 530686951 530980949
1387.8 530980949 531506691 532660294 533647919 534532433 535446320 536015549 536457520 536174393 536624489
1396.4 536624489 536265907 534939346 533466377 533134232 533553581 533307877 533320961 533373947 534016991 535130005
1406.1 535130005 535277710 534952278 534203568 533526840 532444763 531198997 530024910 529729805 529892807
1414.8 529892807 529524689 529755325 530286293 531247292 530529594 530190811 530991173 530658340 530169373 529658928
1424.4 529658928 530399818 531305733 531979675 532592545 532665291 532937698 532779655 532812386 532228279 531369362
1434.1 531369362 530834236 530109863 529045944 529068871 530429916 530899887 531481018 531981583 531938896 532038345
1443.7 532038345 531355820 530700188 529394341 528758316 527713547 527474556 527923622 527141571 527004242
1452.4 527004242 525888748 525747032 524940834 522511406 520094872 517909050 519835358 519719391 521196632
1461.1 521196632 521880684 523021622 524652672 523417358 525030174 526467247 529568558 532643585
1468.8 532643585 537386475 542493286 545774918 551809578 556727791 562421951 565877838 569741631
1476.5 569741631 573463707 576703529 579516068 580849991 582941742 584388580 585998306 586668320
1484.2 586668320 587288895 588990250 589673271 590961456 592504654 593573914 593015175 594126740 595157928
1492.9 595157928 594591255 594414940 594202919 592379150 592400627 592353668 592138290 593407936 594236374 593677940
1502.5 593677940 593395538 593443069 593540688 590035172 584772797 584634895 584656639 584163513 584431000 584180412
1512.2 584180412 583068466 583492393 583154755 581822128 580444069 577561226 578301964 579038849 577365036
1520.8 577365036 576290054 576978645 579069290 580920944 580734940 580477905 580516014 579427948 578792953
1529.5 578792953 578322220 577082443 576262627 575403709 574806671 576115761 577045784 578037300 579933624
1538.2 579933624 578906021 571550064 573181419 573735275 573210526 574056854 573845558 573314819 575242844
1546.9 575242844 577359657 578629837 579341621 579495888 580656013 581606636 581964989 581077690 581063271
1555.6 581063271 583597221 585782509 585127373 585232887 586837845 590143661 592215843 593692894 594448471
1564.2 594448471 594054832 593814735 594363976 594876060 595022240 594621468 596318245 598801003 599637375
1572.9 599637375 600059891 601071434 601868248 599089470 597867775 598209572 597767372 597718697 597948875
1581.6 597948875 598425064 598650551 598411407 598447189 598020210 597524147 596529961 595504646 593705063
1590.3 593705063 592008095 590912437 589834061 589125633 588373260 588205605 587237968 586309013 584996567
1599 584996567 583035889 581018448 578688736 577423897 575584717 573959999 572338715 571064758 569787865
1607.6 569787865 568033867 566134796 563387108 562003937 559691467 556932716 553868408 551974716
1615.4 551974716 550878410 544730568 543919716 542699966 541293373 539108849 537459335 535168686
1623.1 535168686 529449577 527946892 526223717 525130501 521881790 518540344 516826935 515227356
1630.8 515227356 514350204 512552452 511953278 511447449 509328308 505178375 503740997 502341194 501479378
1639.5 501479378 501581192 500248718 500574379 499905968 500343742 501300240 499425468 499253006 497113571
1648.1 497113571 497857628 497972679 499100075 499877510 494006004 494677963 496731453 500326653 501935539
1656.8 501935539 503349037 504038315 505356598 506469498 507103081 508871422 508699951 511078224 512884407
1665.5 512884407 514729652 517109718 519485168 521939774 522100563 524467545 525757790 527581673
1673.2 527581673 529714012 531432877 531989250 533453522 536333618 538422661 541295891 543199921
1680.9 543199921 545457077 549077873 551716080 550310593 550117226 553444443 555531921 556908569
1688.6 556908569 559521446 562233620 565090103 567361832 569664268 572625885 575436211 573014030
1696.4 573014030 574875717 578021393 580480347 580615845 580249596 584830093 587996674 589785576 590513611
1705 590513611 591538315 592060089 592308426 593027763 593303413 593592834 594062309 595002136 596496468 597115250
1714.7 597115250 597605934 600323830 602286873 599211426 600743752 601956902 602109070 602232895 602016220
1723.4 602016220 601446228 601311150 601596947 601427803 600920219 600187988 597551041 594407616 593374863
1732 593374863 592311935 587205276 579039803 577831078 575958710 572739639 570544624 566759720 560797424
1740.7 560797424 559132080 558292809 554836655 552550011 552046394 552656441 553762817 556664810 561739273
1749.4 561739273 566495972 574858665 581420288 588162804 594957695 601213417 608015366 613863678
1757.1 613863678 619833794 624835892 629845505 634615250 638480606 642355042 646439209 649869080
1764.8 649869080 652012482 654333191 656602325 656542664 657175217 658974915 659592896 659633484 659933014
1773.5 659933014 661981735 664300003 664947662 666345901 667555466 668493118 669082718 668191681 668243866
1782.2 668243866 668476868 668750839 669027863 669902878 671356430 672233276 673117828 674066925 674332886
1790.9 674332886 674848175 673735428 672393723 673439178 673890457 673614578 674257736 675748672 676959076
1799.5 676959076 677145844 678271332 678617172 678425903 678488312 677981873 677690582 677357941 677367859 678212128
1809.2 678212128 679302368 679603119 680242691 681224518 681702271 681864624 681212616 680914383 680262299
1817.9 680262299 679553680 679681168 680178070 681285858 681860352 682867279 684213104 683190231 682491913
1826.5 682491913 683057861 683406677 683038406 680675125 680706558 682322159 682546997 683008652 684095993
1835.2 684095993 684848175 685340042 684968414 685126495 684688492 683938599 683082199 682955551 683607941 681927719
1844.9 681927719 683044815 684758224 685506210 685781250 685902252 686000900 685221024 684709320 684310608
1853.6 684310608 683879852 683586884 683801956 684497452 684895630 685689087 686259003 686705627 686559219 685908813
1863.2 685908813 685412750 684703979 684136505 683573074 683880844 683717957 683931198 685465927 686476593
1871.9 686476593 686931000 686734772 686382446 685771332 685346527 684988632 684408264 684302139 684605713 685443497
1881.5 685443497 685846100 686438751 687200699 686849213 686417618 686141891 686117783 685940399 684716721 684319458
1891.2 684319458 685092392 685606918 686144485 686695404 686807098 687279053 687087860 686761246 686225967 685526810
1900.8 685526810 685500412 685334549 685179596 685217972 685786057 686148148 686333847 686506271 686503983 686463242
1910.4 686463242 685866241 685635605 684953537 684747086 684842148 684568253 685509262 685539169 685445480 685958633
1920.1 685958633 686145401 686703186 686307297 685567703 685435944 685020599 684396515 684566345 684997711 684975281
1929.7 684975281 685227051 685723877 686102982 685967789 685742874 685291290 684763718 684469223 684194412 684018250
1939.4 684018250 683562393 683932495 684418488 683868103 684379807 685599594 685953217 685149460 684430695
1948.1 684430695 683988571 683561325 683267899 683414230 683796921 684181442 684772415 685127335 685492325 685554657
1957.7 685554657 685238037 684757538 684073105 683455582 682917099 682991791 683106766 683279724 683993759 684695282
1967.3 684695282 684955902 684873886 684776001 684287033 683669357 683050842 682803497 682853775 682793884 683172226
1977 683172226 683622360 684413528 684837418 684506760 684226227 683780136 683200684 682449036 681915817 681684799
1986.6 681684799 681951294 682316284 682592163 683627930 684288406 683956528 683589020 683345108 682789383
1995.3 682789383 682286606 682046280 681680222 681450348 681518707 681979599 682381821 682673492 682808609 682796555
2005 682796555 682750397 682007980 681252441 680736389 680214539 679878235 680002365 680503311 680862122 681096802
2014.6 681096802 681005783 680833969 680472717 680075989 679579010 679023590 678894348 678544312 678228683 678110428
2024.2 678110428 678368912 678717041 678926086 679090118 678639984 678294830 677855988 677504959 677280655 676992569
2033.9 676992569 676865845 676513214 676572189 676669388 677073517 677455826 677287521 677002792 676335449 676135864
2043.5 676135864 675852127 675346451 675070801 675047760 675320282 675516205 675691223 675671310 675942993 676054764
2053.2 676054764 676056519 675845032 675098114 674460678 673665543 673945999 674419632 674263153 674479599 674784393
2062.8 674784393 675591507 676055908 675497131 674838943 674503326 674048767 673808289 673845291 673728333 674148941
2072.5 674148941 674492035 674663467 674815292 675019150 675326080 675081711 674435730 673705750 673644180 673408890
2082.1 673408890 673184814 673684311 674023972 674371033 674516983 674917526 675126114 674725723 674404907 673999710
2091.7 673999710 673818741 673652878 673454819 673392410 673424301 673824615 674428482 674585571 674520035 674521179
2101.4 674521179 674291534 673884201 673118744 672985306 673098221 672925339 673173676 673613052 674455719 674697037
2111 674697037 674707336 674654465 674107056 673907089 673345566 672903976 672695465 672629395 672854004 673075256
2120.7 673075256 673606720 674061661 674165192 673936234 674016342 673832855 673151169 672534027 671959229 671973877
2130.3 671973877 672204285 672760696 673403168 673882217 673952026 673473816 673552475 673625717 673203812 672526779
2140 672526779 672176819 672096558 671950302 671932678 672141113 672939072 673319397 673402939 673422623 673093109 672829132
2150.6 672829132 672432404 672125015 671764755 671771240 671910706 672098999 672859192 673354950 673388367 673192215
2160.2 673192215 673201370 673087463 672668610 672336655 672220383 672366638 672506256 672762756 672878418 673102570
2169.9 673102570 673476639 673648376 673370895 673163376 673554382 673288040 672795410 672414551 672285080 672895889
2179.5 672895889 673504715 673924179 674163132 674525146 674608688 674514999 674268112 673801422 673691101 673496475
2189.1 673496475 673512573 673735504 674100876 674440918 674894562 675414581 675519257 675597153 675067902 674739227
2198.8 674739227 674729767 674573517 674536209 674433670 674661102 674658966 674922714 675325546 675676727 676318893
2208.4 676318893 676479797 676183014 675535965 675216751 675065689 674995728 674833984 674794006 675408401 675887604
2218.1 675887604 676492920 676490936 676297760 676385956 676121826 675736847 674947128 674619293 674780807 675038834
2227.7 675038834 675294266 675991898 676696396 676665039 677001495 676907806 676447372 676071701 675715408 675163803
2237.4 675163803 674633560 675217438 675664825 676162949 676591034 676721725 676974869 676557007 676069412 675460434
2247 675460434 675121002 674993057 674763794 674956894 675267715 675495224 675789490 676187592 676009827 675870209
2256.7 675870209 675609665 674899445 674578934 674267349 674166412 674525223 675201035 675696793 675975037 676040878
2266.3 676040878 675951767 675931702 675590897 675379257 674905167 674549484 674464798 674397812 674683075 674979706
2275.9 674979706 675415802 675302048 675324783 675587387 675478821 675210037 674673538 674412689 674002380 673997955
2285.6 673997955 673984604 674093475 674651566 674480667 674597549 674662018 674429855 673904953 673352356 673136673
2295.2 673136673 672751236 672544174 672031021 672252045 672814407 672997589 673186264 672933273 672606201 672122574
2304.9 672122574 671775513 671047745 670681152 670568695 670113144 670170441 669663086 669483948 669637985 669932327
2314.5 669932327 669786301 669073334 669190521 668663406 667550125 665931931 664945602 665187302 665239029
2323.2 665239029 664974823 664780884 664831696 664265823 665139160 664962769 663476334 663467712 662952576 663111115
2332.8 663111115 662614899 662266541 662490005 662526245 663048935 662391281 661907196 661330185 660628815 660384598
2342.5 660384598 660768280 661641922 661510773 661493835 662553940 664065018 664950027 664898453 663558426
2351.2 663558426 662048111 660763016 659533997 658952179 656884079 654775391 653920288 654470673 655879898
2359.8 655879898 655868454 656420441 657253342 657228165 656899719 657414474 657803192 657972107 658297577 658591080
2369.5 658591080 659661484 659975815 661282120 663114700 663325195 663435593 663480453 663457718 663889542
2378.2 663889542 664502945 664935608 665439758 665849686 666422043 667126770 667520752 667956696 667726669 667480316
2387.8 667480316 667568512 667150497 666641693 666291122 666387711 666501236 666398621 666548386 667013397 667122269
2397.4 667122269 666942902 666905746 666483307 666373138 666044083 665301056 665084610 664966125 665148773 665336609
2407.1 665336609 665491333 665772400 665693588 665329208 664799118 664164886 663917084 663985214 663622665 663346100
2416.7 663346100 663295135 663459320 663864441 663983688 663867722 663569489 663441315 663011093 662353973 661784286
2426.4 661784286 661430435 661586304 661354141 661280670 661511993 661615295 661618805 661449432 661161118 660361786
2436 660361786 660138474 660434189 660274658 659834518 659351196 659066696 658940887 659131546 659191589 659064331
2445.7 659064331 658928757 658672104 658178101 657614670 657693710 657815399 657527084 657003326 656826477 657042236
2455.3 657042236 657017593 656998596 656992264 657102432 656950607 656613617 656366882 655966110 655660400 655335541
2465 655335541 655253754 655263824 655250702 655228043 655015564 654938049 654927292 654876709 654713745 654508057 653911819
2475.6 653911819 653367538 653303680 653060150 652995987 653070145 653062439 653040771 653109436 653323975 653295898 652845001
2486.2 652845001 652081528 651694336 651594620 651458282 651413498 651418762 651641769 651836929 651617966 651293640
2495.8 651293640 651095734 650621643 650281296 650088196 649699860 649542618 649772720 650266266 650209122 650060272
2505.5 650060272 650351944 650319443 649942245 649354782 648871994 648744125 648774033 648752441 648860626 648721161
2515.1 648721161 648558884 648901749 648996811 648915176 648538208 648238297 647844467 646981125 646622620 646545563
2524.7 646545563 646726303 646695480 646729202 646868896 646544342 646527863 646287460 646219940 646279602 645930786
2534.4 645930786 645522461 644966660 644846725 644949493 645094147 645375595 645523682 645204926 644895782 644784622
2544 644784622 644034653 643242874 643053207 643319550 643087463 643006744 643586960 643535767 643519287 643181305
2553.7 643181305 642549286 642400360 642369690 642359467 641873169 641354523 641094437 641020966 640984879 640726547
2563.3 640726547 640557327 640657883 640880814 640630646 640275497 639973450 639438782 639000778 638815880 638886833
2573 638886833 638903236 638808289 638695374 638621407 638526878 638458672 638203850 637648010 637369652 637069817 636576920
2583.6 636576920 636324463 636395035 636537209 636671524 636640358 636510811 636647949 636411476 635907707 635543861
2593.2 635543861 635417023 635325165 634971809 634988556 635086441 635171013 635102463 634815025 634720001 634334106 633930817
2603.8 633930817 633882790 633774071 633359718 633065186 632501526 632094345 632679672 632863617 632845154 632913284
2613.5 632913284 632442207 631770821 631254349 631055183 630760078 630275345 629643135 629338799 629314728 629316940
2623.1 629316940 629566574 629448547 629084778 628864059 628655357 627956963 627219620 626947708 626592712 626495285
2632.8 626495285 626551018 626509132 626495590 626437302 626013680 625524445 625168648 624409828 623972511 623422241
2642.4 623422241 622644691 622503204 622694397 622966576 622997894 623082542 622885590 622402458 621976204 621401978
2652 621401978 620938034 620211639 619564133 619333420 619336891 619425430 619602089 619691582 619281082 619108696 618752174
2662.6 618752174 617970123 617417641 616907768 616495628 616261292 616233978 616065216 616068153 616414719 616407394
2672.3 616407394 616117744 615661964 615243835 614909439 614284973 613610802 613276901 613198433 613409348 613629303
2681.9 613629303 613637772 613517456 613204842 613059731 612630043 612029724 611830597 611468010 610944328 610567360
2691.6 610567360 610659103 610917282 610954666 611006126 611108246 610964928 610359650 609703751 608844185 608262177
2701.2 608262177 608419533 608451118 608250389 608038254 607855492 607585106 607187119 606858826 607046356 607474594
2710.9 607474594 607021828 606016502 605418587 605215721 604697037 604232941 604384270 604367104 604249687 604356384
2720.5 604356384 604105759 603371277 602847137 602661018 602400932 601917725 601466713 601569099 601658058 601329041
2730.2 601329041 601219101 601184082 600693169 600305405 600386353 600303040 599837837 599277267 599019775 598706856
2739.8 598706856 598354836 598368340 598211365 597910538 597716446 597675552 597494888 597328873 597335205 596970940
2749.4 596970940 596585312 596294441 596200905 596235619 596056519 595863914 595830345 595832214 595450134 594959488
2759.1 594959488 594319153 593737984 593488274 593389130 593558083 593473930 593378220 593418846 593560715 593317947
2768.7 593317947 592392731 592223320 592213554 591730042 591558151 591265678 590603676 590327148 590370064 590313492
2778.4 590313492 590496597 590227165 589551964 589210587 588979530 588580284 587960281 587489014 586962624 586679344
2788 586679344 586696167 586597977 586534157 586132507 585562286 585234375 584915581 584061356 583420258 583191605
2797.7 583191605 582645874 582385368 581959801 581622887 581540604 581030006 580615616 580031052 579528122 579028664
2807.3 579028664 578231125 577557831 576683769 575935974 575267715 574662094 574466362 574049606 573624840 573310051
2816.9 573310051 572473679 571361122 570334969 569487381 568619461 567568398 566751480 566192093 565285378
2825.6 565285378 563877563 562842712 562304840 561374741 559926529 558135834 556489944 555490990 554184837
2834.3 554184837 552175179 550880470 549623566 547223473 544742432 542054672 539049644 535918159
2842 535918159 531949501 527268372 522187653 516775932 510863266 504407349 498015518 492200890 486919823
2850.7 486919823 482274437 478570251 475728569 473885345 473525581 474521255 476213646 478932114 482621498
2859.4 482621498 486060410 489799995 493630676 496496010 498788757 500344658 501432419 502015152
2867.1 502015152 501925697 501591454 500959663 500357819 500271492 500465698 500374374 500403709 500638771 500638885 500615082
2877.7 500615082 500551949 500108871 499247246 498470650 497653809 496853981 496372032 495680084 494665184 493606720
2887.3 493606720 492532539 491146851 489682465 488253212 486656494 485125923 483662109 482258301
2895.1 482258301 480848732 479636192 478268661 476628189 475402985 473862839 471845703 469844284
2902.8 469844284 467342224 464630547 462518044 460359573 457508163 454682274 452288513 449696922
2910.5 449696922 446080437 441857147 437396393 432639503 427806473 422690620 417617569 412372742
2918.2 412372742 407259331 402983360 399395523 396418419 392950974 390265160 389171753 388462486
2925.9 388462486 388560715 389144096 390509148 392563553 394952011 397880096 401309509 405502892 409841042
2934.6 409841042 414312325 418565674 422433472 426552162 430754166 434691353 438583374 442803879
2942.3 442803879 446385880 449292717 452702103 456238441 459152145 461358223 462855988 463874893
2950 463874893 464585266 464907570 465111008 465743904 466742630 467415771 468164215 469681206 471639175 473661537
2959.7 473661537 475764084 478064957 480098267 482141685 484903450 488074646 491161880 494323387
2967.4 494323387 497505302 500204659 503282852 506508675 509186211 511566124 513554230 515559845
2975.1 515559845 517132950 518740883 520890388 522830849 524692574 526444969 528055573 529329376
2982.8 529329376 530218697 531252708 532356377 533140335 534018250 534956779 535904541 537001495 537392998
2991.5 537392998 537873497 538382149 538257980 538181992 538024483 538076782 537819824 537064056 536125565 534987602
3001.1 534987602 533887901 532680740 532017784 531625404 531101151 530752792 530511246 530203362 529815407
3009.8 529815407 529885406 530028152 530260162 530868645 531713753 532813835 533819618 534767570 535685844
3018.5 535685844 536580849 537008705 537201920 537645187 537942619 538016739 537676811 537108498 536721764 536677399
3028.1 536677399 536422386 536256371 536894150 537022133 536418800 535746918 534960098 534398804 534055138 533562431
3037.8 533562431 533397446 533377762 532605553 532014084 531906128 531419563 530570717 529904480 529363365 528644485
3047.4 528644485 527963028 527106552 526720505 526650085 525916748 525341721 525330887 525081406 524092903 523012009
3057.1 523012009 522263145 521455803 520362244 519562721 519408569 519208565 518731270 518144302 517920570
3065.7 517920570 517585449 516947937 516171227 515205193 514997444 514282265 512984467 512366714 511957169
3074.4 511957169 511781425 511358643 510704231 510186272 510063477 509901161 509148750 508311386 507174530
3083.1 507174530 506425781 505993805 505165062 504944763 505089417 504462891 503741188 503311501 502577400 501997643
3092.7 501997643 501476936 500691566 499702682 498844948 498286667 497624931 497356453 497095337 496856575 496615486
3102.4 496615486 495724792 494912796 494413414 493970642 492911377 491749725 491115570 490434380 489684486
3111.1 489684486 489018974 488910370 488724861 488198853 487585678 486861610 486299438 485164757 483855324
3119.8 483855324 483258553 483047752 482469673 481343842 480284767 479825554 479887352 479528503 479103012
3128.4 479103012 478686218 477346878 475542755 474247627 473894768 474079552 473869019 473083000 472438354
3137.1 472438354 471945305 471388397 470572891 469552994 468912659 468322754 467439766 466257706 465457611
3145.8 465457611 464882088 464236946 464174042 463958969 463266678 462320061 461590881 460865784 459950867 459040718
3155.4 459040718 457803650 457272530 456572876 455461121 455124054 455018578 454783897 453900986 452940788
3164.1 452940788 452144814 451353378 450658836 450090561 449589691 448401604 447579269 447229271 446702766
3172.8 446702766 446262436 445769463 445151176 444260521 443485756 442620964 441800194 441008682 440079689 439518738
3182.4 439518738 439077225 438567009 437744370 437121735 436608658 435922852 435357742 434513359 433692017 432961998
3192.1 432961998 432175446 431385880 431088257 430660591 429643326 429247246 428920593 428644447 428433380
3200.8 428433380 427741394 426946144 426105080 425208282 424297905 423836632 423162003 422323036 422104530 421932487
3210.4 421932487 421523705 420949402 420427704 419290733 418179398 418043747 417779007 417423286 416927147
3219.1 416927147 415973549 415355453 415160980 414738350 414135590 413645477 413176270 412493553 411498528 410824699
3228.7 410824699 410507851 410117493 409639816 409280548 408976021 408337326 407748833 407234306 406414871 405646935
3238.4 405646935 405156670 404606094 404210777 403932800 403250198 402699776 402320786 401993561 401717987 401070061
3248 401070061 400312538 399986229 399715157 398770676 398086967 397782516 397269440 396864433 396259003 395777588
3257.7 395777588 395568428 395210876 394590836 393748055 392844467 392430840 392559166 392131577 391300278 390570145
3267.3 390570145 390186234 390387154 390393562 389801598 389443588 389207611 388106995 387161751 386758537 386429977
3276.9 386429977 386001472 385569725 385337639 384678383 384585724 384628258 384282494 384111214 383223495 382389259
3286.6 382389259 382058830 382157669 382137794 381501884 380780029 380382843 380885544 380913391 380062828 379286957
3296.2 379286957 379047432 378895111 378257866 378087959 377627144 376954994 376794930 376544800 376582489 376684036
3305.9 376684036 376255302 375318451 374515533 374062538 373422089 372902222 372929115 372937889 372989006 373048477
3315.5 373048477 372375412 371687164 370971642 370332146 370089531 369890594 369794998 369160042 368597603 368022232
3325.2 368022232 367306900 367094803 366539612 365900917 365374336 364875031 364751396 364595490 363769302 363168335
3334.8 363168335 363220978 362894592 362507744 362030983 361644859 361047363 360432625 360705490 360277214 359266205
3344.4 359266205 358700104 358207664 357452164 356896172 356567993 355760651 355153465 354906616 354863319 354386368
3354.1 354386368 353816452 353657074 352625923 351826515 351600533 350925026 350202484 350074081 349957962
3362.8 349957962 349055557 348523178 348277931 347784309 347441826 346847191 346140289 345611572 344690704 343875237
3372.4 343875237 343846931 343313293 342558441 342294006 341859703 341614532 341650200 341570549 341165771 340606880
3382.1 340606880 340004120 339483604 338964882 338481560 338345490 338101425 337848663 337435112 337181664 337252312
3391.7 337252312 336831703 336448441 336173286 335857544 335500107 334960518 334709396 334771767 334841537 334625893
3401.3 334625893 333985748 333288307 333292007 333717079 333735771 333275566 332914619 332682304 332110863 331893082
3411 331893082 332106018 331777115 331056519 331073303 331469955 331610565 331608887 331215439 331090126 330857048
3420.6 330857048 330596924 330809517 330857391 330746689 330100136 330070229 330767326 331073189 331415977 331619987
3430.3 331619987 331500587 330991211 330547562 330757790 331302071 331136818 330559807 330923576 331923409 332565651
3439.9 332565651 332617912 332758904 332689857 332726479 333049202 333514709 334196320 333594971 333517685 334242363
3449.6 334242363 334765320 335231323 334996452 334973488 335378494 336392212 336966782 336945610 337441978 337882690
3459.2 337882690 338582420 338851471 339235382 339638023 339581490 340270805 341164322 341886024 341912041 341941032
3468.8 341941032 342381821 342842216 343431358 343767166 344290047 345131531 346023102 346172638 346022224 346716270
3478.5 346716270 347733269 348116455 348263969 348753433 348992119 349975128 350964661 351252174 351861038
3487.2 351861038 352300301 352797775 353520088 354242630 354449196 354818573 355762787 356596565 357280235 357253075
3496.8 357253075 357694664 358867302 359774742 359913559 360349045 361666260 362066803 362437363 363062553
3505.5 363062553 363991890 364940834 365572777 366135788 366126823 367122154 368012848 368566933 369448204 370022011
3515.1 370022011 370983925 371720695 372303581 373088341 373650551 373972969 375109711 376313133 376339455
3523.8 376339455 376953697 377629967 378332138 379262428 380457497 381231651 381611023 382571983 382959785
3532.5 382959785 383724937 384742622 385968018 386663017 386233215 387192345 388188324 389063568 390472069
3541.2 390472069 392109489 393113594 393782310 394465981 394435234 395885696 396708069 397479019 398498802
3549.9 398498802 399560013 401336365 400756607 401659508 403098259 403885727 405370789 405793457 407160454
3558.5 407160454 408914719 410168686 410690308 411586113 412222290 412718849 416275826 417858391 418311577
3567.2 418311577 419252167 418344116 420406036 422267342 423386116 424491348 425582199 426791649 428614120
3575.9 428614120 430481300 430759850 432280617 433482208 434391136 436389542 438018341 439190941 439562645
3584.6 439562645 442915916 445530663 444198494 445188942 444415092 446280823 449142838 451829948 453408775
3593.2 453408775 454211464 458083916 457449684 458072929 461465454 461544800 463058357 464153366 465283051
3601.9 465283051 466824303 467467461 469320412 472318840 474734154 473834801 476965714 477864571 475794106
3610.6 475794106 481187744 483501320 481686592 484715805 484830971 487719345 491744194 491480026 492995529
3619.3 492995529 493094215 492544708 494657478 497007027 498995514 500583115 502166214 503942451 508642197
3628 508642197 510822067 503122139 505508881 508748245 512536507 514239960 512337952 513417931 515925636
3636.6 515925636 518192406 518278122 519095154 521238365 523273964 524558449 524334259 525808411 528744087
3645.3 528744087 533750839 533085022 528558502 533220024 533652306 532485657 531542397 534639053 537560425
3654 537560425 539901390 545041161 539360390 538739510 542733002 543984489 545566330 545694389 547010727
3662.7 547010727 547877159 548737564 550179939 550545044 554111328 556608810 556175652 556890678 551596565
3671.4 551596565 551228256 556565247 564391556 567229347 554727859 554900970 560028419 563848000
3679.1 563848000 562609520 561863594 563425560 564180450 564519463 565307159 565868073 568177071 573402939
3687.8 573402939 568295593 564350014 570759811 567359810 566873398 571674995 571976814 572299194 572481003
3696.4 572481003 572424736 573320732 573225861 575099869 578549843 575958405 572626457 575067902 576358452
3705.1 576358452 576573067 576410027 577868729 581645432 576046867 578478012 584500084 574338875
3712.8 574338875 575873184 579128685 579264221 579748421 581483727 582780952 579709435 579491348 584187126
3721.5 584187126 582592049 578632393 582782593 584594574 584448357 582286148 581180077 583528214
3729.2 583528214 583628426 587604332 585638924 578170547 586051369 590303268 583135414 582539215 583966599
3737.9 583966599 583893051 585789032 588432579 585426559 586641655 595824127 590068588 574119568
3745.6 574119568 582148705 587315941 591300392 590082550 582416267 590883827 588210945 580996208
3753.3 580996208 585313492 588677254 591473770 587824059 588617935 593876724 589880714 587370834
3761 587370834 589622383 590395470 590649719 594121857 593292389 587967758 588889656 593024902 594581680
3769.7 594581680 588115273 588659096 591515541 592257004 593022537 592774544 593010864 592388420 593646355
3778.4 593646355 594620895 588653755 589456940 591631203 592144737 594057274 593014107 593120842 594529419
3787.1 594529419 593922920 593925743 593598289 592928200 592416801 592794418 593326759 594454041 597820473 595565300
3796.7 595565300 591204834 592316895 595128899 601106720 599031677 588215294 589850426 591999817
3804.4 591999817 595620079 601267662 594580536 589575310 592865486 594152451 594379997 594802055 594521637
3813.1 594521637 594851990 599845695 602319374 590553474 592592049 597022285 600387268 603259125
3820.8 603259125 590611801 590076256 594077034 595409813 597258377 597807007 594269791 593630028 594868355
3829.5 594868355 596967239 599268456 593652916 594499283 600229988 595630836 593693695 600512161
3837.2 600512161 596471291 591157455 596861420 594070511 593038864 598702545 597660370 594399071
3844.9 594399071 595725098 596182098 596012268 597717171 596880150 597172203 602681770 600589027 600343704
3853.6 600343704 589767113 587808113 595703888 596073761 593837128 594900208 596697845 599359970
3861.3 599359970 595702400 594464874 600209503 597647133 591793938 594495735 598830528 604000893
3869.1 604000893 599528923 590988922 592563934 597213364 601477928 594471550 593503151 596587067
3876.8 596587067 596302605 597865562 601839676 598794365 592560692 596607628 597961845 598937263 604075127
3885.4 604075127 594742661 593841019 596726608 596724892 600166626 600865631 594350281 594455452 597804909
3894.1 597804909 596801033 596259613 597174530 599453735 600706062 592222176 595706062 599095726 594908714
3902.8 594908714 598390579 596858177 595458794 595429916 594534454 596217422 597286072 597611809 597078590
3911.5 597078590 596566086 596306992 596268463 596632805 597698364 597105026 593948326 596288185 598059196
3920.2 598059196 595848503 596079712 596011353 597579155 597207565 594235191 595158463 596537819 597647171
3928.8 597647171 596925926 596749802 598546181 596549568 595231171 596182404 596011276 595880890 595676727
3937.5 595676727 595152779 595622749 595759926 596521454 598181190 595490532 593983231 594885368 595902100
3946.2 595902100 597492371 595422401 594822350 595324707 594668045 596734009 596500053 594899826 594413490
3954.9 594413490 594754066 595570717 594725609 594797401 595193062 595883560 596094360 594601173 595051155 595498924
3964.5 595498924 595144234 595191650 595324249 596101456 596201096 595693016 595530891 595379448 595602417 595714645
3974.2 595714645 595291252 594811745 594769211 595295067 595384521 594888763 594884415 595502243 595487328 595016594
3983.8 595016594 595372238 595545349 595435028 595319023 595412178 595978775 595689240 595160637 594796104 595022926
3993.5 595022926 595794907 595483742 594689713 594339180 594601364 594671898 594658966
4000.2 594658966
##END=$$ End of the data block
