##TITLE=$$ Begin of the data block
##JCAMP-DX=5.00 $$ ACD/SpecManager v 10.08
##SPECTROMETER/DATA SYSTEM=Varian
##DATE=04 Dec 2012 13:23:10
##DATA TYPE=INFRARED SPECTRUM
##DATA CLASS=XYDATA
##ORIGIN=
##OWNER=
##NPOINTS=3735
##FIRSTX=399.26403809
##LASTX=4000.35498047
##MAXX=4000.35498047
##MINX=399.26403809
##MAXY=68.93142700
##MINY=33.15182877
##XFACTOR=1.0000000000
##YFACTOR=0.000000100000000
##FIRSTY=59.21405029
##DELTAX=0.96440572
##XUNITS=1/CM
##YUNITS=TRANSMITTANCE
##XYDATA=(X++(Y..Y))
399.3 592140503 573152275 556940422 556889610 564395638 560298119 557528572 562278061 555750237
407 555750237 549935684 544923401 549431267 565081940 570257454 568655930 565418739 560911102 558606987
415.7 558606987 559539299 561938896 563918266 564244270 561470871 562917671 562874374 558032532 556638222
424.3 556638222 560588455 565693932 563583260 557505112 551918678 551578064 556451721 555957718 555071678
433 555071678 561238670 564005814 560019493 555492287 552842331 552204094 550973892 551807556 555805969
441.7 555805969 556034546 554042206 557241631 563968201 566722603 564925117 563057823 559237518 554942894
450.4 554942894 554208984 557925987 557159805 554382820 559693184 565916824 565318413 561187935 559436951
459.1 559436951 558648872 557045174 550940475 548584137 550585480 551625557 554847450 554048271 552573013
467.7 552573013 555756226 560318375 562395897 559915657 554299164 545218964 540943069 540961647 546167870
476.4 546167870 552193031 549922447 547042999 547182503 548673897 552206192 552357903 545436554 540266991
485.1 540266991 539761696 540072212 541450500 541570587 544378090 545759163 542445221 542792397 541361351
493.8 541361351 538657837 540993729 543141708 539938393 534987717 534540634 538491287 538387718 535739784
502.5 535739784 539571228 539815559 537639160 536900673 533646469 531112366 530801888 532437630 530793533
511.1 530793533 528140144 527357826 526544838 527618637 526476326 523381386 522421532 521752205 519426422
519.8 519426422 517930717 516462822 513644714 512226639 511244583 511842918 514331551 516183434 515362778
528.5 515362778 515196724 517453957 516117859 514633484 514041405 512453423 511984520 513639793 517599182
537.2 517599182 520540009 522282295 522902031 523368759 524578094 523714027 522335701 522108269 522621536
545.9 522621536 522034798 521272430 524089241 527298012 527942047 527400131 526147423 526439819 525647163
554.5 525647163 521441765 519364357 518421898 517044678 516615715 516136169 516217690 516922760 519021873
563.2 519021873 518529663 515637512 513706627 509996262 506720810 504210815 503518143 504433250 504036026
571.9 504036026 503732147 504608612 505545387 503969231 502660065 502384071 500886040 501659851 503974380
580.6 503974380 503243217 503304787 506838760 510029716 512924538 515470467 517341042 518907356 519612503
589.3 519612503 519326782 518077393 517049294 517055054 517881508 519185371 520656090 521376991 521990128
597.9 521990128 523720627 524263344 522997894 520532990 517818069 516209068 515367928 515487289 517414932
606.6 517414932 520542908 522162094 523509254 523751755 522108994 522132835 522588654 521660843 520196953
615.3 520196953 520994492 523282471 524346848 525842514 528215675 530831680 532508545 533618736 534598160
624 534598160 534799118 534126129 533598213 533733902 535665436 539309082 540539513 541433640 543719826
632.7 543719826 545339813 546300354 544937286 544019394 544284477 543395844 542626877 542732964 543958321
641.3 543958321 545446510 547662888 549187660 548899727 549285736 549795494 549420700 548911247 548258667
650 548258667 548041954 548621178 548417778 547874756 548753242 550596809 552687035 553566589 552909012 551539345
659.7 551539345 550640755 550317116 549487343 549284325 549611435 550652504 553005104 551856766 541992722
668.3 541992722 549120064 554438591 555462456 554525642 553608093 553949623 553514977 552939644 553914642
677 553914642 554992638 556673317 558572426 560598831 561582527 560813904 559917641 557924652 556596298
685.7 556596298 556929703 556851082 556573257 556920242 558622131 560897789 562297440 562880020 562420654
694.4 562420654 560883560 559329796 557462425 555181274 554229050 554314156 554032173 553923798 555510826
703.1 555510826 556801910 556431351 556378708 555927963 554249458 551976051 551027298 551595039 551115799
711.7 551115799 551469383 553786507 555907097 557964668 559800224 560459442 560396042 559394302 557676163
720.4 557676163 557559166 558792953 559733429 561170158 564354706 568858719 572786179 574812393 575881882
729.1 575881882 576312408 576184425 576614799 576987152 576506805 576464157 577935028 580775642 584249153
737.8 584249153 587019958 589030037 590155983 589522743 588735275 587928505 585746346 583990326 583921204
746.5 583921204 584221191 585280075 586517296 586624641 587150116 587069626 585297813 584106407 582815475
755.1 582815475 580627022 579126282 578074989 577772408 578165665 577957993 578468781 580818596 582007790
763.8 582007790 580687561 580542526 580956917 579779663 579160461 579048309 579917831 582805595 586366615
772.5 586366615 589444885 591872368 594229736 595792656 596380692 596851006 597817268 599421043 600104828
781.2 600104828 600220451 601180687 603018684 605077133 607383385 609694328 611416016 612153397 610946541
789.9 610946541 610321274 610775642 610488358 610090828 610638618 612678986 614703026 616772423 618928108
798.5 618928108 620779266 621757202 621906052 622654152 622491798 622589264 622928391 622590752 622948799 624949837
808.2 624949837 628266487 629813194 630486984 630805435 630894089 631445160 630829582 629000053 626935081
816.9 626935081 626697693 626829185 627001762 628727226 631354141 633178825 632377014 630972862 629569016
825.5 629569016 627821159 625309105 622434464 620719490 620248413 620598412 621271133 622248764 621905823
834.2 621905823 621595535 621050797 618554802 616002083 613274193 610940895 608790474 607760124 607081566
842.9 607081566 606291237 608210373 610316925 610939026 609725876 607088890 604588165 602166061 600224533
851.6 600224533 598898849 598816414 599604378 600855370 602255592 603363647 604216385 603915100 602628174
860.3 602628174 601173325 600066490 599631805 600334816 601316071 603613548 607377281 610883522 615440636
868.9 615440636 618729324 620367317 621669006 622027283 623120499 623701668 623695145 624254112 625442696
877.6 625442696 627042732 629394646 631325111 631002541 630005493 629267273 628521957 625795708 622975082
886.3 622975082 620825806 618575401 617790756 616618767 616508675 616861610 615956154 614877625 613090477
895 613090477 611239700 609258118 607592163 605725136 603633766 602260895 601370239 601131744 601300468
903.7 601300468 601184120 600061760 598824615 596917572 593995438 590817680 587632751 585360947 582972755
912.3 582972755 580640755 578943443 577644005 576485596 574509888 572443008 570381775 567765694
920 567765694 565142326 562946396 561177025 559619408 558095093 557482224 558592606 559759331 560196266
928.7 560196266 560648575 560480461 560388069 560512657 560095444 559409714 558656616 559505920 561427383 562231026
938.4 562231026 563437729 565305290 566474419 567758713 568727684 568745155 568385048 567615242 566544838
947.1 566544838 565702705 565235291 564473991 563394241 561948700 560124969 558253403 556128922 553357315
955.7 553357315 549633789 545500946 541110420 536831512 533644218 530810852 527407532 524047699
963.4 524047699 520433693 516746597 513067780 507877884 501142998 494771042 489469452 483547401
971.2 483547401 477455826 471596794 466384888 461878662 456468925 450941238 444899445 438512878
978.9 438512878 431621971 424965477 418753357 412647476 408196220 404157715 401181107 397476997
986.6 397476997 393862610 391617699 389511642 387948723 385605354 384126205 382245712 380809746
994.3 380809746 380033073 379121933 379488297 379796143 380602303 380878868 381881943 381836891 380667305 380575600
1004 380575600 380161514 380076485 378758354 378309364 378168602 377598152 377205276 376340294 376287994 375014000
1013.6 375014000 373835907 372577057 371918030 371464195 370655937 370563889 369579430 370121689 370271912
1022.3 370271912 370627785 371734695 372890549 374277000 374348030 374909058 374623718 375005608 375298576
1031 375298576 375602112 376402092 376536636 378412476 379700813 380728493 380417328 379844780 379963837
1039.6 379963837 379723892 379861984 378918419 379063644 378966522 379839172 380376282 380089989 381290855 381610870
1049.3 381610870 382932472 383438988 384643517 386430321 387535667 388575325 389521942 392693710 394807701
1058 394807701 396996994 399276543 402139320 405480423 407956352 411299706 413665009 416396828 418401184
1066.6 418401184 419890289 420424881 420345764 420483360 417954216 415280342 411919785 408789558 405597610
1075.3 405597610 402610512 400730133 398364487 397703667 396576385 396947060 397369270 398329849 400465546
1084 400465546 401036606 403105049 404732094 406541710 407053299 407686691 409707718 411086426 413103600
1092.7 413103600 414603996 417604370 419178467 419847832 421622200 422862396 423472137 422983627 423491440
1101.4 423491440 423314934 424038162 425198669 425425987 426322708 427060814 428320961 429045372 430682602
1110 430682602 432066193 432754745 433166924 433126106 434270706 434618607 435670624 437225418 439039268
1118.7 439039268 440833321 441921387 443504372 444263268 444431801 443984833 444414597 445194206 446048431
1127.4 446048431 447693405 449120064 451044731 452676201 454615364 455538864 455582695 455612640 454412384
1136.1 454412384 452281303 450048027 449433708 448268051 446586876 444757805 443024216 442038956 439869766
1144.8 439869766 438414230 436255951 433479614 430906105 428277130 426237640 424195290 423335686
1152.5 423335686 422587967 423043518 422801971 422066345 422195129 421596603 421560402 421357727 422188950 422754555
1162.1 422754555 424067192 426189079 428035240 431603508 435173721 438911514 441666641 444981842
1169.8 444981842 448820419 452327728 455966606 458901482 463231812 467616196 472251549 476996613
1177.5 476996613 481597481 486052322 489761925 493886032 497410927 500482788 502630768 504780540
1185.3 504780540 507321472 509603767 512443657 514858208 517519913 520091171 521913948 523316803
1193 523316803 524674034 525739899 525438232 525124512 525386467 525960541 526290359 526504440 527753448
1201.6 527753448 528990936 529678764 530106010 530755234 531421738 531445961 531659927 532316704 532611809 532824554
1211.3 532824554 533620682 534731293 536290970 538068352 539455376 540039368 540156174 540450897 540417023
1220 540417023 539789047 538770027 537948265 537868996 538058777 537967110 537908669 538326035 538168030 537034378
1229.6 537034378 535610580 534225616 532892838 531453285 530461082 529878731 529575119 529547501 529805031
1238.3 529805031 530376282 530478668 530316010 530218506 529957695 529296379 528883743 529045143 529413795 530047340
1247.9 530047340 531032524 532924957 534736099 536055527 536892281 537189102 537346191 537159157 537387466
1256.6 537387466 537374039 537042847 537811623 539272881 540738602 542097054 543335915 544079781 544531326
1265.3 544531326 544453201 543990250 544096107 544129944 544245796 545439148 546872940 548005104 549330406
1274 549330406 550385818 550895309 551100655 551213417 550818634 550149956 550085678 550104446 550373611 551209221
1283.6 551209221 552293816 553421707 554431572 555358276 555482597 555307388 555130196 554447403 553696098
1292.3 553696098 553185272 552874374 552878876 553180237 553766403 554313507 554135437 553856583 553468475 552546425
1301.9 552546425 551968117 551401749 550788269 550503311 550507355 550943642 551233902 551359329 551420021 551224594
1311.6 551224594 550757561 549859123 548955803 548432999 547609978 546478004 546081009 546244125 546317177 546453514
1321.2 546453514 546600952 546564331 546227112 545512276 544651527 543736954 542662849 541478653 540230370
1329.9 540230370 539356384 539181671 539236183 538959045 538426590 537908630 537279663 536736221 536237030 535184288
1339.6 535184288 534508934 534374008 534224205 534457207 535042038 535971031 536589508 536990051 537274361 537007103
1349.2 537007103 536223679 535039978 534204597 533769302 533471832 533281631 533339081 533776169 534009285 534023781
1358.8 534023781 533826904 533315430 532478943 531488533 529650002 528436928 527991829 527339554 527355690
1367.5 527355690 527614136 527949982 528741760 528914871 528733711 528127403 527204781 525723076 524683189
1376.2 524683189 524632797 524311218 524462051 525023880 525949783 527013702 528276863 529359055 529787979
1384.9 529787979 530651245 531264153 531374931 532375832 533710060 534315300 534977112 536050224 537130661
1393.6 537130661 537685585 536798096 537532845 537419510 536414604 535126457 534060555 534252357 533931389
1402.2 533931389 534154053 534615746 534855499 535694046 536124077 536175385 535273361 534107590 533369942 532615166
1411.9 532615166 531211166 530421486 530292168 530117683 530692482 531317139 532119522 531099739 530885963
1420.6 530885963 531787033 531749916 531908302 531190033 531405067 532296181 532850990 533570366 533979340 534444008
1430.2 534444008 534292793 534161949 533253593 532038498 531692772 531616898 530711784 529963875 531043015
1438.9 531043015 531823692 532822189 533256912 532770882 532660446 532065506 531897049 531125984 530084991
1447.6 530084991 528737411 528401489 528521309 527530365 527134552 526516571 526686592 525592537 523277855
1456.2 523277855 522003212 520737419 521933632 521178513 522223663 522762184 523954315 525428848 524837990
1464.9 524837990 526840172 528079300 531001053 533888245 538401375 543451080 547315636 553204117
1472.6 553204117 557786522 563621063 567032318 570712776 574114571 577483139 580677605 582507439
1480.3 582507439 584445801 584911995 586444473 587729073 588525925 590063820 591009293 592556114 594107094
1489 594107094 595037384 594230576 595152588 595941429 595513153 595288353 594688950 593159218 593579063 593805122
1498.7 593805122 593386459 594224129 594676743 594444847 594562225 594500809 594488182 591333160 587250214 586228333
1508.3 586228333 585788383 585308495 585522423 585570030 584451790 584774323 584349289 582718697 581655045
1517 581655045 579017143 579624329 580826302 579827995 578251305 579193764 580613251 581671181 581279678
1525.7 581279678 581176491 581982498 581017075 580061111 579813957 578845482 578509865 577575684 575607452
1534.3 575607452 576628342 578096695 579722252 581460419 581327858 576385307 576403847 575566216 573819427
1543 573819427 574264412 574356613 574653473 576673470 578568192 580042114 581423340 581172066 581749420
1551.7 581749420 582711601 583572426 582951584 582473259 585080566 587420883 585980072 586062164 588768272
1560.4 588768272 592129936 594086189 595279655 595680008 595639114 595556908 596000443 596771431 597099037
1569.1 597099037 596785431 597968025 599984436 600666161 600971184 602402191 603645935 599661102 598848991
1577.7 598848991 599895058 599759064 599603691 599577751 600103455 600638351 600474586 600187111 599623756 599170609
1587.4 599170609 597528954 596034927 594659805 593458061 592742386 591906776 591250076 590147743 589656410
1596.1 589656410 588750191 587921219 586770554 584797745 582778549 580424843 578735123 576651649 575252151
1604.7 575252151 574044113 572638512 570799065 569030876 567322884 564667625 562995262 560437050
1612.5 560437050 557924995 555041504 553520393 553042145 546258163 545285187 544433403 542987442 540424271
1621.1 540424271 538993225 537534943 531968727 530045242 528148384 526657829 522868919 520075073
1628.9 520075073 518821602 517031631 515801353 513996811 513672791 513153801 510466156 506452065 505372314
1637.5 505372314 504072723 503139229 503215981 501583290 501791801 501164589 501645432 502777138 500652428
1646.2 500652428 500661850 498912354 499771843 499646187 500506058 502441521 500410805 497275848 498510056
1654.9 498510056 501896629 503445969 505038719 505744438 506573257 507628822 508669510 510859947 510564651
1663.6 510564651 512333298 514102936 516304245 518742981 520847664 523187447 523758163 526420135
1671.3 526420135 527615738 529208260 531330185 532792969 533822594 535459633 538141785 540308266
1679 540308266 542671242 544374962 546938438 549832726 550323830 550862122 551993256 554744301 556694984
1687.7 556694984 558332710 560787811 563115311 565678444 568547630 571396675 574024582 577154694
1695.4 577154694 575883789 576640434 579121056 582293015 584889793 581440163 585442619 589029083
1703.1 589029083 591209755 591756248 592695312 593108711 593410492 594339790 594573975 594856834 595426521
1711.8 595426521 596359444 597766991 598607330 599025383 600836029 602694931 600190964 601262627 602921028
1720.5 602921028 603532639 603488846 603068962 602552452 602668114 603069191 602870636 602364845 601707153 599369507
1730.1 599369507 595907516 594309616 592726326 587716179 580537186 579292221 577807617 574938583
1737.8 574938583 572479095 568367577 562503014 560921898 559628410 555961571 554424515 554148827
1745.5 554148827 554371758 555145378 557958450 562895927 567497940 575515251 582583237 589784203 596582108
1754.2 596582108 602900810 609623528 615415306 621559830 626762199 631997566 636481361 639947929
1761.9 639947929 643864746 647857742 651259308 653476105 655929718 658176880 658201752 658978806 660719376
1770.6 660719376 661216660 660936279 661436310 663926773 666689072 667458572 668593216 669437408 670119858
1779.3 670119858 670717621 669733124 669967575 670624771 671003723 671065369 671475449 672846985 673900299
1788 673900299 674742966 675807648 676142883 676584778 675762787 674396744 675279083 675755768 675596619 676288376
1797.6 676288376 677830124 679008179 679086151 680119171 680384140 680132904 680240097 679755478 679264603
1806.3 679264603 679340591 679833984 680227890 680697708 680664902 681829681 683228226 683467636 683613129 683278885
1815.9 683278885 683246155 682328415 681322021 681526337 682066040 683147812 683551559 684441223 685791855
1824.6 685791855 685015717 684518661 685109177 685484009 685168076 683041840 682614517 683721542 684124222
1833.3 684124222 684804153 685749741 686458817 687038193 686720123 687034683 686737595 685907211 684876022
1842 684876022 684966583 685971985 683664246 684936066 687007599 687610397 687690582 687550049 687749634 687356262
1851.6 687356262 686937180 686377182 685721130 685433731 685628586 686225891 686784134 687748718 688192825 688394165
1861.3 688394165 688195038 687748337 687284164 686535339 686340485 685964737 686282730 686012573 685536880 687056122
1870.9 687056122 688202667 688491440 688240051 687971802 687519684 687144775 686884613 686646652 686721344 686878052
1880.6 686878052 687382050 687486038 688060608 688969345 688949661 688634262 688047104 688060989 688085556 686691742
1890.2 686691742 686127777 686835709 687415619 688021622 688520813 688401337 689107437 689314270 688761597 688275375
1899.8 688275375 687946854 687813110 687535782 687649841 687549362 687721024 688004074 687960739 688350830 688550873
1909.5 688550873 688173752 687787704 687957306 687399063 686696472 686553574 686732101 687580719 687151718 686867218
1919.1 686867218 687587433 688146210 688680191 688013077 687002411 687070618 687185669 686796875 686568832 686438904
1928.8 686438904 686498795 687055511 687771912 688377838 688170853 687688904 687395401 687200470 686629639 685973129
1938.4 685973129 685721741 685359573 685819244 686264725 686079102 686812668 687847290 687848053 686976471 686579895
1948.1 686579895 686197357 685828552 685365448 684871521 685131836 685628738 686010590 686372528 686964417 686994781
1957.7 686994781 686837997 686684875 686042557 685766678 685527039 685425568 685498962 685755844 686274719 686703796
1967.3 686703796 686966171 686968613 686896439 686333923 685815048 685310593 684859619 684674988 684492493 684956284
1977 684956284 685393448 686164780 686807251 686811829 686824036 686211014 685588303 684655914 683757324 683798294 684001465
1987.6 684001465 684070206 684372406 685279160 685848999 685745163 685771332 685734482 685227737 684522018 684041519
1997.2 684041519 683700638 683263092 683138962 683774414 684263000 684677963 685059814 684887543 684498215 683803940
2006.9 683803940 683293152 682872238 682467957 682118988 681917648 682333908 682620239 682652512 682792664 682965088
2016.5 682965088 682508545 681949005 681548615 680892487 680781937 680750427 680498047 680237885 680382690 680625916
2026.2 680625916 680414352 680619583 680652161 680371399 679948044 679418640 679185867 678933868 678700104 678556366
2035.8 678556366 678660660 678842163 679160080 679277191 678985596 678558884 678109818 678115540 677775040 677180252
2045.5 677180252 676881561 676873550 677040787 677120056 677439194 677611542 677912979 678165131 678042679 677762985
2055.1 677762985 677041702 676293793 675907211 676247177 676595993 676697159 676932602 677213058 677660980 677826691
2064.7 677826691 677744522 677328415 676746445 676142578 675588684 675386047 675441132 675986938 676486740 676697845
2074.4 676697845 676771774 677043228 677330475 676894073 676242905 675936813 676140747 675997162 675660172 675719452
2084 675719452 675834274 676207809 676534348 676823120 677021942 677130890 676969910 676285019 675628815 675349045
2093.7 675349045 675314407 675030365 675116425 675732651 676392365 676743164 676682434 676922073 676958847 676335449
2103.3 676335449 675572891 675285110 675138626 675082245 675408707 675674362 676079559 676344681 676668625 676746674
2113 676746674 676206665 675765839 675459518 675465622 675118942 674615097 674696198 675097275 675611725 676355667
2122.6 676355667 677100830 676919250 676453629 675962296 675344620 674747086 674081345 674069366 674441452 674810715
2132.3 674810715 675074234 675342560 675666504 675935593 675873718 675249710 674797745 674745407 674979858 674657898
2141.9 674657898 674363632 674841461 675165176 675406876 675298843 675238876 675263290 675092163 674910583 674677277
2151.5 674677277 674624710 674230881 674064789 674190979 674300308 674543839 674880219 675427856 675491333 675342636
2161.2 675342636 675146027 674943390 674588318 674204712 674540863 674940567 675270996 675378876 675414429 675813751
2170.8 675813751 676200867 676165619 675768356 675739746 675913467 675797653 675254517 675006332 675400314 675789413
2180.5 675789413 675747757 675767670 676335907 676537933 676707764 676488571 675905762 675983734 675977325 676011658 675928040
2191.1 675928040 675969086 676318665 676849365 677481613 677606659 677641296 677509995 677604294 677436066 676959305
2200.7 676959305 676858978 676649628 676804810 676912460 677073517 677501221 678109589 678750763 678557816 678055878
2210.4 678055878 677743378 677735901 677413559 676907501 676966324 677225189 677560654 678180542 678712006 678467636
2220 678467636 678469009 678689117 678462982 678057861 677389145 677101212 677183075 677431717 677745361 678198624
2229.7 678198624 678512039 678638153 678809586 678396301 678190842 678301697 678167801 677574844 677261124 677782516
2239.3 677782516 678080139 678439331 678780975 679206543 679344330 678756332 678311462 677874680 677677841 677344055
2248.9 677344055 676865692 676856384 677202835 677601471 678027725 678421249 678538437 678691483 678168640 677486801
2258.6 677486801 677112045 676736679 676854935 677081451 677627869 678029175 678044739 678174515 678477097 678306580
2268.2 678306580 677796021 677923889 677556839 676976852 676763306 676975632 677119370 676903458 677363586 677641220
2277.9 677641220 677829285 677815857 677894135 677872849 677154617 677018585 676637421 676508713 676680527 676724319
2287.5 676724319 677083817 677284012 677322235 676892090 676620026 676152649 675780563 675481262 675116425 675257034
2297.2 675257034 674833603 674806213 674732285 674698715 675035019 675083389 675431824 675015182 674192810 673460617
2306.8 673460617 673065796 672715683 672453079 672418213 671748734 671697540 671811371 672227020 672251511 671474380
2316.4 671474380 670914764 670300751 669936600 668557358 667739563 667787094 667675018 667248459 666610718 667248764
2326.1 667248764 667297134 667231293 666714935 666453781 666087875 664218063 663787384 663834839 664712296 665067062
2335.7 665067062 664397659 663633804 663345184 664344025 663915558 663504639 663108215 662901382 662833862 662375259
2345.4 662375259 663320847 665057373 667049332 667477036 666841278 666331863 665413513 663683319 661968613
2354.1 661968613 661169052 659499741 657629318 656459045 657131119 658363113 658337250 659133224 660023956
2362.7 660023956 661124191 661016998 661029282 660857925 660031509 660642929 660936356 661334610 662234192 664046249
2372.4 664046249 665230942 664948502 665238266 666109848 666873703 666877823 666964951 667355042 667539749 667786713
2382 667786713 668611832 669610519 669736023 669905853 670377121 670507812 670258331 669712601 669042511 668559723
2391.7 668559723 668613281 668670807 668537216 668813095 669859238 670278854 669772034 669343643 668817444 668559113
2401.3 668559113 667964630 667361526 667191772 667221985 667598038 667451248 667611237 667924881 667995300 668199844
2410.9 668199844 667741623 666836319 666133957 666025314 665940857 665734177 665635300 665649567 665936432 666232529
2420.6 666232529 666319885 665802231 665332489 665079575 664545059 663830032 663475266 663720398 663934631 664215240
2430.2 664215240 664099121 664028244 664268188 663960953 663708801 663331985 662678757 662268906 662242355 662152328
2439.9 662152328 661893082 661712799 661585693 661687088 661494370 661366882 661269455 660830612 660538330 660131302
2449.5 660131302 659772339 659774017 660048218 659891052 659324951 659144287 659269104 659441299 659596024 659454575
2459.2 659454575 658723602 658281937 658162003 657990036 657856522 657532654 657271271 656994553 657320023 657863846
2468.8 657863846 657614136 657201920 657275620 657401199 657067413 656921387 656472702 655937881 655646286 655220947
2478.5 655220947 655583420 655882187 655776291 655677261 655254440 654834976 654620743 654513779 654234543 653998489
2488.1 653998489 653923416 654080505 654058838 653696976 653823547 654043579 653881836 653871613 653868179 653310928
2497.7 653310928 652966537 652957840 652703323 652390594 652245407 652384720 652420197 652561646 652507172 652276535
2507.4 652276535 652256393 651707077 650989304 650700150 650959625 651030884 650931168 651177521 651349106 651482239
2517 651482239 651613464 651654816 650880432 650402603 650355835 649642792 649454117 649316635 649136581 649197311
2526.7 649197311 649323502 649383011 649198837 649220581 648715210 648391037 648368759 647946396 647776337 647741318
2536.3 647741318 647491837 647207184 647407150 647554855 647597122 647579269 647415848 647171555 646298370 645674896
2546 645674896 645543442 645478745 645298996 645408554 645819473 645820312 645863342 645782318 645869446 645582809 644634628
2556.6 644634628 644022751 643554230 643538666 643450623 643087234 642932739 643050308 643405380 643385620 643169785
2566.2 643169785 643019409 642727661 642143097 641889648 641741562 641312027 641165085 640980225 641283264 641716766
2575.9 641716766 641350479 641122055 641029282 640459290 640154953 640026016 639443893 639145546 639029274 639034691
2585.5 639034691 639259949 639293060 639117432 638934631 639147339 638866615 638132362 637625427 637531281 637754402
2595.1 637754402 637472076 637423325 637635117 637724800 637840576 637674904 637476692 637400856 637211723 636476135
2604.8 636476135 635782013 635312195 635142822 635264511 635013428 634903870 634835701 634884567 634924202 634755592
2614.4 634755592 634599724 634025764 633671036 633388367 632757492 632157249 631849174 631854820 631856422 631949463
2624.1 631949463 631921349 631709175 631243515 630717278 630440483 629965553 629361191 628918114 628829727 629005280
2633.7 629005280 629094429 629010811 628924294 628696136 628175316 627740707 627197495 626426086 625882301 625591888
2643.4 625591888 625303535 625295219 625365105 625213585 625263138 625056267 624677048 624225464 623434219 623022575
2653 623022575 622738457 622093735 621489677 621287689 621498260 622122955 622518349 622048340 621672478 621548462
2662.6 621548462 620760117 619713898 619211807 618924980 618621330 618543854 618486671 618361549 618589706 619060974
2672.3 619060974 618945618 618506126 617996483 617256508 616461220 615705109 615629539 615756073 615684280 615805283
2681.9 615805283 615901756 615862694 615685883 615615082 615217056 614589386 614257050 613973846 613453674 612746811
2691.6 612746811 612779274 613025169 612903900 613160362 613504486 613393631 612969246 612283440 611186676 610725174
2701.2 610725174 610673370 610309830 610488358 610452614 610162582 610232544 610052376 609851036 609605675 609043236
2710.9 609043236 608350410 607808266 607586823 607355499 607170677 606968880 606694984 606803055 606959343 607144966
2720.5 607144966 607075882 606263390 605618935 605319099 604864731 604371758 604368782 604369316 603914833 603753204 603678741
2731.1 603678741 603532562 603374062 603131752 602888107 602810211 602525787 601694641 601538353 601608734 601408386
2740.8 601408386 601173477 600695915 600423965 600039101 600170860 600437317 600137863 599890823 599415817 599014778
2750.4 599014778 598502083 598119545 598499184 598739281 598341980 598054237 597943878 597629433 597384491 596948204
2760 596948204 596910858 596832733 595910339 595406342 595500336 595687218 595816154 596023140 595779915 595258102
2769.7 595258102 595223122 595180397 594838486 594113770 593644943 593223877 592762604 592568359 592519760 592970467
2779.3 592970467 593025513 592584953 591688385 590926361 590796928 590454369 590119591 589576797 589357681 589308777
2789 589308777 589263649 589407768 588767204 588067970 587575340 587174530 586553726 585977707 585986404 585628433
2798.6 585628433 584942093 584187393 583906784 583886070 583692551 583400955 582723579 582184181 581560860 580971909
2808.3 580971909 580314026 579404640 578707390 577817993 577297897 577172699 576858253 576371727 575409584 574331017
2817.9 574331017 573517685 572667923 571640244 570505180 569468422 568875923 568445816 567544250 566429253
2826.6 566429253 565697136 564857979 563538475 562372322 561228867 559462471 557742996 556614723 555025673
2835.3 555025673 553385963 551965523 549636765 547075844 544448357 541315918 537689934 533762970
2843 533762970 529536972 524242249 518363113 512614708 506796722 500540314 494245415 488745155 484402504
2851.7 484402504 480848389 477665710 476097107 476199684 477170944 479000053 481511307 485188904 489013367
2860.3 489013367 492373466 495490799 498218422 500895500 502767067 503837929 504210968 503952789 503552780
2869 503552780 503150024 502870369 502312050 501860237 502054825 502664909 503013420 503076096 502951202 502375107
2878.7 502375107 501809769 501113281 500470924 499848213 498812523 497775002 497022247 496498642 495743828
2887.3 495743828 494894066 493708916 492058296 490524368 488966293 487638855 486277046 484334259
2895.1 484334259 482630043 481434059 480078697 478780708 477349739 475499268 473690834 471440010
2902.8 471440010 468896408 466569290 464325562 461842728 459223404 456952133 454319954 451305733
2910.5 451305733 447937202 443918839 439474525 434782333 430399208 425531006 419980125 414201317
2918.2 414201317 408347168 403976974 401020432 397815399 394285049 392213097 391486702 390805016 390480003
2926.9 390480003 390815506 392092094 394074173 397192802 400751076 403495026 406598053 410598068
2934.6 410598068 414822388 418894920 423723068 428905792 433155441 436857491 440622368 444595909
2942.3 444595909 448278923 451811638 455326538 458473129 461249504 463369484 464650917 465439644
2950 465439644 466236382 466800041 467092209 467754784 468600578 469399872 470575294 472184448 474150009
2958.7 474150009 476116524 477783432 480087471 482897758 485169487 487478065 490156593 492889137
2966.4 492889137 496082268 499373055 502370987 505530739 508470764 511292915 513973236 516256256
2974.1 516256256 518275719 519683723 521081810 522734909 524630508 526779518 528760872 530317345
2981.8 530317345 531737251 533378410 534541130 535450134 536168594 536909790 537854004 538310509 538875313
2990.5 538875313 539489899 540293770 540918465 540711327 540494652 540682755 540869751 540212669 539105377
2999.2 539105377 537971153 537357063 536976089 535875626 534897804 534155464 533754158 533495827 532949257
3007.9 532949257 532536736 532538643 532892609 533166084 533394775 533756332 534997864 536179085 536589317 537444611
3017.5 537444611 538563004 539626465 539955406 539993668 540205841 540316391 540467606 540328217 540256462 540007439
3027.2 540007439 539810753 539683876 539660721 539839325 539386940 538961411 538525887 538067741 537654839 537072258
3036.8 537072258 536616745 536330299 536101036 535448914 534809494 534329185 534333687 534266281 533327522 532502441
3046.5 532502441 531822968 531011009 529860458 529494171 529503517 528499413 527892990 527862511 527656593 527147179
3056.1 527147179 526885567 526233749 524867592 524011726 523089104 522212639 521540298 520721283 520454178
3064.8 520454178 520838089 520846825 519969292 518925362 517959595 517323914 516735649 516184196 515808411 515227737
3074.4 515227737 514725609 514273911 514120140 513925056 513357391 512742004 512273827 511544075 510216026
3083.1 510216026 509325943 508613586 508111191 508130836 507925720 507305183 506741104 506567307 505935440 505280647
3092.7 505280647 504464645 503232651 502483330 501722946 501061287 500475197 500054703 499775734 499570274
3101.4 499570274 499370193 498410797 497515564 497139969 496991081 496129456 494740677 494137726 493396568
3110.1 493396568 492377968 491707230 491501579 491531830 491255608 490512886 489497757 489056511 488650360
3118.8 488650360 487528801 486591110 485778885 484732018 484265099 484102402 483591957 482719421 481612740
3127.5 481612740 481205597 481042480 480050926 478887291 478339844 478016663 477362823 476804962 476351700
3136.1 476351700 475763397 475183067 474528809 473667145 472759209 471692009 470697365 470249977 469687996
3144.8 469687996 468996010 468021622 467084427 466502762 465621452 465233231 464652176 463746223 463203506 462505646
3154.5 462505646 461864128 461106148 460395470 459448433 458756905 458635941 458091087 457358246 456550560 455922623
3164.1 455922623 455135231 454148750 453507042 452932434 451995506 450981483 450701714 450191841 449496727
3172.8 449496727 449138794 448690186 447985497 446720009 445867043 445347137 444629974 443892746 443128815
3181.5 443128815 442349663 441462440 441018333 440517616 439678650 439210510 438995132 438107643 436773300
3190.1 436773300 436154366 435742035 435203552 434372787 433187561 432485847 432369728 432016411 431366158
3198.8 431366158 430991592 430288391 429650841 429326668 428577080 427750740 427194939 426617546 425747032 425325966
3208.5 425325966 425110512 424748383 424313278 423348846 422519035 421800842 420841484 420042343 419853058 419805298
3218.1 419805298 419202919 418172913 417080498 416826210 416980934 416683426 415852470 415075798 414734688
3226.8 414734688 414111176 413366127 412567406 412076836 412228508 412343063 411899185 411230354 410643272 409927330
3236.4 409927330 409564438 408758354 407659492 407049065 406469803 405911942 405086937 404632454 404140053
3245.1 404140053 403611565 403570518 403082275 402229309 401321297 400931892 400429039 400038948 400020599 399201546
3254.8 399201546 398647766 398530922 398335991 397799797 397069130 396383514 395504341 395112343 395054436 394840698
3264.4 394840698 394250603 393644867 392905807 392109222 392174225 392456131 392162361 391150665 390509033 390270195
3274 390270195 389813728 389453583 388429794 387603912 387873840 388162346 387298546 386198997 386005096 385662422
3283.7 385662422 385245171 385199852 384975929 384322243 383884926 383812828 383335304 382744827 382355194 382250633
3293.3 382250633 382226105 382023582 381541672 381037750 380959282 380440521 379453812 378804283 378705330 378603783
3303 378603783 378020706 377736626 377793617 377777939 377333755 376341133 375713654 375465393 375192490 375039940
3312.6 375039940 374744186 374325027 373891296 373056374 372246361 372104950 372140732 371934967 371669579 371108017
3322.3 371108017 370380173 369849739 369519005 369469185 369020958 368314323 367882729 367333717 366895218 366568985
3331.9 366568985 366067123 365485382 365153999 365068512 364734192 363906555 363348846 363520279 363472748 362929153
3341.6 362929153 361931458 361242828 361098671 360533218 359720764 358864784 358583221 358236732 357548256 357114029
3351.2 357114029 356623840 356475639 355708427 355099411 354806023 353663406 353117867 353020287 353220863 352926903
3360.8 352926903 351712875 350970650 350602112 350338669 349852257 349391785 349043083 348289146 347364616
3369.5 347364616 346710777 345941086 345033531 344918518 344682350 344013710 343530426 343051147 342972260 343188972
3379.2 343188972 343114738 342367287 341512451 341121483 340794830 340444489 340294304 339950294 339570580 339488106
3388.8 339488106 338884811 338315201 338089638 337627487 337306938 337241821 337326241 336909332 336139450 335618935
3398.4 335618935 335269585 335125198 335230103 335584755 335681229 335373039 334938545 334714966 334378166 333896675
3408.1 333896675 333695641 333283806 333048706 333231316 333140755 332740326 332506332 332146301 331710701 331778603
3417.7 331778603 332003708 332376328 332411194 332219048 332197151 332162971 332119942 331518288 331592789 332424049
3427.4 332424049 332617378 332624931 332763519 332489777 332170677 332418480 332317238 332156792 332339020 332388840
3437 332388840 332265625 332465286 333229752 333566399 333838921 333839302 333962135 334352303 334451790 335111275 334667740
3447.6 334667740 334677505 335853806 336293869 336654320 336462212 336467400 337319183 338008575 338459740 338678398
3457.3 338678398 338410606 338371010 339093857 339768143 340780869 341643982 341874046 342068863 342512398 343133698
3466.9 343133698 343168449 343406906 343888168 344303169 344706573 344768867 345124435 346270523 347432289 347722664
3476.6 347722664 348197708 348714638 348917770 349536362 350443039 350607262 350389519 351531258 352464371
3485.2 352464371 353138809 353903351 354019127 354146004 354099274 355275497 356414604 356322784 356538963 357521706
3494.9 357521706 358923416 359561195 360339241 360820122 361040955 361915245 363049583 364270363 364217644
3503.6 364217644 363768234 364047661 364972649 365787544 367001991 368072128 367697830 369095192 370343552
3512.2 370343552 369925385 370083618 371270447 372798042 373024101 373132095 374487572 375791817 376348915
3520.9 376348915 377243004 377753868 377547493 378448372 379653320 380583382 380923843 381827507 382419319
3529.6 382419319 382869911 384341927 384945908 385751572 386856537 388496170 389239349 388724251 390084000
3538.3 390084000 391070518 391401443 391830292 393349190 395259476 396289673 396880264 396670227 398052101
3547 398052101 398609962 399477997 400686302 401182442 403239784 403522568 404086533 405611115 407406197
3555.6 407406197 409328690 408947258 409076042 410131569 411907272 413121529 414486046 415262756 414889717
3564.3 414889717 418198509 419796638 419643974 420714493 420063362 422464828 424356689 425367165 427223740
3573 427223740 429109306 430027885 431153908 432969704 433320465 435125084 436620331 436866074 438621559
3581.7 438621559 440337296 441200027 441573105 444971428 447148056 445698547 447751045 447523308 449241371
3590.4 449241371 452012596 454570427 456561775 456765709 459397430 459218063 460121803 463317299 464107361
3599 464107361 466275558 467094498 467750053 469636803 470950470 472944946 475963211 479276848 479048729
3607.7 479048729 481718102 482034950 479425316 484580307 486542358 484658089 487781792 487427368 490225067
3616.4 490225067 495040550 495884933 497094154 496435204 496005821 498004150 499763756 501448174 503486671
3625.1 503486671 504947929 505856056 510876846 514120903 505935249 508028984 511259537 515006447
3632.8 515006447 516832809 516037979 517566757 519199448 521461372 522512398 522943344 524808464 527258186
3641.5 527258186 528181610 527717819 529249382 531508713 535828323 536356659 532620049 536019783 536454926
3650.1 536454926 535157166 534451141 537871780 540264740 542229347 547318268 542795334 542808533 546520538
3658.8 546520538 547235756 548291740 548788834 550145912 551042366 552623062 554051056 554146156 557233429
3667.5 557233429 559259872 559155960 560393944 555727654 555023842 559967613 567589874 571365852 558214149
3676.2 558214149 557147675 563019867 567245483 565652046 564990730 567026367 568599701 569241219 569074097
3684.9 569074097 568773270 571425400 577123222 571825066 567380981 574356537 572338371 570276337
3692.6 570276337 573866272 574812737 575711746 575720215 575579948 577074051 577226410 578672256 581979713
3701.3 581979713 578669510 575201836 578688622 580471230 580259972 579780350 581216660 585356293 580342903
3709.9 580342903 582779808 588962021 578188286 579281197 583532143 584233780 583962669 585431557
3717.7 585431557 586613007 583273811 582936363 587586136 586058388 581384850 585511360 587996025
3725.4 587996025 588044548 585794868 584422913 586534462 586763496 592000237 592328491 583859787 589163589
3734 589163589 592344093 586962471 585339890 587128983 588011398 589488678 592139549 588670349 589262199
3742.7 589262199 598648987 594851723 578526649 584953766 589752312 594789047 593797989 584966850
3750.4 584966850 593969917 592395706 585509796 588804588 591126671 594651031 591369400 591876259
3758.2 591876259 597538643 593158417 589970245 592021217 593284874 594018326 597025108 595252838
3765.9 595252838 591002884 593162804 597117729 598841209 592345848 592660789 595353737 595533867 596529808
3774.5 596529808 596278877 596461754 596380920 598333855 599879913 593158226 593357582 595389328 596133804
3783.2 596133804 597852783 596334610 595931854 597033920 597573433 597511826 596569405 596781998 596904869
3791.9 596904869 597245941 597001190 597855263 601274948 598647385 594626236 595708046 598685379 604269295
3800.6 604269295 601351967 592304497 593649254 595138588 598552628 603841438 597859764 593567352
3808.3 593567352 596795731 597937546 598270874 598836060 598556442 599339867 604197159 604881554 592813950
3817 592813950 595319519 600273705 604289322 607968369 596393433 594573708 597323036 598186264 600137978
3825.7 600137978 600729675 597563896 597627640 599290047 601823807 603871193 597253189 597918549 603956490
3834.3 603956490 600195808 598254204 604801445 600136185 595340652 602535057 599041290 596253052
3842.1 596253052 601300888 600471535 597865715 599576302 600157928 600025864 601810150 600846024 601003952
3850.7 601003952 606118431 604311790 604979973 593743248 592042274 599462013 599519615 597882996 599215927
3859.4 599215927 601222839 603567009 599585838 598548050 604770851 603520279 596905708 597885246
3867.1 597885246 601244926 607159767 604414062 595875053 597073479 601047211 605630684 599176445
3874.8 599176445 597591286 600362511 599891167 601613235 606228180 603942070 596915588 600167236
3882.6 600167236 600908318 601485481 607845955 599637032 597697067 600159416 600305367 604136772 605213928
3891.2 605213928 598493385 598046494 600682297 599710350 599964600 600779686 602595863 604857903 597642517
3899.9 597642517 600724831 603017883 598892441 602863121 599444504 597002220 598541603 598992805
3907.6 598992805 599859467 599640808 600249863 600436249 600532341 600074463 599214821 600335388 602623024
3916.3 602623024 601708260 597861366 599666405 600856209 598737221 600272675 601308975 602002945 601300583
3925 601300583 598657417 598674431 599620857 601424751 600898743 599708099 601200447 599506607 598536835
3933.7 598536835 599615593 599092598 599730492 600254288 599655876 600001984 599880066 600828285 602218857
3942.3 602218857 598896637 597402954 598661270 599810028 600979614 599451294 600015221 600744514 598530235
3951 598530235 599602547 600079613 598667526 597914810 598187752 599225006 598926964 599004822 599166336 599443817
3960.7 599443817 599880867 598965111 598730049 598780556 598723145 599150925 599896126 600722046 600598106 599574432
3970.3 599574432 598995018 599002190 598884735 599248657 599648094 599359970 598659935 598134422 598426361 598643417
3980 598643417 598925667 599499359 599450836 598755035 598100128 598108826 598644180 599654770 599923439 599025040
3989.6 599025040 598678703 598422852 597726707 597769089 598281250 598473969 598472176 598618622 598759041 598459358
3999.2 598459358 598325195
4000.2 598325195
##END=$$ End of the data block
