##TITLE=$$ Begin of the data block
##JCAMP-DX=5.00 $$ ACD/SpecManager v 10.08
##SPECTROMETER/DATA SYSTEM=Varian
##DATE=04 Dec 2012 14:11:38
##DATA TYPE=INFRARED SPECTRUM
##DATA CLASS=XYDATA
##ORIGIN=
##OWNER=
##NPOINTS=3735
##FIRSTX=399.26403809
##LASTX=4000.35498047
##MAXX=4000.35498047
##MINX=399.26403809
##MAXY=69.96140289
##MINY=22.75445366
##XFACTOR=1.0000000000
##YFACTOR=0.000000100000000
##FIRSTY=50.89286423
##DELTAX=0.96440572
##XUNITS=1/CM
##YUNITS=TRANSMITTANCE
##XYDATA=(X++(Y..Y))
399.3 508928642 491368675 486785164 484275970 481114006 480930099 474276314 474128418 479336052 478948250
407.9 478948250 470736771 470386200 478361702 476579628 470394821 467108879 468831825 471547318 473465614
416.6 473465614 467779999 449629745 462527046 478180504 480265350 478006058 481150017 487606544
424.3 487606544 486684227 481107597 475346184 473274918 470672150 470643234 474242973 474520645 475451469
433 475451469 473344269 469132957 465652351 461976891 462245445 464430313 463933830 461825027 463673820
441.7 463673820 468782234 473862381 475195885 473079910 473111305 474656258 473006744 470818138 473929787
450.4 473929787 474541473 472305603 471911850 471812820 475438995 475731926 473599625 472930183 469941902
459.1 469941902 469392776 470720749 474448433 473447151 469988899 472018547 471352768 466153679 462921867
467.7 462921867 464890556 466848030 463484993 461786766 466522331 466412468 465333633 467136574 465295258
476.4 465295258 457960701 452384262 455303574 458264847 455019608 451161880 450153694 457552299
484.1 457552299 463342705 459523163 457396851 456940384 455481606 453609848 450011330 447933846 449039879
492.8 449039879 450494766 449594612 448713760 447017288 444328728 445735931 445289001 442933159 440762901
501.5 440762901 437688408 436141129 435605164 440208015 443930931 444995880 442074051 436004066 435078201
510.2 435078201 432601128 427770844 425897675 425229111 426375961 427855721 427367325 424830170 424273338
518.9 424273338 423079872 419453812 415616989 413917160 414315567 414957085 416448212 415517426 414768257
527.5 414768257 414637184 416286469 417718773 414928589 414475441 414897423 413881798 415856094 419402618
536.2 419402618 420479889 422222023 425266609 426696396 428220444 428691139 427457542 425538979 425055313
544.9 425055313 425875359 426596489 429373970 431804237 433538322 433324738 430984192 428804932 426346626
553.6 426346626 424810104 422888451 422026100 423715324 426069336 426455154 425140038 423669777 420180283
562.3 420180283 417351952 415720787 413902130 411903572 409998970 409655685 408878899 407621040 405157356
570.9 405157356 402785072 400652008 399623795 399879417 398610344 397752190 396954803 398702621 400904732
579.6 400904732 402585068 404599876 406832809 410249596 408906364 408517227 411072731 413161964 415454025
588.3 415454025 416817245 419294319 420658913 421674500 422513428 422548218 421376114 419460869 420620804
597 420620804 421112747 421186829 421749535 422014580 423756866 424692116 424366531 423322067 422518234 422081604
606.6 422081604 421290817 420719070 420992813 421711502 422883720 425135841 427278709 429147148 429608307
615.3 429608307 429889908 430364990 429409409 429838943 432575340 435975456 437868996 439739151 442054253
624 442054253 443619652 445613289 447329559 447957191 447930069 447779770 448406563 450187225 451670151
632.7 451670151 453807030 456470642 457823944 459475517 459816132 458957939 458243370 457193832 457709351
641.3 457709351 458477936 459520874 461642494 462986641 464304581 466037140 466081963 465148849 465226707
650 465226707 464586449 463247223 464098282 465948524 466557121 467653160 469519386 470163803 469219437
658.7 469219437 467183456 465779953 465096588 465330505 466792984 467307205 468020859 470642357 475802765
667.4 475802765 479724503 474160385 471202011 470200119 470943375 470810471 471112938 471856079 471984062
676.1 471984062 472629318 473598976 474436264 474350700 474498558 474866753 474601898 474959221 476067657 477123833
685.7 477123833 478016930 479653244 480587311 479414177 478474731 478349152 477198067 475596466 474415588
694.4 474415588 473855782 474532166 474612236 474619484 474976006 474226723 473508072 471991882 469724236 467101097
704 467101097 464594803 464090843 464977188 466576157 467829475 469153366 469706459 468875618 468979874
712.7 468979874 469262657 469004364 468854752 469409752 471068268 473859100 476779747 479180450 481518250
721.4 481518250 482983513 483984337 484802361 485577812 487510071 490025444 492360344 494456711 497205544
730.1 497205544 501484795 505423622 507404366 507581367 507101517 507605247 507559090 507652016 509785652
738.7 509785652 511462250 512811470 514557304 516135101 517533722 516328430 514173737 513458443 511293831
747.4 511293831 508676796 508121223 508399086 507530098 506552925 507064438 507249908 505925140 503357620
756.1 503357620 500568810 497702675 495630608 495875473 495856171 495247993 496358528 498333855 499787521
764.8 499787521 500382156 500025940 500007935 501205902 502481194 504335442 507117996 509949112 513766327
773.5 513766327 517868462 520349350 521851196 523532944 525037918 526586342 528372841 530205612
781.2 530205612 532618752 534681969 537792664 541289139 543191032 544772339 545147476 544793472 543839569
789.9 543839569 544073105 545479546 545843201 547776489 550842209 553414154 555256577 557056503 558184853
798.5 558184853 557792778 558017502 558827705 559794579 560783157 562974281 565702553 568040733 570147667
807.2 570147667 571282845 572284088 571991959 572039948 572518997 572012787 572450218 573739738 574596481
815.9 574596481 575195503 577069435 578489571 579011688 577959251 575219116 573362579 571922226 571089783
824.6 571089783 570003357 569581413 569902763 569440460 568872070 567630501 565031586 561405792 559033737
833.3 559033737 556612701 553982010 552350960 551002197 550985146 550693970 549198036 547109756 545194855
841.9 545194855 543489494 541365471 539229469 537087326 535649757 535208893 535867310 536715508 537439079
850.6 537439079 537336655 535869980 534796028 533901024 533509140 532459068 531213951 531818275 533206329
859.3 533206329 535009995 536223030 537375145 538700218 539781647 541233292 543078766 545560036
867 545560036 547913895 550500717 553572578 558463707 563681488 566619911 569055824 570529747 571667709
875.7 571667709 572714539 573382607 573891029 574752731 575584221 575249138 575361214 575253525 573998718
884.4 573998718 571402168 568814735 565565453 561839409 559586868 557128754 555493469 553856621
892.1 553856621 552447586 551829262 550610886 548497276 544320564 541444931 540274734 538612175 536994972
900.8 536994972 535767365 534375305 532515564 531628990 530202484 527440224 523900261 520270195 517340927
909.4 517340927 513808594 510688820 508772545 506811676 504220810 501543465 498989754 495203362
917.2 495203362 490650139 486972389 483694878 480957832 479381104 478377953 477734718 476869125 476288071
925.8 476288071 476141777 475089073 474192619 474023399 473651543 473402176 473437309 474145126 475363464 477093468
935.5 477093468 479261780 480263367 480795555 481763840 482708206 483495293 484497833 485986748 488006973
944.2 488006973 490154686 490738449 490517921 490587959 490224648 488580704 485491562 482289047 479391136
952.8 479391136 476878242 473978806 470099297 467180252 463943825 459309616 455039597 450460777
960.6 450460777 444876709 439024048 433741531 428354492 422708015 416841164 410746193 404822769
968.3 404822769 398556519 392191811 384745026 376826248 368500214 360572510 353251610 345120773
976 345120773 337973022 330008659 322291794 314993305 307686291 300687542 292587986 286088085 280135841
984.7 280135841 274782734 269525795 265118713 261749802 258406143 255955849 253255405 251873627
992.4 251873627 249415455 247356644 246042767 244827919 244271622 243198948 244018860 243289700 243420200
1001.1 243420200 244408035 244374561 244038334 242683792 243014317 242595901 242304916 240968475 240097256
1009.7 240097256 239969501 238202991 237304649 235177364 234164581 232588329 231139050 230444183 229188499
1018.4 229188499 228789654 228029213 229136791 228429394 228492165 229364471 229907551 231271915 230950489
1027.1 230950489 232003956 231272850 232142315 234002991 234582863 235471954 235301170 236582928 236611824
1035.8 236611824 237506733 237324257 236451683 236482944 236136818 237493153 237411442 238397102 238295250 238635693
1045.4 238635693 240065746 240474720 241306553 240926361 242395630 242599602 243450699 244684887 246275902
1054.1 246275902 249569035 251067905 253722687 255440979 258705845 261750374 263884964 266968288
1061.8 266968288 270343819 275909920 279495010 283337307 286162872 288471909 290332584 289684143
1069.5 289684143 288794708 285477638 282075634 277297783 272457047 268268166 264722042 263061028
1077.2 263061028 261087627 261447086 260647736 260589027 261153622 261841640 262967186 263285027 265794659
1085.9 265794659 267847881 271679306 274103947 275676746 278539028 281034107 284441090 285990372
1093.6 285990372 288001537 289310818 290966454 292636337 293031788 293593445 294358788 296593380 296387253
1102.3 296387253 297138271 297710590 297625523 299064941 299268436 300670452 301897125 304088402 305495243
1111 305495243 306652336 308213463 309112320 311301098 311700954 312912941 314186592 315040588 315808487
1119.7 315808487 316637917 318603096 319492016 321411438 322470589 323722649 324568901 324891701 326446152
1128.4 326446152 327084579 328997536 330896416 332819099 333498802 333712540 334058075 332539520 331333466
1137 331333466 329255753 327664185 325527992 322831612 320432739 318073559 316186428 313347416 311786880
1145.7 311786880 308899517 306326199 303806400 300494881 298673077 296332340 295550537 293966846
1153.4 293966846 293012562 292107258 291584187 292707291 292260609 292940388 293214684 294767971 296456413
1162.1 296456413 298314266 301823330 304978333 309524364 313758526 318298550 322577324 327722168
1169.8 327722168 333114929 337867661 343330421 348358040 354712219 360633812 366401291 372226372
1177.5 372226372 377787895 383519897 388288116 392619591 396030884 400214005 405098572 409274712
1185.3 409274712 413069878 417060165 420812187 423889847 426949501 428773041 429838943 430980606
1193 430980606 432379036 433706627 434362984 435118637 435899696 436911774 437599907 438089981 438456841
1201.6 438456841 438502846 438912315 439330559 439859200 440190125 441163025 442603531 443855896 445415459
1210.3 445415459 446766853 447965240 448760796 449500427 449948578 450691528 451864090 452551651 453463860
1219 453463860 454229507 454782562 454624329 454204865 453847885 452660522 451253242 449713745 448809891
1227.7 448809891 448239288 447435684 446705170 446014366 445463676 444315529 443149719 442001953 441128654
1236.4 441128654 440512276 440066147 440289001 440546761 441266785 441549377 441715393 441974487 442193947 442834625
1246 442834625 443107147 443741798 444794617 446488266 448023605 449193230 450712967 452104797 453277626
1254.7 453277626 453930779 454679451 455052032 455308495 455923653 456865997 458634644 460059509 461164894
1263.4 461164894 461982574 462644119 463189278 463739510 464663010 465484848 466159172 466775856 468136559
1272 468136559 469544296 470759544 471794548 472150955 472534599 472507057 472642822 472871780 472649765 472877502
1281.7 472877502 473527718 474624634 475909119 477103386 477696037 477597466 477550468 477659416 477688026 477547722
1291.3 477547722 477287140 476797485 476461678 476592903 476876488 477215347 477297096 476873512 476002121 475055580
1301 475055580 474166069 473458710 473359261 473622742 474050903 474244194 474166183 473834190 473181763 472746086
1310.6 472746086 472150078 471201859 470456696 469856758 469392357 469312515 469368935 469101372 468401299 467254829
1320.3 467254829 466261024 465102005 463751564 462987556 462279816 461875343 461774178 461086159 460100708
1328.9 460100708 459212646 458191910 456952629 455816536 454886818 453960266 452993011 452601929 452685394
1337.6 452685394 452922020 452667427 452068100 452402992 452710915 452615166 452166367 451861305 451747055 451531754
1347.3 451531754 451521606 451611443 451645699 451773491 451690140 450664749 450218391 449849396 448367348 447785530
1356.9 447785530 447643700 447445374 447181816 446917915 446902962 446285172 444363022 442777176 442148476
1365.6 442148476 441213455 440417824 439749413 439492416 440096588 440267754 440789261 440813141 440024605 439476204
1375.2 439476204 439092102 438722267 437834435 437870674 438668938 440382576 441813850 443033257 444600372
1383.9 444600372 445605621 446927109 447465515 447708931 449012871 450597839 451707115 452353249 453086891
1392.6 453086891 453399467 453482704 452886810 453125191 453200455 452881393 451742935 450792809 451230469 450885773
1402.2 450885773 450875359 451191788 451034279 451245728 451485825 451384239 450317345 449405098 448383980
1410.9 448383980 447583733 447015038 446531982 446621742 446434746 446231728 446172714 447202721 446246033 446002655
1420.6 446002655 447318878 447489395 448078499 448476143 449688759 450932617 451375732 451581459 450897446
1429.2 450897446 450282555 449899368 450378609 450063362 449458504 449963989 450377502 449441795 448769073 450129585
1438.9 450129585 450285225 450233307 449959831 449283180 449294815 448730621 449063835 448877983 448948021 447728424
1448.5 447728424 447132530 447262001 445477104 444171104 442070618 441394997 440067482 438664742 437771263
1457.2 437771263 436003761 440060158 440325737 442243195 442547760 442973785 444696426 443601265 445078125
1465.9 445078125 445878067 450472107 455984993 463608208 471460533 477554741 486122818 490116005
1473.6 490116005 496526413 500463753 505269089 509893074 513781090 518407593 521804161 525951691
1481.3 525951691 528369217 531384621 533537331 534529190 535968666 535847168 536878853 538390274 539946289
1490 539946289 540302429 541931496 543287048 543416328 544281349 543613892 540051575 540588188 540388489
1498.7 540388489 538737106 539838104 540747910 540214653 540272560 540653458 540896263 535388870 529236412
1507.3 529236412 529546204 528789291 527435532 527341194 526411285 524430046 524726868 524255943 523220825
1516 523220825 521791420 518340912 519825401 520999565 519025955 516813126 518223953 521354637 523032875
1524.7 523032875 522217216 521714439 521793175 520325546 519710464 519850082 519188461 519464493 518355980
1533.4 518355980 516077728 517666969 518645859 519583588 521216507 519866905 511867790 513890495 514526672
1542.1 514526672 514767418 517357368 518507233 518895111 520886574 522437744 523358765 523677444 523225021
1550.7 523225021 525510712 527590370 528831406 529940529 531071358 535418015 539286194 538323441
1558.5 538323441 538815460 536611404 541341629 543680573 545462914 546536865 546959267 548643875 550694427
1567.1 550694427 553086853 554455872 553626213 554254913 556241112 557091255 557197800 558341179 558969612
1575.8 558969612 556314201 557142563 559103737 560002403 560564842 560218658 559530602 558594551 557286606
1584.5 557286606 556568069 555400162 554491501 553744545 553535309 553042984 552144394 550800781 548990402
1593.2 548990402 547341537 545032654 543589554 541601715 539607277 537904282 536729431 535642433
1600.9 535642433 533763351 532161522 528939590 526247482 523991165 521279869 517888870 515318413
1608.6 515318413 512887001 509523582 508076477 505334663 502648849 499325371 496882172 494581528
1616.3 494581528 484117393 482640648 480575294 478635864 475367661 472837219 470428238 464142876
1624 464142876 462091103 459055786 456891365 451929741 447362862 444751892 441442146 438989944 435937233
1632.7 435937233 435570145 434500160 428200722 423977966 423735542 421630211 419328003 418685532 416493759
1641.4 416493759 416513710 414735832 414563522 415590591 413065796 412149506 408610535 410120010 410300636
1650.1 410300636 411825714 413614044 408353958 404902344 407270660 411668053 412706833 414390640
1657.8 414390640 415297012 416733971 418148575 418979721 421485214 421548195 424833908 426940689 429158440
1666.5 429158440 431664238 433940086 436300316 436684494 440401802 441335526 444286385 447630730 449911995
1675.1 449911995 452612534 455423737 459431534 461790543 465028458 466644630 469652367 474032021
1682.9 474032021 475515633 479050484 479810371 484502907 488202591 491029320 494331284 497284317
1690.6 497284317 500896072 503662148 506612740 509982834 513509789 513435593 517361717 522499580 527576447
1699.3 527576447 533347244 529811287 534165154 537945900 540147247 540710602 541689758 543122292 544795227
1707.9 544795227 547182198 548258095 549325180 550854874 552262535 553931465 554018707 553966522 555747223
1716.6 555747223 556467285 554336128 557427559 560189514 561718864 562744102 562868271 562160797 561337852
1725.3 561337852 560018044 558159103 556791573 556057167 553115044 549848862 549709435 549462051 542377472
1734 542377472 530634804 529347649 526957932 522504044 518917427 512452545 504153633 502261047
1741.7 502261047 500487595 495437622 494179230 494743004 496428108 498676910 502291489 508737106
1749.4 508737106 515153923 525547066 534371796 544542732 554908028 565210342 575492363 584246864
1757.1 584246864 593949585 601072617 607616653 613823814 619283714 624693794 629463005 634073753
1764.8 634073753 637558365 640997162 643688431 644013214 646408844 649725342 650776062 649576416
1772.5 649576416 650625305 654557266 657094040 657079926 658946075 660414047 661515656 662118073 661468582
1781.2 661468582 662517929 663982697 665628510 665660629 665458603 667244034 668293762 668728485 669699478
1789.9 669699478 669950790 670290222 669382324 668666229 670807800 671966705 671820221 673002167 674806366
1798.6 674806366 675183258 674309921 675055008 674608612 674816284 675932312 676174698 676961212 677622070
1807.3 677622070 677991714 678845062 679662094 678980408 679305496 680197830 680046005 680302200 680357895 680773468
1816.9 680773468 680914764 681496506 682645035 682858429 683437271 683367310 683613510 684027634 681849594
1825.6 681849594 681537399 683069229 684752884 685551987 683854446 684426193 686154404 686265793 685839157
1834.3 685839157 685150223 685014420 685045395 684517136 685312576 685884323 686689682 687281876 688170700 688435211
1843.9 688435211 684182358 685197525 686647720 686325378 685878677 686474380 687353973 687344513 688095703
1852.6 688095703 688271027 688503113 688622131 688315811 688226624 687213135 687061920 687156754 687726898 688402481
1862.2 688402481 688483276 688841324 689361115 689829712 688955536 688647232 687561111 686146469 687115250
1870.9 687115250 688021927 688764648 689107513 689370651 689354553 689327774 689143677 688883972 689071732 688955765
1880.6 688955765 688898392 688579102 688982544 689531555 689706268 690110245 690063248 690649033 690344391 688652802
1890.2 688652802 688884201 689454727 689351120 690117798 690652695 690180588 691008759 691436005 691194839 690635071
1899.8 690635071 689972229 689843826 689729156 690138016 690393753 690778580 691031570 691013412 690808945 690394135
1909.5 690394135 689926529 689227066 689680710 689708252 689748077 690074615 690362167 691291962 689988937 689606628
1919.1 689606628 690324783 690590210 690822906 689392548 688557739 688985901 689531250 689809189 690308838
1927.8 690308838 690746918 690935898 690903091 690213470 689951782 689449997 689097672 688733597 688664169 689374008
1937.5 689374008 689687271 690266113 690248108 690520020 690467529 688821182 688900528 688851242 688144608 688431778
1947.1 688431778 688983536 688931274 689383926 690076904 690207367 690368195 689994278 689204025 688602142 688477325
1956.7 688477325 688570709 688727188 688880539 689193573 690003052 690404129 690381393 689803162 689158783 688741226
1966.4 688741226 688071289 687787323 688112259 688825150 689056931 689396515 689764862 689797592 689635925 689063568
1976 689063568 689160309 688851700 688072052 687793045 687720337 688071289 688619690 689117813 689235840 689321442
1985.7 689321442 689265747 688884506 688338547 687705002 687426453 687308121 686826248 686674957 687718811 688312225
1995.3 688312225 688255615 688188019 687775803 687514954 686805496 686418686 686412735 686426010 686561050 686706085
2005 686706085 687259598 686918335 686317062 686208496 685795746 685159378 684919052 685058975 685037460 685383530
2014.6 685383530 685481033 684991913 684186325 683721466 683525696 682933960 682616196 682089767 681830063 682213364
2024.2 682213364 682524109 682522202 682407532 682438354 681816864 681066589 680374527 679916000 679704742 679414825
2033.9 679414825 679469452 679622574 680085831 680221481 680076752 679898529 679295883 678407898 677713776 677654648
2043.5 677654648 677459412 677630386 677956314 678126068 678349304 678336105 678448410 677953415 677333832 676618576
2053.2 676618576 675890808 675786819 675935135 676317368 676749344 677674103 678146515 677919312 677700424 677304306
2062.8 677304306 676625671 675718994 675485535 675449677 675784988 676292801 676528473 677011337 677226715 677094650
2072.5 677094650 676618576 676258926 675921478 675620499 675208054 675045242 675669174 676131821 676943283 677660751
2082.1 677660751 678010101 677626266 676780319 676539230 675936584 675478058 675159607 675395889 675973816 676214371
2091.7 676214371 676499329 676418686 676647720 676487427 676157837 675818634 675348358 675175323 674782410 675164566
2101.4 675164566 675949097 676549530 676667557 676627808 676534348 676009216 675865555 675310364 674707336 674681778
2111 674681778 675286713 675917816 676196899 676550140 676201477 675839310 675509186 675185699 674999847 675071640
2120.7 675071640 674895554 674237289 674953537 675618973 675738678 675924759 675694275 675201340 674678574 674669037
2130.3 674669037 674316559 674159241 674115906 674177551 674692535 674905930 675157623 674908981 674935379 675094757
2140 675094757 674539795 673805313 673633270 674216843 674451828 674667892 674756088 674920044 675022736 674701996
2149.6 674701996 674445038 673913345 673624268 673486938 673609390 673621521 673851395 674571533 674791031 674964218
2159.3 674964218 674729462 674612198 674561310 674369202 674380569 674272995 674412079 674546738 675125732 675411072
2168.9 675411072 675393448 675821686 676069717 675872955 675253296 675160446 675192184 675555267 676160736 676532059
2178.5 676532059 677025223 677029190 677388000 677857285 677663345 677060089 676614761 676411591 676362991 676847534
2188.2 676847534 677394180 678200073 678501511 678691177 679177475 679028473 678663864 678028107 677814560 677639542
2197.8 677639542 677619171 678341751 678894119 679125061 679295807 679770203 679645309 679194183 679006653 678843994
2207.5 678843994 678576889 678334808 679040985 679923859 680580902 680769196 680857773 681213303 680957489 680614319
2217.1 680614319 680337982 680301895 680258179 680148621 680275955 680632401 681273956 681524811 681440125 681165924
2226.8 681165924 681107178 681058884 680740356 680405273 680232086 680515518 680911026 681360245 681398163 681610794
2236.4 681610794 681737747 681392212 681220093 680995636 681271973 681117249 681134720 681411896 681418915 681921005
2246 681921005 681702728 681505356 681325684 680927887 680676575 680690231 681044769 681101303 681618729 681630096
2255.7 681630096 681401978 681496887 681441727 681314926 680851746 680977325 681109085 681222687 681337585 681492386
2265.3 681492386 681747131 681831818 682510986 682460937 681781845 681482239 681621780 681136017 680415802 680697327
2275 680697327 680945282 681724472 682220001 682522430 682544861 681742630 681319122 680529785 680273895 680255203
2284.6 680255203 680507812 681168594 681722107 682713852 682914734 682842484 682376022 682078857 681869202 681190796
2294.3 681190796 681437988 681630096 682217789 682809067 683346329 684349213 684922485 685279617 684967422
2302.9 684967422 684543152 683736572 683404388 683833237 684177475 685047913 685406189 686588821 688073196
2311.6 688073196 688117142 688067780 687673645 687377853 687686768 687851334 687431793 687886124 689572220 691329193
2321.3 691329193 692886353 693075180 692357025 692563629 693289185 692863770 692359085 693121567 693105316 693012772
2330.9 693012772 693897324 694845581 695611954 695885391 696368713 695929489 694462280 694361496 695302124
2339.6 695302124 695610809 694825516 694648895 695029755 695402298 694669495 692544250 690541077 687465210
2348.3 687465210 686995010 689617157 690503387 692406082 695175781 695934753 697140656 697647781 699238815
2356.9 699238815 699207230 697431870 697287216 698715363 699614029 697961349 696804276 696714706 697447052
2365.6 697447052 696669083 694605408 693884201 692616882 689654770 686800156 685545883 685054169 684409561
2374.3 684409561 682947311 681609802 680825119 679596100 678016663 676545944 675380859 674062042
2382 674062042 673282852 672547379 671456909 671161880 671042328 670941238 670812683 670973511 671188812 670714951
2391.7 670714951 670043335 669334335 669351654 669338074 668898773 668941879 669333954 669567032 669130707 668694305
2401.3 668694305 668492203 668290253 667724152 667215576 667057037 666870804 666924744 666921844 667185287 666870956
2410.9 666870956 666337509 666445999 666205215 665964661 665260086 664625397 664552841 664557037 664847412 664971466
2420.6 664971466 664726028 664297943 664134750 663773804 663214417 662548218 662093735 662238312 662120895 662019806
2430.2 662019806 661819305 661668243 661553268 661442490 661341858 660519180 659816589 659406815 659404068 659368439
2439.9 659368439 659021835 658872604 658766251 659057770 659072037 658627777 657996140 657612610 657180862 656488113
2449.5 656488113 656168213 655789032 656170578 656349411 655842667 655653992 655354233 655216827 654927826 654671326
2459.2 654671326 654160995 653420334 653232422 653353424 653389816 653153610 653164291 652839737 652429581 652325058
2468.8 652325058 652121277 651847382 651348877 651121597 650813446 650880814 651458206 651463623 650744171 650045547
2478.5 650045547 650120773 649974976 649594193 649157791 648812485 649073257 649128876 648787079 648290329 648152542
2488.1 648152542 648171692 647997742 647588425 646887283 646556931 646657028 646830750 646538925 646421661 646898880
2497.7 646898880 646964569 646472397 645815887 645476685 645429459 645303192 645099411 645210571 645365295 645112000
2507.4 645112000 644918137 644899826 644597321 643796921 643233948 643089523 643065033 643104477 643010178 642994385
2517 642994385 642999878 642853317 642680206 642709579 642291031 641593628 641382141 641127396 640983429 640949249 640776215
2527.6 640776215 640533066 640783005 641111908 640813828 640669937 639851494 638661156 638137665 638151016 638545990
2537.3 638545990 638574791 638528099 638568153 638733673 638586807 637797394 637187614 636741982 636126785 635489807
2546.9 635489807 635288277 635212669 635273247 635438156 635457230 635453758 634852638 634042664 633512230 633089638
2556.6 633089638 632677689 632646294 632682762 632454720 632570000 632658997 632751846 632313080 631637840 631473351
2566.2 631473351 631179123 630938568 630375214 629713860 629574814 630203133 630507736 629749908 629577370 629657211
2575.9 629657211 629208908 628370094 627854881 627819710 627362061 626548882 626095085 626540298 626702042 626414185
2585.5 626414185 626147804 626023674 626273232 626001396 625263290 624456024 624223671 624258118 624293709 624614525
2595.1 624614525 624568329 624249268 623550720 623246307 623138466 622427864 621865578 621778107 621899147 621608391
2604.8 621608391 621396446 621093025 620792656 620871735 620426407 619772034 619407997 619079590 618431740 618231430
2614.4 618231430 618155365 617804794 617807465 617422676 617087898 616683617 615885773 615234833 614698029 614568214
2624.1 614568214 614486465 614081039 613674774 613363686 612762794 612408524 611946259 610921707 610428505 610068092
2633.7 610068092 609624329 609186935 608955536 608930244 608408890 607895241 607660561 607258492 606524734 605941734
2643.4 605941734 605386276 604882851 604442101 603912964 603903389 603618622 602935028 602281990 601826744 601634102
2653 601634102 601086197 600516701 600017738 599532852 599120712 598815346 598532333 598361511 598326263 598018456
2662.6 598018456 597451630 596485634 595920029 595572472 595219803 595118065 594294395 593517952 593604240 594062080
2672.3 594062080 593840103 593285103 592768021 592024345 591835098 591454620 591117630 590918274 590475044 590237122
2681.9 590237122 590041733 589855232 588960648 588351402 588376274 587829399 587100754 587011070 587076645 586508904
2691.6 586508904 586490784 586526108 586051178 585699043 585287399 584930038 584203949 583614769 583384743 583197021
2701.2 583197021 582909813 582546844 582259254 581789665 581643600 581414185 581128654 580719833 579888039 579446869
2710.9 579446869 578921776 578424911 578533745 578341980 577506294 577412682 577600174 576963577 576327248 575587692
2720.5 575587692 574934120 574625587 574117165 573444099 573213806 573150291 572811203 572494888 571825256 571357002
2730.2 571357002 570918388 570340729 570282860 570323105 570221748 569735298 569455605 569029274 568542175 568373184
2739.8 568373184 567764359 567608032 567513504 567080193 566809540 566662254 566668282 566459999 565854836 565265732
2749.4 565265732 565227165 564792709 564139214 563767242 563281975 563005295 562682190 562364731 562006226 562010117
2759.1 562010117 562068939 561690788 561224747 560326195 559722290 559393501 559271507 559270592 558872528 558761292
2768.7 558761292 558706017 558364220 557919540 557428551 556841888 556514130 556104355 555463943 555210114 554705009
2778.4 554705009 554321060 554249916 554286804 554094429 553014183 552078629 551545982 551166687 550695686 550008163
2788 550008163 549372559 548701134 548405838 548155670 547522049 547183304 546818314 545656319 544875908 544527130
2797.7 544527130 543735008 543275604 542964058 542256203 541319695 540613136 540040970 539210434 538326149 537500610
2807.3 537500610 536709938 535695496 534905243 534245224 533429718 532614746 531653061 530802460 529587288
2816 529587288 528208466 527134209 526132736 525059738 523961143 522736893 521172981 520127754 518898697
2824.7 518898697 517231331 515937920 514274635 512370415 510675621 509112358 507174911 505093994
2832.4 505093994 503254166 501408806 499335175 496834335 494659157 491929169 488061180 484161606
2840.1 484161606 480159225 475334473 469590225 463680077 457147675 449787254 441893387 433512459
2847.8 433512459 425243568 416880646 409016495 402257767 396774025 393069305 391230278 391378059
2855.5 391378059 392942543 395565147 398916473 403173180 407873802 411927872 415834465 419361649
2863.2 419361649 421891937 423891449 425612564 426332397 426432953 426208229 425276108 424422302 423904533
2871.9 423904533 423363304 422898026 423244286 423753166 423893242 423869553 423253975 422666740 421914864 420980225
2881.6 420980225 419682198 418172264 417068520 415675774 414487572 412639542 410528793 409486237
2889.3 409486237 407822647 405708733 404173622 402614670 400613251 398560448 396316833 394175110
2897 394175110 392304077 390036507 387733459 385448914 383369827 381079788 378450966 375709991 372571449
2905.7 372571449 369473419 365771179 362055931 358445625 354309273 350172462 345443344 339987259
2913.4 339987259 334006920 328118553 321963844 315404415 309235821 303131962 297540112 292518253
2921.1 292518253 288459015 284958286 282104797 280679264 279936428 280017147 280585918 282157917 284535599
2929.8 284535599 287390652 290777740 294075050 298524895 303741455 309045811 314608955 319874134
2937.5 319874134 325059814 330652313 335960693 340956001 346376686 351274147 355567970 359609985
2945.2 359609985 363223190 366389771 368868904 370930634 372651520 373912621 374675064 375467033 376371498
2953.9 376371498 377119293 378231735 379869919 381692886 383658943 386317749 389134216 391798134
2961.6 391798134 395049248 398932266 402929687 406750145 410992126 415501709 419797668 423815308
2969.3 423815308 427553139 431260834 435223885 438878899 441595039 444312477 447452316 450846214
2977 450846214 453540459 455419998 457788353 460402946 462816467 464808350 466868439 468662415 469858208
2985.7 469858208 471495094 473285751 474626732 475239105 476316566 478003044 478772697 479072914 479253578
2994.4 479253578 479405975 479718361 479387550 478268394 477637978 477216377 475950165 474561195 473172188
3003.1 473172188 471683006 470485497 469521904 468524132 467679863 467367096 467185516 467133751 467699356
3011.7 467699356 468754120 469729767 471169548 472722282 473346291 474511719 475998344 476388321 476479340
3020.4 476479340 477175865 478138161 478751678 478945847 478865929 478867874 478945465 478946838 478586884 477853088 477120667
3031 477120667 476669197 476741104 476453323 475536461 474637527 473841286 473143005 472494469 472167549 472039528
3040.7 472039528 471160431 469958420 469458618 468875923 468196907 467478790 466304092 465543327 464822845
3049.4 464822845 463712769 462504463 461660233 461265907 460643501 459929161 458728867 457122955 456023636
3058 456023636 455330620 454516449 453703957 453097878 452557640 451996269 450704117 449576874 449291916 448638535
3067.7 448638535 447450829 446600304 445948753 444492645 443322411 442792587 442515602 442450714 441581535
3076.4 441581535 440342178 439240227 438713608 437924118 436796417 436590538 436062851 434915123 433749657
3085 433749657 433045273 432127838 430908241 430438538 429622498 428578415 427799988 427150345 426505585 425583725
3094.7 425583725 424604759 423612328 422922745 422349281 421703453 420779572 419720993 418508835 417183876
3103.4 417183876 416528854 415961914 415238495 414555740 413941574 412977333 411713943 410829353 409701309
3112 409701309 408566017 407923317 407490921 406396217 405181046 404588242 403469658 402556534 401954536
3120.7 401954536 400735130 399071541 397872429 397534637 397009811 396185379 395175514 394198952 393509560
3129.4 393509560 392711601 391485252 390475578 389950409 388702698 387214622 386224022 385898628 385386581
3138.1 385386581 384070244 382990646 381699715 380605392 379912148 378919258 378093681 377161903 375931129
3146.8 375931129 374722710 373580971 372535248 371837654 371034698 369958305 369089813 368491821 367625122
3155.4 367625122 366099701 365166283 364634132 363665276 362673912 361896439 361261024 360242271 359293976
3164.1 359293976 358509293 357623177 356581497 355443039 354514275 353442268 352311783 351113396 350418129
3172.8 350418129 350049934 349145622 348453598 347887650 346450844 344683914 344048691 343646049 342834244
3181.5 342834244 342143555 341486549 340889320 339799919 338557854 337656631 336624222 335279465 334359550
3190.1 334359550 333758965 333005066 332391396 331377907 330740547 330042191 328997459 328452110 327596207
3198.8 327596207 326843109 325911255 325108643 324426384 323475609 322843208 322158966 321605568 320520287
3207.5 320520287 319679241 319343357 318453503 317511349 316764088 316212425 314939289 313877411 313680840
3216.2 313680840 313564663 313119621 312350044 311869049 310894890 309932346 309174728 308607178 308111839 307284756
3225.8 307284756 306863194 305858059 304966812 304443684 303936253 303835621 303151836 302376499 301420975
3234.5 301420975 300337830 299751778 299425831 298877678 298001595 297380981 296999226 296428394 295511703
3243.2 295511703 294842892 293893490 293061161 292842636 292473984 292326355 291623688 290501957 289353256
3251.9 289353256 288641319 288570938 288006783 287345142 286637993 286218414 285608845 284793606 284434776 283969555
3261.5 283969555 283706074 283158798 282690907 282270317 281427231 280623341 279851322 279812355 279884205 279335995
3271.2 279335995 278590221 277846584 276977749 276253738 275629349 274982662 274886761 274553852 274039497 273404446
3280.8 273404446 272783070 272703114 272126999 271398087 270778427 270482063 270590534 270089970 269566345 269482365
3290.4 269482365 269074116 268472309 268125877 267384701 266876774 267111053 266686153 265519657 264909496
3299.1 264909496 265007591 264896793 264559879 264097652 263712482 263666916 263362846 262895451 262599010 262203617
3308.8 262203617 261850586 261834488 261411095 260570774 259800701 259327564 259514103 259564037 258953590 258137913
3318.4 258137913 257824574 257518101 257036190 256693630 255996075 255543423 255171909 255023022 254718533 253900375
3328.1 253900375 253684216 253812428 253910084 253006668 252057667 251846809 251487007 251426105 251138096 250540657
3337.7 250540657 249966412 249965801 249867592 249156647 248850384 248542938 248234406 247661648 246966591 246278534
3347.3 246278534 245927887 245958576 245359039 245072517 244975624 244556885 243943939 243653545 243321991 242327862
3357 242327862 242151012 241966248 241306553 240851383 240532551 240247898 239885025 239693279 239410553 239289131
3366.6 239289131 238927021 238435497 237655544 236797352 236667690 236372185 236256142 235868187 235536747 235474339
3376.3 235474339 234821320 234418201 234081211 233806229 233415222 233101864 232842903 232657337 232770386 232183685
3385.9 232183685 231761169 231586380 231425629 231447773 231418743 231097717 230554600 230899830 230842228 230173283
3395.6 230173283 229951305 229819679 229490128 229256821 229460087 229217262 229058514 229318810 228877087 228302021
3405.2 228302021 228446445 228554859 228310108 228329163 228404636 228661385 228541775 228059330 228041763 228219852
3414.8 228219852 228264637 227920933 227929649 228132591 228222675 228046303 227569733 227655525 227544537 227701683
3424.5 227701683 228620892 229365273 229358559 228729801 228580379 229021378 229386597 229399223 229504814 229884167
3434.1 229884167 229927807 229303131 229017582 229790859 230960636 231380711 231019363 231339130 231506367 231858025
3443.8 231858025 232318020 231845322 232218208 232729797 233468227 233904362 233635750 233918343 234099274 234958019
3453.4 234958019 235492020 235550575 235978127 236530876 237046509 237181816 238026505 238399220 238742542 239848328
3463.1 239848328 240643139 241071892 241390953 242070732 241932220 242200527 242529774 242600441 243773842 244149590
3472.7 244149590 244348869 244948730 245653305 246214600 246484013 247610130 248689156 248675766 248647232 249456673
3482.3 249456673 250006142 250935097 251633244 251668282 252815742 253722305 254281178 255108509 255837917 256300488
3492 256300488 256486263 257053719 257958832 259127522 259779358 260126152 260757141 261868572 263110943
3500.7 263110943 263548336 263826389 264721699 265798149 266366444 267169685 267597427 268143196 269428101
3509.4 269428101 269847565 270696449 271472740 272099514 272878857 273378639 274317493 275539017 276944866
3518 276944866 277403736 277735806 278434582 279808846 281656799 281604004 281702480 282751160 284227867 285093136
3527.7 285093136 285595932 286780510 288042278 289043789 289066887 290124397 291767254 293219833 293996677
3536.4 293996677 294008598 295463009 296376324 297252617 298527756 299900951 301225548 302201462 303426666
3545 303426666 303727303 305205536 305803814 306425972 308444939 310079975 311869736 311948433 312868481
3553.7 312868481 314346828 315636253 317039108 317701168 319466686 320507355 321305313 322385597 324486732
3562.4 324486732 326274414 326877556 330215034 331193810 331159554 332402878 333026772 336169090 338039551
3571.1 338039551 339639091 341409950 342425041 343421135 345519218 348034935 348619614 350327530 352198639
3579.7 352198639 353410645 355315628 357341080 359076729 360259171 363387108 364597626 364314690
3587.5 364314690 366377182 366561852 369772873 373120651 376122437 377892761 378507462 381799240 381971512
3596.1 381971512 384228630 387735481 388016777 390220833 391499100 392980537 395317535 396970024
3603.9 396970024 399202576 402241173 405424347 405166321 407898941 408415108 407888374 414653168 416524658
3612.5 416524658 415070686 418780479 418424454 421788673 426247978 427094154 428984413 428742218 430312271
3621.2 430312271 433431778 435525818 438268547 441009979 442682762 444719658 450170975 450759544
3628.9 450759544 442782211 446877060 451454926 456535416 458640289 457228546 459931755 463054543
3636.6 463054543 465058861 466107445 467646255 469858818 471538811 472346420 473409348 476007805
3644.4 476007805 479316635 484700089 484919968 482039795 486972008 487192192 485133438 484639969 489277802
3653 489277802 493617210 497284203 502250023 495709152 496531754 501664848 503360596 505247726 505599594
3661.7 505599594 506936607 508493576 510537682 512774658 513346100 516786613 519462471 519429207 520329514
3670.4 520329514 515823212 517389908 524175148 532370987 534367752 517684975 517808342 525235252
3678.1 525235252 531089516 530743637 530685310 533123856 534883041 535835953 536238861 537178116 541065674
3686.8 541065674 546862526 538948975 535112495 543314743 539167557 538641472 543735008 544824867
3694.5 544824867 547156105 547474289 547021217 548640900 549127693 551664772 554338112 549405174 546954269
3703.2 546954269 551493645 553775864 554094505 554040413 556055222 560995445 555063362 556503868 560170937
3711.9 560170937 548649712 552412186 556800423 556997299 557122650 559527969 561520386 558001022
3719.6 558001022 558551941 564412003 562810326 558328552 561863632 563126640 563420372 561176796 560855942
3728.3 560855942 564127884 564738731 569549942 566785393 560375671 569977493 571751595 561474686
3736 561474686 560109291 561963882 563164940 566135788 568750153 565006332 567646828 578748741
3743.7 578748741 571296577 553794441 562714081 569063034 575857773 573891945 562312202 572578468
3751.4 572578468 567868004 559430237 565492783 570056419 572835884 568381424 570838852 576267090
3759.1 576267090 568618050 566022682 569572792 571373901 572467461 575675697 573322868 569034233
3766.8 569034233 572226028 577591019 577994957 569019089 570093079 573139534 573592110 574617081 574776192
3775.5 574776192 575241013 575024605 577688866 578235092 571039314 572644577 574714890 576216774 579119606
3784.2 579119606 576484146 575005875 576027336 576672401 577563896 577411194 577461548 577230835 577237968 576919861
3793.8 576919861 577964821 581247940 578398514 574589005 575965118 579741096 584862480 577699814
3801.5 577699814 569400864 573582878 576731644 581260338 586464653 577969398 572900658 576813545
3809.3 576813545 578798943 579450760 580115204 580179710 580908699 586001358 585742302 572977409 577005424
3817.9 577005424 582178879 586185379 586554947 570665054 572647514 577694130 580242348 582863197
3825.7 582863197 582826309 578870583 578854713 580791817 583531837 585460930 578367500 580411263 586762428
3834.3 586762428 580725060 580028229 587828979 580614128 576449928 584343109 579702492 579161949 585481758
3843 585481758 582275124 578922882 581562347 582504616 581786003 582629814 582182541 584535942 589535065
3851.7 589535065 582642670 583431015 573932610 574763145 583810921 582111244 580244026 582669868 584846153
3860.4 584846153 587030334 581924095 581704788 588145332 583538017 577541008 580421448 585187683
3868.1 585187683 591178055 584573135 575979195 579062004 584798050 589293137 580390968 579168129
3875.8 579168129 582283669 582361908 584440498 588438873 583517036 576980629 583020287 584328728 585502663
3884.5 585502663 591164513 579484100 579153633 583149338 584209023 588316689 588570633 581124458
3892.2 581124458 581095276 583808517 582662086 583462143 583975563 586392555 588782883 578837166 583382072
3900.9 583382072 586802292 581598015 585575180 582706337 581070900 581292152 581137352 583175774 583038902
3909.6 583038902 582774048 582668304 583177452 583534508 583113480 584641037 587044868 584130211 580918045
3918.2 580918045 585342026 585500565 580996628 582432632 583910637 585374374 584093857 580772438
3926 580772438 581754913 583485794 584589233 583168640 582497063 584381485 582600060 580975914 581952019
3934.6 581952019 582104340 582272110 582467461 582116852 582704430 582589035 583474579 585082207 580977936
3943.3 580977936 579561462 581326981 582856522 584244270 582137833 582722244 583048477 580667191 581720314
3952 581720314 581899986 581363716 581849022 582440414 582531700 582092590 581944847 581149292 581870842 582917480
3961.6 582917480 581962852 581552391 581744041 581911659 582190781 582186279 581995811 581709366 581644211 582403107
3971.3 582403107 582446213 581590462 581736336 582794533 582885017 581633759 581493835 581989441 582170410 581944618
3980.9 581944618 581407127 581093788 580996323 581829872 581865540 581500511 581535339 581581917 581869774 580918579
3990.6 580918579 580707855 581266403 581820297 582479668 581875572 581248627 581340981 581612701 581051369 580917892
4000.2 580917892
##END=$$ End of the data block
