##TITLE=$$ Begin of the data block
##JCAMP-DX=5.00 $$ ACD/SpecManager v 10.08
##SPECTROMETER/DATA SYSTEM=Varian
##DATE=04 Dec 2012 14:11:32
##DATA TYPE=INFRARED SPECTRUM
##DATA CLASS=XYDATA
##ORIGIN=
##OWNER=
##NPOINTS=3735
##FIRSTX=399.26403809
##LASTX=4000.35498047
##MAXX=4000.35498047
##MINX=399.26403809
##MAXY=70.35480499
##MINY=22.81773567
##XFACTOR=1.0000000000
##YFACTOR=0.000000100000000
##FIRSTY=48.89278793
##DELTAX=0.96440572
##XUNITS=1/CM
##YUNITS=TRANSMITTANCE
##XYDATA=(X++(Y..Y))
399.3 488927879 475893059 483749847 486202431 479331474 470916519 465694733 468988228 471039352
407 471039352 469663048 472660561 478738899 479389725 474787292 474494896 476586723 473635216 468341293
415.7 468341293 470107918 471265755 460959511 469101601 480410843 480758400 477961006 478373909
423.4 478373909 483731232 482816429 473148766 463194122 461324921 463962517 465566254 467285080 465638275
432.1 465638275 465799103 466699753 463170280 464114189 467668571 466027451 464389076 464670944 465349922
440.7 465349922 465362854 467692604 470638962 470575523 472443275 475071678 474375153 473166847 472966118
449.4 472966118 473139038 473342552 475861282 475604630 471861992 472882309 474277153 472686272 471060905
458.1 471060905 469668884 468222198 465880966 464092255 469141502 476171341 475316238 469455986 464403229
466.8 464403229 463230362 466182861 466003532 464755478 463066368 460488892 466955948 469465141 465754623
475.5 465754623 465147629 461948280 456093254 455532913 455621643 452506104 452515144 456499329 457478676 458171387
485.1 458171387 458336945 457298622 454424095 449067307 447439232 445526276 444894524 446670837 449263802
493.8 449263802 453325081 452232437 449463120 447270851 445092010 442029343 440205154 440042839 436875229
502.5 436875229 437523117 439365387 440500832 441198082 442227173 440993729 436679916 435010490 432245712
511.1 432245712 429118690 426039772 423875160 425999336 427459755 428553123 427337685 426092110
518.9 426092110 424742241 420567093 415234413 411312141 411633797 412526093 414305954 415048065 416220016
527.5 416220016 418053017 417326698 416474113 415465469 414464912 412995453 413029251 414782333 416635017
536.2 416635017 420152931 424387398 427729874 428938675 428875656 428220444 427089767 427129326 428298378
544.9 428298378 428699646 427724686 428292999 430656090 432517738 432133598 430911407 429886208 427964439
553.6 427964439 426811104 426506996 425298271 424941597 427678680 427556992 424041443 422130165 419341316
562.3 419341316 418133507 417442818 414829521 411821556 408426971 407691765 407294006 407084618 407149048
570.9 407149048 406554985 404511185 401041031 398672028 397134705 398302765 399410439 400002823 400640030
579.6 400640030 401206436 403521996 406883736 409931717 409237213 408702850 410891876 413108826 415130310
588.3 415130310 417711029 420644264 422929420 425202522 424941978 423752861 422974091 421077271 420321732
597 420321732 421717224 422602119 421792870 422527809 423957062 424922943 425826950 426268768 425827599 423410645
606.6 423410645 421842842 421561165 422727585 423353539 423272438 425980034 427825546 429644318 430256348
615.3 430256348 429246597 430174789 430035248 429865494 431811829 434743996 436997910 439687309 442372208
624 442372208 444144058 446175804 447385406 447996368 447824020 447664299 449280777 451286087 451961441
632.7 451961441 453789482 457511787 459403763 460387383 460634575 459542313 458879242 459016342 459994469
641.3 459994469 460709724 462094307 463276749 463757515 465241051 466433868 467096977 466565285 464999313
650 464999313 464112473 464128990 465226250 466625443 467554131 467995186 468940926 469944878 469703407 468449707
659.7 468449707 467454491 467196465 467140160 467802773 468446617 469936295 473223305 477967033 480477943
668.3 480477943 474708061 471582336 469760818 469835548 471138840 472397461 473451080 473927727 474703026
677 474703026 476381721 476894875 476697044 476897621 475989456 475436440 476176796 476269188 476982231 478393326
686.7 478393326 479556923 480911980 481025429 480582123 480033493 478842163 477422981 475408325 475257187
695.3 475257187 476775703 476955643 476227646 475609245 475521431 474145432 471272621 469338684 467293892
704 467293892 465159454 465282707 467003784 468137512 468361855 469155807 470441055 470788994 470173302
712.7 470173302 469979286 469589119 469225616 470787430 473070030 475183411 477485962 480521126 482935753
721.4 482935753 484164124 485787506 486813087 487276230 488170586 490118065 493170357 496254158 499336662
730.1 499336662 502081871 504736023 507395134 508810234 509134560 509337273 509032440 509128952 510650711
738.7 510650711 512329445 513942947 515693703 517130432 518031120 517365341 516241074 515758171 513372231
747.4 513372231 510100555 508963203 509518013 509576721 508787308 508682518 508555527 507133484 504459038
756.1 504459038 501826324 499657249 497507706 496358032 496125336 496649208 498146896 499674988 500981255
764.8 500981255 502198486 501934395 501738777 502774773 502742119 504558334 508085785 510770302 514567451
773.5 514567451 517906227 521151619 523970642 525280304 527579956 529552345 530211906 530880356 533596497
782.1 533596497 536479034 538103638 540279999 542516441 544863434 545614319 545197182 545081177 545799980
790.8 545799980 546975441 547586060 549650269 552164001 554304428 556106987 557795601 559182968 558726997
799.5 558726997 558562317 559084778 559647560 561156349 564449883 568036766 570220146 571467896 572338753
808.2 572338753 573442459 573731461 573487701 572589417 572299500 573589745 574753075 575956841 577543221
816.9 577543221 579597015 580304718 579651794 578034477 576360703 575061417 573193855 572779388 571846390
825.5 571846390 570937233 571540337 571776466 570739365 568270226 565784073 562587700 559492264 556560440
834.2 556560440 554615593 553858681 552444420 552433662 552157593 550223541 548561363 547024040 544410286
842.9 544410286 541427155 539674416 538037643 536744537 536701126 537166367 537502441 537931480 538075409
851.6 538075409 537378998 536797676 536139717 534873428 532930756 531731949 532235909 533798676 535225563
860.3 535225563 536007080 537974815 539935150 540956154 542114563 543680420 546056480 548291359 551162796
868.9 551162796 554338722 557759476 562237625 566337662 569780006 572153397 573320732 573684082 574196167
877.6 574196167 574562798 575312653 576003761 576332397 577118683 576137009 573965263 571085129 569032707
886.3 569032707 566955643 563137131 559758377 556926231 555418053 554153900 553366089 552427254 550040474
895 550040474 547409210 543977318 541818962 540786629 539306450 537512665 536188660 534957466 532290192
903.7 532290192 530678978 529981422 527791939 524358711 520823860 517532730 514604111 512531281 510361290
912.3 510361290 507507286 504266243 501009178 497789307 494659767 491211510 487111702 483564148
920 483564148 481545715 479792862 477921104 477604332 477394676 476419487 475918655 475315742 474108658
928.7 474108658 472835388 472879715 473562431 473860703 475105209 476414223 477420616 478948441 480071220
937.4 480071220 481137161 482327385 483419762 484442482 485563049 487083511 488584213 490089684
945.1 490089684 491465645 492189064 491685181 490666466 489047661 485585442 481776810 478974190 476924362
953.8 476924362 474830132 471051292 466796837 463260269 459677048 455507126 450047569 444370842
961.5 444370842 439066696 433633156 427957153 422682381 417131310 411180496 405701180 398774986
969.2 398774986 391375694 384356995 376843834 368753471 360701790 352618484 344511299 337560806
976.9 337560806 329636879 322036629 314852924 307531528 299986515 292107124 286246567 280286293
984.7 280286293 275096436 269910011 265731735 262381687 258640423 256748238 254088078 252112103
992.4 252112103 249718361 247627182 246184921 244689617 244421196 243750629 244238434 244160213 244627972
1001.1 244627972 244374409 243966541 244332657 243257446 243478107 242569580 241938057 240858326 239855213
1009.7 239855213 239538994 237864571 237178383 235653877 234573402 232473774 230941181 229803829 228718815
1018.4 228718815 229373531 228177357 228755226 229164104 230091858 230305958 229220123 230360069 230888405
1027.1 230888405 232153969 231948814 233032036 234083843 233991547 235165844 235407963 236520004 236501236
1035.8 236501236 237340221 237355461 237245445 237475357 236550655 237511272 237014713 237690239 238555813 239975967
1045.4 239975967 241101379 240793839 241626472 241064434 242301311 243250790 244645882 246398411 247885399
1054.1 247885399 249880142 251139050 254402370 256460667 259266453 261403446 263611317 267459011
1061.8 267459011 270927448 275390301 278105469 282120953 285686092 288742619 290464802 289282875
1069.5 289282875 287995872 284593048 281842136 277910423 273603764 269442463 265586281 263890038
1077.2 263890038 262219410 262368317 260847740 260489197 260740643 261302242 263145161 263774033 266214981
1085.9 266214981 268246250 271585732 274135952 276719189 279616318 281021290 283840675 285241013
1093.6 285241013 287034016 288375874 290323391 292272434 293123741 294843941 295563450 296577034 296433563
1102.3 296433563 296932220 297270489 297796307 298704643 298769760 300875549 302132969 304636612 306899281
1111 306899281 308690510 310090961 309940395 311477280 312159176 313175964 313597279 314415684 315914078
1119.7 315914078 317003384 319062233 319905148 321302795 322182312 322854538 323546143 324816971 326265717
1128.4 326265717 327243195 329792213 330840759 332500687 333563309 333604164 333487129 332618103 332671471
1137 332671471 330300255 327547989 324862900 323139420 321257057 318461361 317329369 314705219 312740517
1145.7 312740517 309317894 306134281 303898430 300519753 298943405 296718674 295695171 294768639
1153.4 294768639 293817196 292778893 292242069 292681198 291737976 292536793 293551483 295072765 296335125
1162.1 296335125 298578968 302153473 305298824 309993553 314162979 318925133 323273697 328001823
1169.8 328001823 333133965 337729073 343115654 348749924 355446625 361328125 367286034 372598343
1177.5 372598343 377777710 383568497 388190079 392601013 396607285 401270409 405178566 408826408
1185.3 408826408 413016090 417010651 421281624 424165230 426354370 427923279 429666634 431439819
1193 431439819 432170563 433168945 434070396 435180016 436087990 436907463 437617874 437820663 438307304 438472595
1202.6 438472595 438405457 438508644 439495659 440826836 442081566 443334160 444243698 445561905 446875916
1211.3 446875916 448033752 448671150 449020882 449935226 451245041 452183228 452546959 453718834 454802094
1220 454802094 454722366 454334183 454358826 454194145 452767830 451187286 450005951 449103584 448464127 447973900
1229.6 447973900 447249374 445997467 445327911 444637833 443570786 442382965 441293335 440617332 440279236
1238.3 440279236 440782967 441237373 441228828 441297340 441907272 442448082 442809334 443231316 443469315 444153862
1247.9 444153862 444939194 446341209 448161087 449916916 451461906 452498245 453396759 453731270 454308167
1256.6 454308167 455212898 455806389 456085472 456835937 458589287 460076942 461447258 462379608 462929230
1265.3 462929230 463780251 464734459 465335770 465393639 466061897 467127876 468153343 469447975 470774574
1274 470774574 471940155 472670631 473050308 473118401 472974548 472918129 473008385 473467255 474286804 474873390
1283.6 474873390 475414772 476432724 477379112 478141098 478555527 478287468 478096313 478179512 477729645 477254448
1293.3 477254448 477343063 477512093 477467766 477282600 477136688 476487694 475403023 474752388 474370079 474089394
1302.9 474089394 474068794 474191513 474547005 474884453 474578171 473892746 473705368 473543739 472834816 471773224
1312.5 471773224 470781631 470424995 470221558 469854088 469736938 469443893 468474770 467275505 466347504
1321.2 466347504 465510788 464854050 463861618 462486649 461956024 461673622 460984077 460227623 459507484
1329.9 459507484 458628616 457474136 456438293 455402565 454374237 453603287 453301620 453175087 453047600
1338.6 453047600 452637672 452681160 453450813 453440552 453151932 452656174 452181015 451912117 451594543 451812859
1348.2 451812859 452073517 452126427 452113419 452453194 452317047 451334419 450374146 449019661 448328781 448153267
1357.9 448153267 447658653 447658234 447493973 446841774 446247101 444666443 443366394 442570648 441589584 441194038
1367.5 441194038 440573044 440079880 440433388 440675774 441194954 441072845 440435143 439803314 439458084 439249763
1377.2 439249763 438506889 438735733 439443550 440823288 442126732 443536148 445370865 446424408 447782135
1385.8 447782135 448921509 449301033 449708138 450850716 451971016 452645683 453520203 454160385 454196777
1394.5 454196777 453627243 453936348 453790321 453553543 452047729 450580292 451170235 451342659 451697121
1403.2 451697121 451749916 451387901 451762543 452005577 451892548 450908508 450153046 448992729 448129501 447924423
1412.8 447924423 447534943 447423515 447275391 447122574 446485443 446962891 446289940 446608772 448242302
1421.5 448242302 448330040 448591728 448816071 450256271 451688271 451807022 452037544 451694946 451140289
1430.2 451140289 450565720 450626907 450455704 450258064 450788918 451011200 449414291 448929329 450547638
1438.9 450547638 450654259 450603065 450700989 449961739 449781876 449239616 449100380 448904686 449403954 448763161
1448.5 448763161 448536072 448437691 446582069 445032616 442671127 442011490 440526772 439691353 439713898
1457.2 439713898 436726379 439792252 440139351 442672691 443478966 443744164 444958038 443700142 445420952
1465.9 445420952 446725769 451561737 456722412 464200859 471865540 477773094 487329254 491735268
1473.6 491735268 497864227 501732635 506151009 510575142 514654961 519198112 522418137 526715279
1481.3 526715279 529362144 532453880 534791031 535892487 537000389 536619263 537608414 538763313 539638252
1490 539638252 540282440 542700424 544360237 544389229 544779358 543451576 539792633 540770950 541304245
1498.7 541304245 539701614 540170403 540834007 540411415 540520935 540827217 540580750 533338814 527742920
1507.3 527742920 528850746 528758965 528178177 528081398 527136574 525400696 525770607 525023956 523425865
1516 523425865 521739540 518221016 520132065 521490021 518794823 516649246 517862358 520951309 522506599
1524.7 522506599 521709480 521948090 522298470 520860291 520408173 521034317 520307350 519618874 518332214
1533.4 518332214 516744804 518473930 519424324 520326385 521495895 516362877 508989487 514546738 516192131
1542.1 516192131 515844765 517652054 518473320 518942146 520935287 522908401 524607544 525691032 524955978
1550.7 524955978 526116409 527702484 528934059 530076981 531867485 536005783 539017525 537272377
1558.5 537272377 539859962 539583588 543008919 544945564 546877251 548077812 548521423 549981995 551824226
1567.1 551824226 553811607 554499931 554051247 555435028 557203484 557847290 558317757 559252777 559064560
1575.8 559064560 556739388 558293839 560581207 561166801 561592484 561508217 560640259 559585876 558486443
1584.5 558486443 557859612 556815224 555965271 555075226 554856262 554128532 552962608 551904144 550251465
1593.2 550251465 548380280 545913734 544587746 542767448 540870094 539259911 538010330 537098274
1600.9 537098274 535323448 533331757 530142746 527443771 524748993 521960716 518811836 516254120
1608.6 516254120 513796196 510650978 509368935 506682053 503835335 500395203 498066101 495855026
1616.3 495855026 485702782 484167175 481975517 479660568 475974693 473614197 471383362 465137863
1624 465137863 463346443 460571098 458368797 453123703 448648796 446000748 442848549 440812073 437727509
1632.7 437727509 436854401 435565224 430070038 425256538 424715919 422909698 421067619 420509720 417680130
1641.4 417680130 417560158 416142921 415901833 416355705 413352623 413060532 410131683 411531677 411292191
1650.1 411292191 413082619 416068878 412188568 404974060 407667885 412816849 414145622 415801392
1657.8 415801392 416367302 417619095 419503708 420459442 422229233 422394714 426152000 428128014 430340195
1666.5 430340195 433007240 434807091 436913338 437833824 441544304 442667580 445835762 449152145
1674.2 449152145 451628494 454190750 456664886 460602226 462959175 466494904 468196411 470781593
1681.9 470781593 474658432 474492073 477914848 480385513 485359879 488801918 491473236 495035591
1689.6 495035591 498165092 501760597 504449348 507602119 511152916 514520454 514440613 518537560 523581467
1698.3 523581467 527782402 530715904 529214592 534610558 538538170 540749054 541690712 542726135
1706 542726135 543425446 544987068 547833595 549363937 550341034 551636772 552879791 554021111 553484077
1714.7 553484077 553404884 555424576 556493263 554275551 558215370 561392441 562644424 563468742 563622551
1723.4 563622551 563162575 562355995 560980377 559249115 557947960 557104874 553396568 549795494 549720726
1732 549720726 549521751 542665253 531355820 530639076 528107224 523549919 520057983 513066177 504933624
1740.7 504933624 503659668 502396927 497445488 496033363 496510162 498237991 500963745 504676132
1748.4 504676132 510570145 516887512 527419624 536050339 546231575 556653633 566811409 577043724
1756.2 577043724 585890083 595509300 602613754 609473991 615669098 620400009 625870323 630991821
1763.9 630991821 635588226 638860397 642448273 645125351 645269699 647897491 651076279 652151642
1771.6 652151642 650968628 651620789 655606308 658374405 658841400 660689240 662033768 663264313 663828659
1780.3 663828659 663050003 664187241 665623169 666847534 666907578 667090683 668703308 669882812 670758514
1788.9 670758514 671655731 671644669 671839218 670559616 670091095 672497025 673541641 673440247 674708481
1797.6 674708481 676388016 676577530 675814438 677201538 676781769 676291504 677440338 677809219 678501816
1806.3 678501816 679181519 679509583 680597610 681552124 680621033 680868912 681746826 681676178 681936569 681787796
1815.9 681787796 682181091 682590179 683170776 684093781 684507904 685258789 684860382 684938126 685461121 683256607
1825.6 683256607 682938309 684673309 686487961 687143097 685484085 686023483 687601395 687715912 687431412
1834.3 687431412 687067108 686889801 686727829 686433411 687293015 687932739 688620682 688633118 689150848 689753494
1843.9 689753494 686206894 686934967 688052063 687755280 687569733 687935028 688658218 689251556 690244522
1852.6 690244522 690436783 690861664 690838852 690071182 689828644 689032364 688686371 688761749 689369659 689915466
1862.2 689915466 690321960 690619965 690796890 691438828 690963974 690590286 689277496 687973938 688966751
1870.9 688966751 690068817 690843277 690840149 691120377 691442184 691273422 690913696 690812531 690756760 690460663
1880.6 690460663 690611572 690569153 691128082 691704025 691987991 692266159 692030945 692434006 692219696 690780411
1890.2 690780411 690639267 691153183 691043854 691410828 691856461 691702042 692643051 692914124 692649078 692037582
1899.8 692037582 691317062 691333008 691556244 692119141 691812134 691941910 692581558 692917328 692995987 692422409
1909.5 692422409 691631470 690989227 691436615 691264954 691241837 691669540 692028885 693064575 691703720
1918.2 691703720 691122971 692071762 692418747 692317963 690794220 690026779 690527420 691143570 691296768
1926.8 691296768 691653519 692176895 692608795 692738953 692278061 692078323 691429977 691012726 690573196 690538101
1936.5 690538101 691161728 691498566 692087021 691900177 692468109 692509155 690394974 690035172 690043335 689914093
1946.1 689914093 689990540 690336075 690504990 690991211 691925354 692285309 692340317 691882248 691266251 690640106
1955.8 690640106 690435333 690477600 690349960 690485153 690846405 691601334 691911240 691882782 691547470 691031799
1965.4 691031799 690648575 689822464 689417191 689652252 690229111 690792923 691423492 691757660 691786880 691675644
1975.1 691675644 691017227 690967331 690818634 690205154 689891281 689853058 690203018 690398865 690660706 691051483
1984.7 691051483 691239853 691025848 690514297 689808273 689227829 689051590 688885574 688729248 688867111 689864120
1994.3 689864120 690677261 690651703 690046616 689188919 689172058 688898621 688533096 688418198 688049011 688190079
2004 688190079 688769302 689120712 688644638 688328552 688207932 687747421 687619781 687373199 686888962 686741867
2013.6 686741867 686845856 686800003 686492157 685979462 685803452 685467377 684828339 684380341 684029236 684241180
2023.3 684241180 684418411 684514008 684346924 684020386 684153595 683776932 683178940 682412567 681814880 681512909
2032.9 681512909 681190033 681211395 681495056 682029953 682065811 681831131 681366348 680872574 680368195 679704590
2042.6 679704590 679675369 679373245 679448013 679927597 680148544 680435486 680343094 679996948 679556503 679353180
2052.2 679353180 678593140 677912598 677767334 677630615 678133392 678702698 679420013 679724274 679838104 679994202
2061.9 679994202 679440765 678823318 678090515 677516327 677256317 677562637 677946320 678248367 679002762 679474716
2071.5 679474716 679539719 678946304 678209229 677702103 677388229 677119751 677046967 677586136 678216171 679030838
2081.1 679030838 679477768 679709778 679294662 678346863 678054581 677673416 677277298 677004471 677489700 678017197
2090.8 678017197 678150635 678401260 678340988 678844376 678876801 678494263 678129730 677610626 677386627 676934433
2100.4 676934433 676997070 677651596 678425446 678599472 678465729 678364487 678014832 677847366 677457428 677197037
2110.1 677197037 676850967 677133408 677889786 677875366 677927246 678108673 678202362 677825394 677433167 677228317
2119.7 677228317 677141266 676743317 676261139 676977615 677412949 677595901 677740631 677641144 677341690 676681442
2129.4 676681442 676716537 676616592 676290512 675861282 676023712 676821518 677116318 677191315 676849747 676903915
2139 676903915 676725693 676318588 676179581 675970917 676225510 676170197 676301193 676483765 676673660 677032700
2148.6 677032700 676763229 676342468 676020660 675834122 675606079 675597076 675543747 675674591 676133423 676748962
2158.3 676748962 677422256 676999435 676601562 676420517 676241837 676302185 676252441 676469955 676649246 677239304
2167.9 677239304 677710419 677923965 678050919 677942734 677669678 677040405 677192841 677394638 677511215 677953644
2177.6 677953644 678432465 679043655 679335327 679644089 679686661 679484253 679065628 678909073 678846664 678491592
2187.2 678491592 678738098 679184418 680006943 680549316 680773010 680980530 680703506 680343933 679843140 679893723
2196.9 679893723 679901733 679859085 680166092 680571518 681401520 682122192 682391434 681980438 681691971 681206970
2206.5 681206970 680620422 680568924 680663223 681517868 682219696 682606201 682961807 683057175 682939835 682756805
2216.1 682756805 682667847 682267380 682304535 682358780 682373428 682532959 682840424 683480911 683353958 683121567
2225.8 683121567 683160629 683207779 683124237 682963181 682702026 682364273 682643585 683248291 683830566 683693924
2235.4 683693924 683746185 683717041 683205032 683360291 683110199 683154373 683418884 683544312 683852692 683858414
2245.1 683858414 683848190 683771210 683626556 683268890 683519974 683329391 682945175 683171844 683096390 683737183
2254.7 683737183 684051285 684197998 683993607 683586731 683750305 683375320 683380356 683182983 683427658 683983459
2264.4 683983459 684106750 684256744 684014359 684140930 683810730 683592148 683554230 683353119 683080750 682541962
2274 682541962 682778931 683368225 684437027 684906769 685049667 684986191 684091263 683467789 682552948 682250214
2283.7 682250214 682020798 682218628 683025894 683556671 684517822 684920044 685287476 685070648 684662399 684209595
2293.3 684209595 683596191 684154663 684129868 684354553 684824066 685484924 686528244 686793137 687068863 686617508
2302.9 686617508 686213303 685730438 685478745 686053238 686272430 687150421 688267899 689374084 690250778
2311.6 690250778 690488510 690251923 689774628 689706268 689434586 689708023 689939270 690567398 691943817 692621460
2321.3 692621460 694221573 695790634 695542221 695397339 696040955 695721893 694977722 694969940 694913177 695666733
2330.9 695666733 696452255 696921158 697642136 697572708 697388153 697335052 696770172 696833725 697856903 697355270
2340.6 697355270 696086502 696625366 698057938 698508377 696694870 694391098 691226883 688040543 688951416
2349.2 688951416 692036667 693525238 694395218 695287857 697078705 700221710 702467270 703548050 703139572
2357.9 703139572 702392502 701897736 702862625 702869644 700813141 698923798 698076096 699236221 698279037
2366.6 698279037 696401138 695560150 693687363 691691208 690070343 688646622 686890335 685437469
2374.3 685437469 684186401 683003006 682573471 682155609 681028442 679386749 678071899 676811447 675574265
2383 675574265 674553757 673649826 673246155 673249512 673555603 673580170 673285141 672934494 672761688 672509766
2392.6 672509766 671684647 671385498 671360092 671381454 671439285 671394196 671691971 671617966 671304703 670719452
2402.3 670719452 669990158 669600449 669306870 668887405 668604202 668907852 669224930 669570770 669397964 668741302
2411.9 668741302 668541641 668320618 667882233 667287369 666967010 666952820 667047043 667103424 667223969 667329025
2421.6 667329025 666962204 666566467 665952988 665485840 665085831 664612427 664329681 664209747 664614639 664451828
2431.2 664451828 664297104 664299164 664029388 663866425 662966156 662251053 661913300 661627121 661617966 661546555
2440.8 661546555 661105804 660682144 660820236 660730591 660629044 660130768 659288864 659010849 659035797 658923340
2450.5 658923340 658389359 658471832 658566284 658418503 658392639 657943115 657657547 657297821 656775131 656007462
2460.1 656007462 655739059 655962601 655617218 655497055 655572815 655489883 655190964 654803467 654465256 654360580
2469.8 654360580 654197998 653645859 653442535 653322220 653487625 653676987 653427505 653013306 652639847 652746964
2479.4 652746964 652427292 651772919 651217575 650949020 651120224 651134109 651062622 650666351 650283661 650223389
2489.1 650223389 650343399 650162506 649451675 648920670 648609695 648742218 648767395 648533020 648789291 648781357
2498.7 648781357 648276672 648010559 647740097 647361069 647425766 647380600 647102051 647049103 647084274 647084351 647053146
2509.3 647053146 646960449 646444626 645962830 645840683 645751801 645566864 645617752 645903778 645684509 645193176
2519 645193176 644851685 644833298 644464035 643983383 643946304 643420639 643085861 643030243 642888412 642743607
2528.6 642743607 642874374 643397446 643143845 642510147 641857529 641279755 640909882 640566330 640452194 640552063
2538.2 640552063 640958405 641007080 640726776 640156097 639667969 639567757 639041176 638438988 637852859 637753754
2547.9 637753754 638091164 638133736 637853584 637510567 637335625 636654243 636074104 635981445 635814514 635408821
2557.5 635408821 635151405 635193520 634913635 634897575 635035591 634963455 634630280 634231148 633973579 633351097
2567.2 633351097 632898712 632412567 632175064 632429886 632488823 632285500 631864166 631872330 631834412 631494865
2576.8 631494865 631103859 630520935 629993629 629569931 629125404 628489609 628361206 628645172 628773155 628596954
2586.5 628596954 628263626 628283806 628194695 627701149 626903076 626638031 626833954 626664505 626511688 626395454
2596.1 626395454 626287842 626044807 625804672 625537682 624949989 624390144 624213181 624145279 623613091 623327293
2605.7 623327293 623430939 623322983 622914085 622618370 622569313 622114677 621533051 621089897 620916977 620539360
2615.4 620539360 619974365 619794388 619596100 619649010 619221802 618272362 617514114 616830711 616710167 616695518
2625 616695518 616291466 615799904 615467148 615038338 614682541 614428291 613686028 613129921 612880592 612242241
2634.7 612242241 611582336 611487312 611346626 610815887 610214119 609591179 609037476 608398285 608153229 608106918
2644.3 608106918 607554436 606663055 606170921 606332779 606249390 605880585 605118561 604401398 603986244 603466377
2654 603466377 603109779 602411766 601914978 601593208 601266975 601145439 600690041 600639992 600453758 599597816
2663.6 599597816 598801041 598118477 597483902 597332649 597588501 597293243 596645966 596116028 596010666 595876770
2673.3 595876770 595375977 595048409 594498253 593990288 593570251 593135529 592936096 592615509 592348175 592092590
2682.9 592092590 591734085 591539459 591315460 590871277 590424004 589711609 589106407 589209137 589339066 589148102
2692.5 589148102 588773308 588436737 588039169 587632980 587302094 586784744 586098976 585504723 585522614 585466347
2702.2 585466347 585041542 584556808 584367371 584545097 583833160 583139992 582884483 582153473 581316643 580661087
2711.8 580661087 580780029 581192932 580980301 580266533 579750862 579678574 579477501 578810272 577649117 576865959
2721.5 576865959 576726799 576412354 575978012 575729485 575452576 575180664 574629288 573758430 573331490 573148422
2731.1 573148422 572944679 572730217 572708511 572636108 572101593 571720848 571405182 571281586 571035385 570338326
2740.8 570338326 569778290 569587364 569647865 569187622 568694572 568523293 568474808 568197670 567516785 567271729
2750.4 567271729 566914444 566539574 566168289 565594215 565402336 565078926 564553490 564364548 564308014 563705826
2760 563705826 563496361 563520432 562806664 562047501 561562386 561650124 561452637 561163750 561135368 560566139
2769.7 560566139 559988632 559686546 559703789 559465179 559188232 558705368 557780151 557395058 557040634 556625023
2779.3 556625023 556328049 556391563 556334572 555498543 554498787 553766861 553424149 552721519 552210197 552109756
2789 552109756 551673088 551003532 550277061 549955940 549574699 549040871 548256683 547233467 546368332 545658913
2798.6 545658913 545216522 544490280 543958893 543637428 543068085 542370300 541336021 540511017 539966927
2807.3 539966927 539265213 538245277 537228050 536291351 535331078 534414558 533626328 532986259 531799049
2816 531799049 530359612 529175339 528289070 527261848 525871048 524862785 524020500 523029556 521385040
2824.7 521385040 519365730 517835197 516540375 514839249 512586403 510863419 509574547 507709923
2832.4 507709923 505364456 503560181 501780701 499176216 496665726 493830109 490538902 486616058
2840.1 486616058 482289085 477968330 472390785 466063156 459334717 452134628 444406586 436031151
2847.8 436031151 427414169 418652534 411053848 404662399 399185905 395110016 392774849 392747993 394325447
2856.5 394325447 397348862 401018524 404757385 408932915 413322678 417798653 421425018 423900146
2864.2 423900146 425937653 427736397 428625412 428910484 428550415 427179298 425943642 425223808 424980507
2872.9 424980507 424964828 425144920 425166473 424946289 424995270 424739609 424168472 423024673 421892815 421173897
2882.5 421173897 420046844 418834190 417591515 415943451 413897209 412407188 411129341 409326744
2890.2 409326744 407679558 405972710 403943520 401902504 400161171 398127937 395920677 393969307
2897.9 393969307 392019234 390018845 387511826 385142555 382798347 380097847 377159500 374102097
2905.7 374102097 371075516 367299690 363556442 359531174 355201187 351245956 346532402 341075974
2913.4 341075974 334938698 328829727 322664146 316300201 310457153 304426346 298609486 293464413
2921.1 293464413 289299278 285960922 283356533 281634674 280753651 280955257 281757984 283474998 285647202
2929.8 285647202 288394871 291837788 295603352 300088673 304927711 310055733 315328579 321097031
2937.5 321097031 326430740 331614189 337525711 342673035 347361755 352042847 356818085 361326180
2945.2 361326180 365083313 368289566 370820389 372912521 374621849 375989571 376605415 376804810 377496490
2953.9 377496490 378866539 380352554 381406479 382807236 385288696 388547020 391088562 393568344
2961.6 393568344 397202454 400959015 404645157 408601112 412782898 416966667 421575890 425837936
2969.3 425837936 429342384 432969704 436586761 440371780 443835030 446750717 449496040 452630005
2977 452630005 455854683 458531609 461029625 463033485 465303459 467422447 468956375 470846481 472629356
2985.7 472629356 474055824 475137177 476618042 478081284 479053230 480123062 480672302 481010742 481320343
2994.4 481320343 481650124 482097893 481551476 480482788 480169144 479719162 478256836 476772575 475684433
3003.1 475684433 474213181 472640877 471718445 470799789 469965248 469575729 469390907 469857979 470611687
3011.7 470611687 471399765 472154312 473046036 474164925 475313797 476972275 478150787 478770027 479511909
3020.4 479511909 480257721 481038475 481312218 481237640 481253815 481316833 481063538 480924225 481027184 480674896
3030.1 480674896 480232430 479919243 479762764 479307289 478455772 477858200 477059746 475928879 475231323
3038.7 475231323 475076714 475079155 474651146 473287315 472082787 471400986 470935020 470647278 469581795
3047.4 469581795 468445015 467608032 466557503 465455322 464460220 463929100 463391380 462635918 461659012
3056.1 461659012 460575867 459610901 458707275 457798080 456570396 455367317 454589844 454257240 453676186
3064.8 453676186 452779503 451814690 450642929 449837379 449026947 448323326 447799911 447054672 446075478
3073.5 446075478 445126801 444771080 444171867 443093033 441978836 441341667 440873680 439785500 438824081
3082.1 438824081 437798958 437059097 436960487 436527023 435347404 433843231 432848396 432153816 431325722
3090.8 431325722 430226097 429301300 428736496 427903519 426800728 425742416 425072708 424707298 424195976
3099.5 424195976 423275299 422416115 421397095 420229416 419522820 418783379 418097916 417073517 415993500
3108.2 415993500 415307083 414382744 413344574 412210388 411371727 410473022 409758873 409248314 408131218
3116.9 408131218 407280617 406556358 405631828 404503174 403351479 402224579 400898895 399895363 399226189
3125.5 399226189 398636398 397634010 396687431 396040268 395354156 394303856 392827148 391970215 391092873
3134.2 391092873 389787140 388703346 388002968 387090912 386105423 385905724 384921455 383449593 382584000
3142.9 382584000 381828766 380974503 379641800 378587570 377695808 376462898 375401039 374607277 373624115
3151.6 373624115 372596512 371974525 371195793 370088196 368880653 368013115 367004967 365748749 365116882
3160.3 365116882 364424477 363202744 361850777 361343460 361289406 360212479 358487816 357339897 356909561
3168.9 356909561 356138649 354865685 353755951 353262825 352557945 351430435 350394478 349181938 348424492
3177.6 348424492 347584648 346727180 345957718 344603615 343492393 342796593 342401161 341432190 340317917
3186.3 340317917 339720612 338813133 338030090 337145004 336120110 335381470 334597893 333816948 333330193
3195 333330193 332531395 331493073 330774193 329743309 328742599 327763405 326847916 325920868 325043297
3203.6 325043297 324766350 324085617 323529930 323144722 322515373 321856537 320811348 319723167 318454094
3212.3 318454094 317992363 318072414 317336521 316511040 315928555 315288048 314472141 313660488 312858696 312186871
3222 312186871 311312389 310219955 309509850 309409332 309383869 308307629 307389545 307298355 306745911 305569744
3231.6 305569744 304664745 304092712 303301105 302597866 301596355 300868626 300639153 300025101 299238186
3240.3 299238186 298500633 297971649 297375298 296914005 296011810 294941750 294589596 294290371 293781738
3249 293781738 292851410 292727699 292640038 291703415 290813847 289708328 289121304 288409233 287527065 286865063
3258.6 286865063 286556988 286777172 286361351 285722122 284702358 283826771 283539009 282975578 282321281
3267.3 282321281 281717319 281476898 281016941 280292282 279641132 278902531 278324680 278180599 278005428 277156258
3276.9 277156258 276715164 276342278 275561504 274805012 273926525 273504219 273271809 273113461 272994976 272728176
3286.6 272728176 272240391 271346111 270789223 270700035 270610943 270200577 269439983 268595085 268063641 268099785
3296.2 268099785 268005390 267304592 266956787 267086945 266753387 266179657 265518627 265025425 264734669 264484730
3305.9 264484730 264455605 264027328 263490524 262973213 262517967 262290230 261742725 261138878 260766315 260564995
3315.5 260564995 260260963 260049801 259790535 259169521 258756332 258848801 258789616 257790451 257129555 257286205
3325.2 257286205 257114468 256297646 255437851 254921360 254443264 254280987 253898602 253662167 253665867 253199158
3334.8 253199158 253000202 252784805 252458153 251898136 251498508 251412716 250958920 250422268 249687424 249439240
3344.4 249439240 249341850 248737755 248123722 247652111 247389526 246798401 246086845 245877323 245820408 245066414
3354.1 245066414 244386883 244050236 243421841 243330269 243318119 242980824 242512131 242351971 242449570 242135220
3363.7 242135220 241454811 240520763 240242329 239961376 239355335 238944397 238428020 238213444 238115253 237714024
3373.4 237714024 237166233 237089214 236757088 235888786 235076580 234802513 234960785 234570026 235075665 235146160
3383 235146160 234055634 233684044 233437386 233503895 232894382 232209110 232294350 232298069 232264919 231668682 231149559
3393.6 231149559 231038857 231091175 231002407 231477871 231982574 231265202 230631695 230184269 230108147 230140991
3403.3 230140991 230072803 229726124 229150581 229482174 229683571 229580002 229156017 228927593 228814831 228334827
3412.9 228334827 228847084 229144669 229313717 229440231 228844910 229003639 229605637 229477253 228780613 228580227
3422.6 228580227 228922043 229172115 229173431 229397335 229679279 229627113 229975414 230293427 230213814 230182228
3432.2 230182228 230336895 230590801 230974236 231262569 231141968 231280308 231554241 231393089 231377888 232084064
3441.8 232084064 232560158 232975311 233618393 233771973 234104424 233912964 234064083 234689770 235174866 236149807
3451.5 236149807 236116371 235982399 236367302 236828079 237669621 238041668 238269081 238853092 239639568 239937420
3461.1 239937420 240279617 240570335 240849800 241865444 242340508 242615452 242946072 243103695 243478756
3469.8 243478756 244066792 244472866 244759254 245814342 246507092 246505814 246981487 248064957 248702183 249029713
3479.5 249029713 250094891 251019554 251464806 251376133 251746731 252562618 253462753 254698467 255089283
3488.1 255089283 255675545 256554317 257092495 257653503 258320618 259093094 259442921 259987984 260748863 261630955
3497.8 261630955 262478962 263287983 264154530 264800339 265332718 265286770 265760288 266692257 267570610 268735981
3507.4 268735981 270312157 271320229 271187153 271934605 272586823 273419094 274557037 275424671 276642113
3516.1 276642113 277286739 278350143 279551792 280089092 280514946 281920223 283601189 283152714 283480701
3524.8 283480701 284790325 285516949 285960732 286978798 288517399 289902725 290953465 291001282 291870785
3533.5 291870785 293217316 294096546 294445629 295138664 296933002 297973309 299422741 300731182 301556969
3542.1 301556969 302476711 303815079 305531273 305970821 307224808 307339973 307976360 309628105 311391621
3550.8 311391621 314087124 314314442 315200348 316046925 316866131 318517056 319336452 321467972 322722511
3559.5 322722511 323697929 324727592 326672783 328248482 328353043 331719017 332746010 333280945 334709625
3568.2 334709625 334817810 337875786 339371109 340570869 342234230 343993416 345558090 347601051
3575.9 347601051 350441666 350923805 352505684 354572372 356069908 357522125 358546638 360419502
3583.6 360419502 361955070 365521660 367466888 366788445 369298515 369852600 372638092 376156731 378869514
3592.3 378869514 379912071 380658417 383440056 383237152 385703545 389030724 390026207 392787170 394386826
3601 394386826 396025276 397980728 399642830 402189026 405611191 408377304 407716675 411103897 411389008
3609.6 411389008 410351906 416674957 418908081 418601418 421579781 421011353 425064735 429427452 429546432
3618.3 429546432 431252708 431463318 432421722 435522346 438711929 441346588 443698158 445892906 448509254
3627 448509254 454202728 453756905 445466614 450081863 454948082 459983826 461670685 459975395 462008171
3635.7 462008171 464958725 467423706 468849182 470123062 472042770 474693909 476016350 476703491
3643.4 476703491 479202690 482593765 487881050 487129288 484895439 489746857 488744240 486552773
3651.1 486552773 486684418 492239075 496477242 500180206 504993935 497704697 499092407 504306335
3658.8 504306335 506541824 508639946 508759956 510596962 512139549 513752365 515479507 516320877 520575790
3667.5 520575790 522970543 522435646 523148041 517752457 519891243 527721901 535153427 532444153 518485222
3676.2 518485222 522572823 529681015 533487282 532492752 533466873 536082802 537649422 538547668 538845367
3684.9 538845367 540160980 544973946 550577545 541881256 538669586 545976601 541272202 540843620
3692.6 540843620 545791130 547136269 549337425 550110893 550408401 551899376 552067146 554389687 557282829
3701.3 557282829 552648811 550176888 554875641 556691589 556403580 556908569 559514084 564063492 558190308
3709.9 558190308 561060486 565405083 552455406 556328011 560813828 560519600 560370903 562482643
3717.7 562482643 564250221 560954361 561672020 567210541 565392990 561798019 566474571 567782669
3725.4 567782669 566480026 564043312 564590225 568271561 568662682 572938042 570606461 563529472 571432762
3734 571432762 572279015 564172935 564920502 566769066 567086983 569276695 571957588 568998528 571426353
3742.7 571426353 581919861 572820473 555739784 565466843 571369247 576884079 574542809 565340996
3750.4 565340996 576440506 572913742 564510078 569201775 573608475 577045898 572254410 573876266
3758.2 573876266 578528214 571719475 570250816 574063988 575302162 575244026 578711586 577074356 572117615
3766.8 572117615 574531670 579514236 580401192 572250404 573854065 576951065 577029800 577611275 577417946
3775.5 577417946 578289719 578598557 580956802 580960541 574671860 577069664 579283104 580339012 582110481
3784.2 582110481 578932228 578041077 579852486 580160217 580214539 580081596 579955292 580038376 580463028 579993591
3793.8 579993591 581114502 584073715 580530815 576926270 579163628 583166046 588908234 583448181
3801.5 583448181 572761002 576477203 580230103 584765015 589972878 581562843 577018089 581018829
3809.3 581018829 582857513 583632278 583983231 583541756 584130745 588684731 587609100 575278435 579539795
3817.9 579539795 584668388 588870277 591101532 574775734 575451317 581594086 584214172 585478210
3825.7 585478210 584600792 580956802 581753311 584392395 587272224 588786354 581348572 583078156 589083862
3834.3 589083862 583531914 583709984 591053200 582338219 579004784 587003632 581860466 581284027 587955017
3843 587955017 585921783 582516785 584952888 586014290 585694885 587313461 586251221 587461662 592611618
3851.7 592611618 587738953 590271835 577024422 575936012 585674477 585468407 583905144 585850945
3859.4 585850945 587580223 589780540 585313110 584772339 590721436 585585785 579769363 583402405
3867.1 583402405 588441620 595027657 588360100 578642159 581907272 587411118 591333923 582301407
3874.8 582301407 581834221 585569763 585917244 588484802 592683830 587922935 581193848 586848030 588407936
3883.5 588407936 589371223 593948479 581628571 582156258 586792336 587581596 591016541 590242233 583010712
3892.2 583010712 584291000 586939011 585101624 586415710 587852173 590046043 591756172 582703094
3899.9 582703094 587246780 589638519 583764343 587244186 585144043 584123535 584630203 584543495 585800323
3908.6 585800323 586140862 586583443 585909691 585948830 586301422 586185799 587807312 590361671 587367516
3917.3 587367516 583230057 587149277 587536888 583887482 585993080 587633438 588615532 586571350 582882843
3926 582882843 584302254 586196404 586599693 585293732 585777130 588217239 585725708 583748093 584981499
3934.6 584981499 585447121 585947952 585873795 585502129 586109009 585899010 587047157 588369560 583981590
3943.3 583981590 582996712 585201874 586310425 587202759 585105515 585296059 585921059 584649582 586235657
3952 586235657 586173019 585215111 585289650 585920982 586172104 585053635 585134468 584772034 585560570 586781197
3961.6 586781197 585622025 585405197 585184402 585033607 585893555 586457558 586288719 585028496 584413109
3970.3 584413109 585290527 585591927 584811935 584432182 584718704 584657669 584103622 584284363 584744949 585181465
3980 585181465 585618095 585305862 584714584 584326744 584899101 585372849 585012894 584657784 584162712 584305458
3989.6 584305458 584365578 583839455 583817024 584391060 584574547 584242516 584772377 585410995 585181046 584675064
3999.2 584675064 584611130
4000.2 584611130
##END=$$ End of the data block
