##TITLE=$$ Begin of the data block
##JCAMP-DX=5.00 $$ ACD/SpecManager v 10.08
##SPECTROMETER/DATA SYSTEM=Varian
##DATE=04 Dec 2012 14:11:28
##DATA TYPE=INFRARED SPECTRUM
##DATA CLASS=XYDATA
##ORIGIN=
##OWNER=
##NPOINTS=3735
##FIRSTX=399.26403809
##LASTX=4000.35498047
##MAXX=4000.35498047
##MINX=399.26403809
##MAXY=70.63358307
##MINY=22.89655304
##XFACTOR=1.0000000000
##YFACTOR=0.000000100000000
##FIRSTY=47.33812714
##DELTAX=0.96440572
##XUNITS=1/CM
##YUNITS=TRANSMITTANCE
##XYDATA=(X++(Y..Y))
$$ plain form
399.3 473381271 467275696 475943298 479022408 476490898 473418312 471292381 476757584 481088486
407 481088486 477984047 472424355 468318100 467751846 467369423 472331009 480440559 479704628 474350128
415.7 474350128 478530960 486720772 472729797 463349648 473684158 477021942 482759132 486534271
423.4 486534271 486714401 483622169 474744492 469778404 467486687 463175392 463270531 465963287 467697906
432.1 467697906 470193405 471332474 474076576 471723900 465212326 462522736 459580536 462808800
439.8 462808800 466965599 468243599 469742546 468999519 470382385 471269379 470730515 470219116 470872917
448.4 470872917 471652336 473016891 474612083 473145599 472911606 473309326 477366371 480723953 477423401
457.1 477423401 473118324 469115219 470846863 471974106 470733528 473468628 474829674 476763191
$$ packed form
399.3D73381271o105575Q667602L079110k531510l072586k125931N465203M330902
407D81088486l104439n559692m106255n66254l82423M961586Q109550p35931n354500
415.7D74350128M180832Q189812j3990975r380149J0334510L337784N737190L775139
423.4D86534271J80130l092232q877677m966088k291717m311295R5139K692756J734619
432.1D67697906K495499J139069K744102k352676o511574k689590k942200L228264
439.8D62808800M156799J278000J498947p43027J382866Q86994n38864n11399O53801
448.4D70872917P79419J364555J595192j466484k33993L97720M057045L357582l300552
457.1D77423401m305077m003105J731644J127243j240578K735100J361046J933517
$$ plain form
464.8 476763191 472145653 465182533 464700966 465927315 466434860 463197861 459259415 455937653 460116806
473.5 460116806 468322487 472243843 470559006 462843628 455917931 452736931 453707695 456471786 451508179
482.2 451508179 445655632 448811378 455774994 456693611 454514656 453872757 453798637 451898689 449607353
490.9 449607353 450469055 449523125 449880028 453418350 453969765 451660194 448827858 447081375 443474655
499.6 443474655 440959740 441669807 443283272 442991867 440984001 443053780 444351501 443545609 442274933
508.2 442274933 439122925 435186882 429127960 426230850 426840019 426699753 425084419 424892540 425839539
516.9 425839539 423288651 422836227 422185669 418773651 416509476 416560402 415079575 413123398 414359512
525.6 414359512 413255386 414790230 418137817 419078026 417612228 415717049 416644249 416595879 416873016
$$ packed form
464.8D76763191m617538o963120m81567J226349N07545l236999l938446l321762M179153
473.5D60116806Q205681L921356j684837p715378o925697l181000R70764K764091m963607
482.2D51508179n852547L155746O963616R18617k178955o41899p4120j899948k291336
490.9D49607353Q61702r45930L56903L538322N51415k309571k832336j746483l606720
499.6D43474655k514915P10067J613465k91405k007866K069779J297721q05892j270676
508.2D42274933l152008l936043o058922k897110O09169j40266j615334j91879R46999
516.9D25839539k550888m52424o50558l412018k264175N0926j480827j956177J236114
525.6D14359512j104126J534844L347587R40209j465798j895179R27200m8370K77137
$$ plain form
534.3 416873016 417154198 417960854 421156616 424623947 427562370 427762222 428140182 428478928 427439613
543 427439613 426686096 426475258 427696152 428373718 428726501 429835815 431847610 432998505 432949829 431665115
552.6 431665115 428533401 426626472 424697151 423267670 423197823 423231354 424008026 424847107 424474907
561.3 424474907 421910439 420023346 417524910 413218803 410945396 410425835 409984589 408251534 406795197
570 406795197 405738602 404507751 402816505 401309738 399913406 398635216 399118271 398832817 401106873
578.6 401106873 405179558 406742287 405744553 406838188 410349464 410243073 410292511 412071953 415010376
587.3 415010376 417520485 418583488 421314545 422812462 424107513 425082932 424051437 422705421 422654305
596 422654305 422882347 421980934 422757263 423661461 424122314 425108681 426076164 426607971 425258522 423563957
$$ packed form
534.3D16873016K81182Q06656L195762L467331K938423J99852L77960L38746j039315
543D27439613p53517k10838J220894O77566L52783J109314K011795J150895m8676j284714
552.6D31665115l131714j906929j929321j429481o9847L3531P76672Q39081l72200
561.3D24474907k564468j887093k498436m306107k273407n19561m41246j733055j456337
570D06795197j056595j230851j691246j506767j396332j278190M83055k85454K274056
578.6D01106873M072685J562729r97734J093635L511276j06391M9438J779442K938423
587.3D15010376K510109J063003K731057J497917J295051R75419j031495j346016n1116
596D22654305K28042r01413P76329R04198M60853R86367R67483N31807j349449j694565
$$ plain form
605.6 423563957 422155609 421576195 421933670 423108788 424198265 424873390 427313461 430013123 431005745
614.3 431005745 430659981 431904945 433623810 433340759 432709351 433469238 436135750 438506775 441394234
623 441394234 443773232 445499725 447868538 449160156 449877472 449054337 448037186 449649811 452443047
631.7 452443047 454367104 456925087 459381676 460196152 461346130 461156311 461276016 462093735 461034050
640.4 461034050 460378990 460462875 462286072 465203781 467037506 467483978 467723007 468877296 468777161
649 468777161 467881775 467259636 466413269 466790619 468800163 470568886 471053581 471570854 472138901 471968040
658.7 471968040 470775795 469403305 468432693 468117294 469201279 469668198 470199203 472967415 478553619
667.4 478553619 482459602 475556602 473246651 473060036 472908821 472954636 473597488 473824539 474398613
$$ packed form
605.6D23563957j408348n79414L57475J175118J089477O75125K440071K699662R92622
614.3D31005745l45764J244964J718865k83051o31408P59887K666512K371025K887459
623D41394234K378998J726493K368813J291618P17316q23135j017151J612625K793236
631.7D52443047J924057K557983K456589Q14476J149978j89819J19705Q17719j059685
640.4D61034050o55060Q3885J823197K917709J833725M46472K39029J154289j00135
649D68777161q95386o22139q46367L77350K009544J768723M84695N17273N68047j70861
658.7D71968040j192245j372490r70612l15399J083985M66919N31005K768212N586204
667.4D78553619L905983o903000k309951j86615j51215M5815O42852K27051N74074
$$ plain form
676.1 474398613 475050087 476406898 478591270 479071121 478093452 477427750 477538643 476563263 475797615
684.7 475797615 478051987 481407471 483494530 483438988 482252426 481354561 481809921 481588326 479250259
693.4 479250259 477729683 477521172 478152847 478428268 478223648 478045273 476941719 475519943 473317680
702.1 473317680 471923637 470810127 468176956 467099457 467757378 468519211 468997803 470348396 471791801
710.8 471791801 471709747 471577339 471582794 471859131 472779388 473747292 475076828 477570953 480679169 482837906
720.4 482837906 483568573 484928093 486811943 487306595 487828865 489358749 491754913 494429893 497160454
729.1 497160454 500641098 504138336 507296600 509339905 510432625 510926285 511254692 511707001 511458664
737.8 511458664 512025375 513649025 515790176 517906418 518607941 518749580 518275375 518308525 517763748
$$ packed form
676.1D74398613O51474J356811K184372M79851r77669o65702J10893r75380p65648
684.7D75797615K254372L355484K087059n5542j186562q97865M55360k21595k338067
693.4D79250259j520576k08511O31675K75421k04620j78375j103554j421776k202263
702.1D73317680j394043j113510k633171j077499O57921P61833M78592J350593J443405
710.8D71791801q2054j32408N455K76337R20257R67904J329536K494125L108216K158737
720.4D82837906P30667J359520J883850M94652N22270J529884K396164K674980K730561
729.1D97160454L480644L497238L158264K043305J092720M93660L28407M52309k48337
737.8E11458664N66711J623650K141151K116242P01523J41639m74205L3150n44777
$$ plain form
746.5 517763748 514014244 511237488 510242310 509711571 509977646 509845619 509913025 509179192 507541847
755.1 507541847 505847206 502904816 499833641 498544693 498604813 498516655 498566360 499639244 500916290
763.8 500916290 501725082 502142868 502766495 503903084 504372787 504795570 506519089 508905067 511942863
772.5 511942863 515277328 518397446 522006187 525466042 527640762 529002457 530408173 531842003
780.2 531842003 533433456 535587769 537522583 539591026 541369362 543555260 547031822 548625145
787.9 548625145 547901917 546600342 547038383 548679924 549379959 550321655 552338409 555377579 557743607
796.6 557743607 559244843 559943237 559883842 560572815 561355171 561896477 562979393 565582542 568390503
805.3 568390503 570960312 572659912 573441925 575160103 575607758 575223465 574828148 574419250 574919891
$$ packed form
746.5E17763748l749504k776756r95178n30739K66075j32027O7406p33833j637345
755.1E07541847j694641k942390l071175j288948O0120q8158M9705J072884J277046
763.8E00916290Q08792M17786O23627J136589M69703M22783J723519K385978L037796
772.5E11942863L334465L120118L608741L459855K174720J361695J405716J433830
780.2E31842003J591453K154313J934814K068443J778336K185898L476562J593323
787.9E48625145p23228j301575M38041J641541P00035R41696K016754L039170K366028
796.6E57743607J501236O98394n9395O88973P82356N41306J082916K603149K807961
805.3E68390503K569809J699600P82013J718178M47655l84293l95317m08898N00641
$$ plain form
814 574919891 576156654 577544594 579137459 581146622 581325645 580997505 579758568 577646408 575945168
822.6 575945168 573831100 573301163 573099480 573275871 573011971 572386360 571968956 569633179 567323189
831.3 567323189 564398804 560910034 557935371 556225777 554483681 553040886 554441681 554077606 551237717
840 551237717 548478012 546891861 545117149 541862755 539955673 538659172 538015022 538524513 539011497
848.7 539011497 538995438 538698006 538316917 537505951 537349396 536479721 534597588 533015060 532581253 533029480
858.3 533029480 533947372 536259499 537740898 539141960 540796547 541524849 542911072 543988838 545579948
867 545579948 548234749 551549187 555403900 559246941 563659058 567917252 571192055 573031807 573697510
875.7 573697510 573751907 574463768 575030098 575602417 576847916 577582664 577398262 575758629 574576797
$$ packed form
814E74919891J236763J387940J592865K009163J79023l28140j238937k112160j701240
822.6E75945168k114068n29937k01683J76391k63900o25611m17404k335777k309990
831.3E67323189k924385l488770k974663j709594j742096j442795J400795l64075k839889
840E51237717k759705j586151j774712l254394j907082j296501o44150N09491M86984
848.7E39011497j6059k97432l81089q10966j56555q69675j882133j582528m33807M48227
858.3E33029480R17892K312127J481399J401062J654587P28302J386223J077766J591110
867E45579948K654801L314438L854713L843041M412117M258194L274803J839752O65703
875.7E73697510N4397P11861N66330N72319J245499P34748j84402j639633j181832
$$ plain form
884.4 574576797 572673912 569825363 566991653 563180237 559839973 557504234 556497574 555388794
892.1 555388794 554148521 553115425 551169815 548727531 545514946 542344208 540573769 539877930 537806969
900.8 537806969 535629730 534501839 532609177 531057472 529750252 527527733 523910027 520346107
908.5 520346107 517303848 514256783 511891174 509620667 507557220 504803314 501707878 498967705
916.2 498967705 495580902 491794281 488010597 485213814 482819061 480366020 479073563 478341484 477490387
924.9 477490387 476650963 476100311 475497551 474648247 474319000 473692474 473072319 473481865 474792480 476552505
934.5 476552505 477734146 479363365 481338921 482228775 482597237 483233337 484606133 486173172 487134399
943.2 487134399 488553734 490423660 491467896 492075462 491863365 490755692 489164543 486291199 482756462
$$ packed form
884.4E74576797j902885k848549k833710l811416l340264k335739j006660j108780
892.1E55388794j240273j033096j945610k442284l212585l170738j770439o95839k070961
900.8E37806969k177239j127891j892662j551705j307220k222519l617706l563920
908.5E20346107l042259l047065k365609k270507k063447k753906l095436k740173
916.2D98967705l386803l786621l783684k796783k394753k453041j292457p32079q51097
924.9D77490387q39424n50652o02760q49304l29247o26526o20155M09546J310615J760025
934.5D76552505J181641J629219J975556Q89854L68462O36100J372796J567039R61227
943.2D87134399J419335J869926J044236O07566k12097j107673j591149k873344l534737
$$ plain form
951.9 482756462 479659576 476887589 474126701 470669479 466865578 463421135 459653778 454986687
959.6 454986687 449936752 444735374 439075890 433461113 427681427 422249985 416825752 411100998
967.3 411100998 405405388 398534622 391384544 384107246 376936302 368851471 360569611 352972984
975 352972984 344453583 337228661 330063057 322909317 315402260 307561569 300323067 292701817 286098347
983.7 286098347 279572506 274960175 270408211 265850658 261986942 257849064 255619755 253122921
991.4 253122921 251503563 249662647 247943592 246362362 245307903 245675011 244856129 245165825 244837570
1000.1 244837570 244761906 244170971 243754654 244543095 243543930 243326283 242101040 241659527 241369114 240586071
1009.7 240586071 239882488 238097858 237391071 235698776 234932232 233457088 231998291 231147652 229535732
$$ packed form
951.9D82756462l096886k771987k760888l457222l803901l444443l767357m667091
959.6D54986687n049935n201378n659484n614777n779686n431442n424233n724754
967.3D11100998n695610o870766p150078p277298p170944q084831q281860p596627
975C52972984q519401p224922p165604p153740p507057p840691p238502p621250o603470
983.7B86098347o525841m612331m551964m557553l863716m137878k229309k496834
991.4B53122921j619358j840916j719055j581230j054459L67108q18882L09696l28255
1000.1B44837570p5664n90935m16317P88441r99165k17647j225243m41513k90413p83043
1009.7B40586071p03583j784630p06787j692295p66544j475144j458797q50639j611920
$$ plain form
1018.4 229535732 229432106 229000168 229415283 228965530 229157295 229508476 230168953 231222935 230248547
1027.1 230248547 231388340 231910076 233014908 233697109 233850288 234905987 235093632 236570873 236552696
1035.8 236552696 237247524 237314644 237464066 237974415 237419662 238268414 237720165 239211140 240452557
1044.5 240452557 240642834 240155811 239550171 241021156 241267529 242194061 242256889 243502674 244728241
1053.1 244728241 246286526 249485130 251280212 254381542 256766624 259489746 261010609 263920784
1060.9 263920784 268452988 271493664 275265255 278131657 282745266 285716286 288176575 290084152
1068.6 290084152 289500198 288559933 285331402 282236118 276567459 271940441 268706303 265346394 264193897
1077.2 264193897 262038822 261481323 260230484 260801201 261869907 262368450 263773327 263971443 266289387
$$ packed form
1018.4B29535732j03626m31938M15115m49753J91765L51181O60477J053982r74388
1027.1B30248547J139793N21736J104832O82201J53179J055699J87645J477241j8177
1035.8B36552696O94828O7120J49422N10349n54753Q48752n48249J490975J241417
1044.5B40452557J90277m87023o05640J470985K46373R26532O2828J245785J225567
1053.1B44728241J558285L198604J795082L101330K385082K723122J520863K910175
1060.9B63920784M532204L040676L771591K866402M613609K971020K460289J907577
1068.6B90084152n83954r40265l228531l095284n668659m627018l234138l359909j152497
1077.2B64193897k155075n57499j250839N70717J068706M98543J404877J98116K317944
$$ plain form
1085.9 266289387 268698845 272022285 273954659 276041336 279361420 281629772 284242821 285900059
1093.6 285900059 288718224 289634380 290438480 291841850 293264942 295339718 295851192 297318573 297075825
1102.3 297075825 297517891 298110771 298200817 298617477 298615227 301207485 302340488 304254818 306122208
1111 306122208 307150745 308693981 309368896 310708714 311391201 313014660 313307343 314221249 316015301
1119.7 316015301 316908779 319263287 320599785 322017708 322902184 324319954 325377846 326117783 327327728
1128.4 327327728 327633781 329839363 331279793 332866974 334018021 334052200 333996506 333167114 332803802
1137 332803802 330426636 328023453 325769997 323759956 321529007 319071312 317871380 314918537 312517796
1145.7 312517796 308948689 305844650 304040470 301020355 298703156 296655655 295994434 294888210
$$ packed form
1085.9B66289387K409458L323440J932374K086677L320084K268352K613049J657238
1093.6B85900059K818165R16156Q04100J403370J423092K074776N11474J467381k42748
1102.3B97075825M42066N92880R0046M16660k250K592258J133003J914330J867390
1111C06122208J028537J543236O74915J339818O82487J623459K92683R13906J794052
1119.7C16015301Q93478K354508J336498J417923Q84476J417770J057892P39937J209945
1128.4C27327728L06053K205582J440430J587181J151047L4179n5694q29392l63312
1137C32803802k377166k403183k253456k010041k230949k457695j199932k952843k400741
1145.7C12517796l569107l104039j804180l020115k317199k047501o61221j106224
$$ plain form
1153.4 294888210 294567890 293568096 292966785 293888283 293311958 293751392 293756905 295542660 297930698 300460701
1163.1 300460701 303621635 306308842 310560150 314396000 319004955 323219719 328082504 333375282
1170.8 333375282 338442535 344424858 349673462 355601158 360947647 366898499 372898407 378421097
1178.5 378421097 383947105 388428268 392887230 396477737 400626755 404995766 409342690 413886757
1186.2 413886757 418072815 421825142 424317360 426859818 428637772 430015755 431617241 432809105
1193.9 432809105 433878555 434443130 435306282 436359100 437580986 438331070 438382378 438213844 438003349
1202.6 438003349 438433762 438871803 439830437 440868912 442005615 443755112 445290413 446424446 447382584
1211.3 447382584 448591385 449252701 449862099 450564575 451515083 452668076 453186531 454000587 454867592
$$ packed form
1153.4B94888210l20320r99794o01311R21498n76325M39434N513J785755K388038K530003
1163.1C00460701L160934K687207M251308L835850M608955M214764M862785N292778
1170.8C33375282N067253N982323N248604N927696N346489N950852N999908N522690
1178.5C78421097N526008M481163M458962L590507M149018M369011M346924M544067
1186.2D13886757M186058L752327K492218K542458J777954J377983J601486J191864
1193.9D32809105J069450N64575Q63152J052818J221886P50084N1308j68534k10495
1202.6D38003349M30413M38041R58634J038475J136703J749497J535301J134033R58138
1211.3D47382584J208801O61316O09398P02476R50508J152993N18455Q14056Q67005
$$ plain form
1220 454867592 455607719 455191803 454224205 453954849 452977180 451695366 450452538 449692268 448910217 448029747
1229.6 448029747 447613144 446542702 445528412 444893112 444465485 443219795 441804771 441411247 440951805
1238.3 440951805 440845261 441247635 441861458 441857338 442076645 442699547 442891579 443453217 444009857 444753036
1247.9 444753036 445854416 447270279 448487320 449940529 451592751 452576218 453553581 454147911 454951706
1256.6 454951706 455864334 456492996 457362480 457973747 458822632 460195389 461468353 462388649 463707848
1265.3 463707848 464832077 465139847 465280190 465771027 466722221 467360992 468315392 469687767 471073265
1274 471073265 472425728 473166847 473601990 473714638 473586884 473439827 473459969 474061737 475017014 475873795
1283.6 475873795 476656990 477758141 478544006 478623238 478623505 478695831 478449135 477909508 477438011 477292976
$$ packed form
1220D54867592P40127m15916r67598k69356r77669j281814j242828p60270p82051q80470
1229.6D48029747m16603j070442j014290o35300m27627j245690j415024l93524m59442
1238.3D40951805j06544M02374O13823m120K19307O22902J92032N61638N56640P43179
1247.9D44753036J101380J415863J217041J453209J652222R83467R77363N94330Q03795
1256.6D54951706R12628O28662Q69484O11267Q48885J372757J272964R20296J319199
1265.3D63707848J124229L07770J40343M90837R51194O38771R54400J372375J385498
1274D71073265J352463P41119M35143J12648j27754j47057K0142O01768R55277Q56781
1283.6D75873795P83195J101151P85865P9232K67P2326k46696n39627m71497j45035
$$ plain form
1293.3 477292976 477513199 478077698 478587303 478446465 478043747 477364349 476316681 475736084 475293655
1301.9 475293655 474484406 474105644 474369011 474568939 474637871 474870529 474666214 474063339 473655510 473138008
1311.6 473138008 472226257 471522827 471160622 470539513 470098228 470202866 470134850 469474068 468506622 467639885
1321.2 467639885 466544762 465301895 464100647 462875252 462382126 462288857 461916542 461534157 460790443
1329.9 460790443 459521484 458266449 457086449 456061325 455254288 454521408 453924332 453588257 453906784
1338.6 453906784 453623695 453138542 453666649 453904190 453746223 453176003 452955399 452904968 452954559 453133125
1348.2 453133125 452931709 453109131 453361015 453320694 452690544 452175331 451198311 449529648 448916283 448480148
1357.9 448480148 448335571 448346977 448076019 447588425 446835785 445687447 444483032 443756981 442595863
$$ packed form
1293.3D77292976K20223N64499N09605j40838m02718o79398j047668n80597m42429
1301.9D75293655q09249l78762K63367J99928O8932K32658k04315o02875m07829n17502
1311.6D73138008r11751p03430l62205o21109m41285J04638o8016o60782r67446q66737
1321.2D67639885j095123j242867j201248j225395m93126r3269l72315l82385p43714
1329.9D60790443j268959j255035j180000j025124q07037p32880n97076l36075L18527
1338.6D53906784k83089m85153N28107K37541j57967n70220k20604n0431M9591J78566
1348.2D53133125k01416J77422K51884m0321o30150n15213r77020j668663o13365m36135
1357.9D48480148j44577J1406k70958m87594p52640j148338j204415p26051j161118
$$ plain form
1366.6 442595863 442131805 441707916 441070137 441449051 441366768 441719513 441316681 440628357 440953941 440404816
1376.2 440404816 439632187 438747330 439084702 439851456 441383743 442924728 444134865 445517273 446312675
1384.9 446312675 447959137 449259911 449565659 450179558 451217079 452131386 452768860 453879128 454885788
1393.6 454885788 455167351 454297447 454389915 454352455 454117622 452667885 451472206 452002068 451811104 452143326
1403.2 452143326 452047462 451213684 452056351 452564964 452406120 451609421 451006470 449898148 448732605
1411.9 448732605 448047142 447796555 447977219 447832985 447993202 447766914 448242187 446322823 446274490 448726006
1421.5 448726006 449358826 449383545 449310341 450599937 451943359 452391548 452459373 451678009 451642418 451451492
1431.2 451451492 451654663 451430397 451265831 451828537 451248093 449257355 449363785 451319809 451981583
$$ packed form
1366.6D42595863m64058m23889o37779L78914q2283L52745m02832o88324L25584n49125
1376.2D40404816p72629q84857L37372P66754J532287J540985J210137J382408P95402
1384.9D46312675J646462J300774L05748O13899J037521R14307O37474J110268J006660
1393.6D54885788K81563q69904R2468l7460k34833j449737j195679N29862j90964L32222
1403.2D52143326r5864q33778Q42667N08613j58844p96699o02951j108322j165543
1411.9D48732605o85463k50587J80664j44234J60217k26288M75273j919364m8333K451516
1421.5D48726006O32820K4719p3204J289596J343422M48189O7825p81364l5591j90926
1431.2D51451492K03171k24266j64566N62706n80444j990738J06430J956024O61774
$$ plain form
1439.8 451981583 452057419 451453476 450307655 450510025 450104332 450236359 450099525 450137787 449416771 449198647
1449.5 449198647 449120178 447276764 445918999 443468933 442684402 441375885 440048141 440052605 437190437
1458.2 437190437 440577621 441438942 443527527 443978920 444767990 446315460 444659195 446333809 447603874
1466.8 447603874 452593918 457864151 465157166 472801170 478166542 487469292 492416306 498685684
1474.6 498685684 502663612 506981201 511285324 515140305 520061188 523848610 527755280 530057716
1482.3 530057716 533175659 535335732 536441536 537671089 536837654 537679977 539320107 540752792 541324387
1491 541324387 543339729 544854279 544721642 545187950 544503746 541417313 541979485 541964836 540483398
1499.6 540483398 541128960 541429329 540752945 541031036 541309929 540900497 535618629 530993729 530087624
$$ packed form
1439.8D51981583P5836o03943j145821K02370m05693J32027j36834L8262p21016k18124
1449.5D49198647p8469j843414j357765k450066p84531j308517j327744M464k862168
1458.2D37190437L387184Q61321K088585M51393P89070J547470j656265J674614J270065
1466.8D47603874M990044N270233P293015P644004N365372R302750M947014O269378
1474.6D98685684L977928M317589M304123L854981M920883L787422L906670K302436
1482.3E30057716L117943K160073J105804J229553q33435Q42323J640130J432685N71595
1491E41324387K015342J514550j32637M66308o84204l086433N62172j4649j481438
1499.6E40483398O45562L00369o76384K78091K78893m09432n281868m624900r06105
$$ plain form
1508.3 530087624 528901253 528349800 528580894 527673378 525909081 526254005 525589790 523928604 521831703
1517 521831703 519031219 521477661 522891388 520190773 519068222 520167389 522695656 524399834 523974266
1525.7 523974266 523425903 523241920 522033272 521520615 521828995 520927505 520403862 519147453 517185211
1534.3 517185211 519018326 520246735 521024361 521784668 519168167 514119415 517344246 517901382 517375107
1543 517375107 519296989 519825974 520572510 522591057 524296646 525770302 526634216 526595802 527908707
1551.7 527908707 529538345 531289825 531735382 532821274 537280540 540854111 538655090 536208572
1559.4 536208572 538446121 544047165 546517448 548681984 549936523 550136948 551637192 553510818
1567.1 553510818 555510406 556265411 555877686 557647400 559576035 559965744 559895935 560367622 560043221
$$ packed form
1508.3E30087624j186371n51453K31094r07516j764297L44924o64215j661186k096901
1517E21831703k800484K446442J413727k700615j122551J099167K528267J704178m25568
1525.7E23974266n48363j83983j208648n12657L08380r01490n23643j256409j962242
1534.3E17185211J833115J228409P77626P60307k616501n048752L224831N57136n26275
1543E17375107J921882N28985P46536K018547J705589J473656Q63914l8414J312905
1551.7E27908707J629638J751480M45557J085892M459266L573571k199021k446518
1559.4E36208572K237549N601044K470283K164536J254539K00425J500244J873626
1567.1E53510818J999588P55005l87725J769714J928635L89709o9809M71687l24401
$$ plain form
1575.8 560043221 557566566 559150658 561751747 562699890 562938461 562442055 561992416 561383171 560061684
1584.5 560061684 559485359 558528328 557595024 556675529 556407509 555824738 554506378 553184395 551827888
1593.2 551827888 550474167 548015480 546101570 544165230 542726479 541349907 540007515 538723068
1600.9 538723068 536566124 534817085 532094193 529381447 526609306 523798714 520702209 518467331
1608.6 518467331 516117973 512336502 510473557 507806969 505277863 502287407 500262146 497625084
1616.3 497625084 486941261 485658722 483655853 481585617 478238297 476175880 473847198 467014427
1624 467014427 464916382 462074509 460068932 454994850 450777283 448362923 444962120 442311478 438901520
1632.7 438901520 438288116 436934471 430683060 426494026 426076622 424556236 422643013 422074471 419740028
$$ packed form
1575.8E60043221k476655J584092K601089R48143K38571m96406m49639o09245j321487
1584.5E60061684n76325r57031r33304r19495k68020n82771j318360j321983j356507
1593.2E51827888j353721k458687j913910j936340j438751j376572j342392j284447
1600.9E38723068k156944j749039k722892k712746k772141k810592l096505k234878
1608.6E18467331k349358l781471j862945k666588k529106k990456k025261k637062
1616.3D97625084j0683823j282539k002869k070236l347320k062417k328682o832771
1624D67014427k098045k841873k005577n074082m217567k414360l400803k650642l409958
1632.7D38901520o13404j353645o251411m189034m17404j520386j913223n68542k334443
$$ plain form
1641.4 419740028 419540749 418001823 417880669 418414459 415269432 414363480 411988754 413573799 413179054
1650.1 413179054 414747581 416605530 412061577 409876404 410579872 414787865 415797958 417183456
1657.8 417183456 417881203 419110374 420886383 422107544 424128075 424260902 427833138 429939575 432073402
1666.5 432073402 434352646 436411934 438875389 439613876 443830910 445264511 447903252 451131248
1674.2 451131248 453682594 455242043 457766228 461889000 464134712 467096367 468997688 472245369
1681.9 472245369 475726662 473848267 476302109 481143837 486910706 490352821 493366318 496914558
1689.6 496914558 499650383 502984772 505473061 508468132 512151489 516457558 515709343 519303551
1697.3 519303551 524919090 529390335 531942635 529840927 535193214 539295883 541797676 542233772
$$ packed form
1641.4D19740028j99279j538926j21154N33790l145027r05952k374726J585045l94745
1650.1D13179054J568527J857949m543953k185173P03468M207993J010093J385498
1657.8D17183456O97747J229171J776009J221161K020531J32827L572236K106437K133827
1666.5D32073402K279244K059288K463455P38487M217034J433601K638741L227996
1674.2D51131248K551346J559449K524185M122772K245712K961655J901321L247681
1681.9D72245369L481293j878395K453842M841728N766869L442115L013497L548240
1689.6D96914558K735825L334389K488289K995071L683357M306069p48215L594208
1697.3E19303551N615539M471245K552300k101708N352287M102669K501793M36096
$$ plain form
1705 542233772 543035583 544432411 545940247 548184967 549048271 550187988 552160339 553747444 555321693
1713.7 555321693 555294342 554543533 556035118 556899719 555147667 559064102 561903839 563232193 564022026
1722.4 564022026 564174881 563954239 563384247 562500076 560725708 559202576 558147697 554130592 550832329
1731.1 550832329 550943832 551106567 544612579 532816849 532096176 529877892 525488358 521811409 515379105
1739.8 515379105 507345619 505517845 503956032 499419289 498493156 498921280 501035690 504182014 507785263
1748.4 507785263 513383446 519343987 529609070 538630371 549071198 559228554 569074860 579381409
1756.2 579381409 588402367 597610474 604325104 611350365 617671204 622163315 627528267 632628288
1763.9 632628288 637231750 640526352 644106674 646942825 647370453 649988785 653055954 654004593 653553162
$$ packed form
1705E42233772Q01811J396828J507836K244720Q63304J139717J972351J587105J574249
1713.7E55321693k7351p50809J491585Q64601j752052L916435K839737J328354P89833
1722.4E64022026J52855k20642n69992q84171j774368j523132j054879m017105l298263
1731.1E50832329J11503J62735o493988j1795730p20673k218284m389534l676949o432304
1739.8E15379105q033486j827774j561813m536743r26133M28124K114410L146324L603249
1748.4E07785263N598183N960541J0265083R021301J0440827J0157356R846306J0306549
1756.2E79381409R020958R208107O714630P025261O320839M492111N364952N100021
1763.9F32628288M603462L294602L580322K836151M27628K618332L067169R48639m51431
$$ plain form
1772.5 653553162 654002686 657149887 659715652 660677338 662769241 663843155 664965210 665653839 664797440
1781.2 664797440 665845108 667187347 668566437 668617554 668671951 670485535 671710510 672442093 673266296
1789.9 673266296 673345947 673406677 672153397 672091370 674542923 675654449 675413971 676479034 678254318
1798.6 678254318 678613510 677745285 678655853 678100662 678054504 679348602 679708862 680303345 681094971 681763840
1808.2 681763840 682380829 682849274 682425537 683015060 683580399 683249359 683827820 683990555 684506760 684863358
1817.9 684863358 685285416 686378632 686546936 686818161 686604385 687101288 687465897 684960937 685021362
1826.5 685021362 686689682 688134842 688629303 686965256 687800217 689569931 689757004 689710693 689268494
1835.2 689268494 688735275 688667679 688459091 689421310 689983368 690119553 690382919 691524887 691956482 688107529
$$ packed form
1772.5F53553162M49524L147201K565765R61686K091903J073914J122055O88629q56399
1781.2F64797440J047668J342239J379090N1117N4397J813584J224975P31583Q24203
1789.9F73266296P9651O0730j253280o2027K451553J111526k40478J065063J775284
1798.6F78254318L59192q68225R10568n55191m6158J294098L60260N94483P91626O68869
1808.2F81763840O16989M68445m23737N89523N65339l31040N78461J62735N16205L56598
1817.9F84863358M22058J093216J68304K71225k13776M96903L64609k504960O0425
1826.5F85021362J668320J445160M94461j664047Q34961J769714J87073m6311m42199
1835.2F89268494n33219o7596k08588R62219N62058J36185K63366J141968M31595l848953
$$ plain form
1844.9 688107529 689205704 690390167 689680252 689598007 690243225 690744705 690923233 691895981 692265472
1853.6 692265472 692450867 692279129 691621246 691454163 690817795 690602646 690684738 691328125 691849136 692246170
1863.2 692246170 693055496 693501282 693536911 692619934 692265091 690629425 689463730 691014328 692028046
1871.9 692028046 692614212 692843475 693170547 693484497 693594818 693320847 693073883 693003387 692385178 692129135
1881.5 692129135 692206726 693022614 693637772 693795090 694017868 693940506 694438934 693857346 692282639 692571182
1891.2 692571182 693436966 693503189 693656006 693934937 693797150 694611588 694723969 694623337 694518661 693780975
1900.8 693780975 693521576 693419113 693853683 693894577 694028168 694601364 694625854 694533539 694460754 693874283
1910.4 693874283 693170242 693509293 693468475 693633118 693934174 694096146 695144577 694211349 693559265 694037704
$$ packed form
1844.9F88107529J098175J184463p09915q2245O45218N01480J78528R72748L69491
1853.6F92265472J85395j71738o57883j67083o36368k15149Q2092O43387N21011L97034
1863.2F92246170Q09326M45786L5629r16977l54843j635666j165695J550598J013718
1871.9F92028046N86166K29263L27072L13950J10321k73971k46964p0496o18209k56043
1881.5F92129135P7591Q15888O15158J57318K22778p7362M98428n81588j574707K88543
1891.2F92571182Q65784O6223J52817K78931j37787Q14438J12381j00632j04676p37686
1900.8F93780975k59399j02463M34570M0894J33591N73196K4490r2315p2785n86471
1910.4F93874283p04041L39051m0818J64643L01056J61972J048431r33228o52084M78439
$$ plain form
1920.1 694037704 693906403 693643494 692578659 692341003 692962112 693541718 693766556 693948669 694246521
1928.8 694246521 694562073 694416580 693694992 693575211 693374557 693031693 692704239 692786789 693093948 693311081
1938.4 693311081 694028320 694208603 694699707 694548798 692735291 692383347 692553101 692399368 692391434 692716217
1948.1 692716217 692770996 693428040 694374084 694534454 694272690 693855743 693554382 692846298 692508316 692392960
1957.7 692392960 692312927 692635803 692925644 693691025 694133682 694166489 694000473 693658905 693039398 691917953
1967.3 691917953 691287918 691376572 692245865 692918549 693423004 694044189 694148102 693696594 693199768 693277283
1977 693277283 692639618 691823196 691763229 691977615 692312775 692585526 693070908 693304291 693339920 693120575
1986.6 693120575 692698822 692018585 691387100 691695557 691789246 691044998 690849915 691811218 692410278 692333069
$$ packed form
1920.1F94037704j31301k62909j064835k37656O21109N79606K24838J82113K97852
1928.8F94246521L15552j45493p21588j19781k00654l42864l27454Q2550L07159K17133
1938.4F93311081P17239J80283M91104j50909j813507l51944J69754j53733p934L24783
1948.1F92716217N4779O57044R46044J60370k61764m16947l01361p08084l37982j15356
1957.7F92392960q0033L22876K89841P65381M42657L2807j66016l41568o19507j121445
1967.3F91917953o30035Q8654Q69293O72684N04455O21185J03913m51508m96826P7515
1977F93277283o37665q16422n9967K14386L35160K72751M85382K33383L5629k19345
1986.6F93120575m21753o80237o31485L08457R3689p44248j95083R61303N99060p7209
$$ plain form
1996.3 692333069 692279968 691679382 691062775 690687485 690781631 690665131 690349197 690738678 691059418 690995712
2005.9 690995712 690635300 690521011 690228806 689612122 689457321 689466324 689173889 688836517 688992920 689124680
2015.6 689124680 688958282 688407974 688166428 688045197 687439270 687014618 686453247 686334610 686523743 686556549
2025.2 686556549 686536255 686296844 686196213 685811844 685311432 684573669 684003525 683811874 683583221 683735809
2034.9 683735809 683938141 684058533 684122314 684306259 684105911 683383179 682488480 681919479 681839981 681517868
2044.5 681517868 681815643 682231064 682482071 682646484 682394714 682232056 681677704 681451187 681059799 680624237
2054.1 680624237 680412140 680036621 680351334 680637512 681389389 682193375 682324905 682198792 681846695 681365433
2063.8 681365433 680518646 680085754 679679642 679604568 680062790 680456314 681018829 681664963 682085953 681435089
$$ packed form
1996.3F92333069n3101o00586o16607l75290R4146j16500l15934L89481L20740o3706
2005.9F90995712l60412j14289k92205o16684j54801R003k92435l37372J56403J31760
2015.6F89124680j66398n50308k41546j21231o05927m24652n61371j18637J89133L2806
2025.2F86556549k0294k39411j00631l84369n00412p37763n70144j91651k28653J52588
2034.9F83735809K02332J20392O3781J83945k00348p22732q94699n69001p9498l22113
2044.5F81517868K97775M15421K51007J64413k51770j62658n54352k26517l91388m35562
2054.1F80624237k12097l75519L14713K86178P51877Q03986J31530j26113l52097m81262
2063.8F81365433q46787m32892m06112p5074M58222L93524N62515O46134M20990o50864
$$ plain form
2073.4 681435089 680739212 680266647 679797287 679536819 679506989 680211639 680722198 681264877 681608887 681656113
2083.1 681656113 681524811 680974579 680610886 680072098 679736481 679479218 679679718 680055542 680251083 680980072
2092.7 680980072 681306458 681416702 681148071 680617599 680232468 679927063 679687729 679291306 679330750 679836655
2102.4 679836655 680759354 681253281 681254883 680901337 680546036 680667877 680286407 679874420 679217758 679290619
2112 679290619 680129471 680370789 680627060 680491409 680132446 679783325 679785080 679698486 679562683 679455338
2121.6 679455338 678963928 679274292 679662094 680282211 680529633 680086975 679932556 679494019 679315109 679004211
2131.3 679004211 678827209 678614120 678473053 679057770 679634933 679974365 679657745 679610748 679331055 678748093
2140.9 678748093 678557129 678318634 678604736 678948822 679106979 679159317 679522171 679603806 679085617 678752594
$$ packed form
2073.4F81435089o95877m72565m69360k60468k9830P04650N10559N42679L44010M7226
2083.1F81656113j31302n50232l63693n38788l35617k57263K00500L75824J95541P28989
2092.7F80980072L26386J10244k68631n30472l85131l05405k39334l96423L9444N05905
2102.4F79836655R22699M93927J602l53546l55301J21841l81470m11987o56662P2861
2112F79290619Q38852K41318K56271j35651l58963l49121J755q6594j35803j07345
2121.6F79455338m91410L10364L87802O20117K47422m42658j54419m38537j78910l10898
2131.3F79004211j77002k13089j41067N84717N77163L39432l16620m6997k79693n82962
2140.9F78748093j90964k38495K86102L44086J58157N2338L62854Q1635n18189l33023
$$ plain form
2150.6 678752594 678503723 678408966 677970123 678016586 678371353 678725891 679369354 679760132 679961777 679407425
2160.2 679407425 679213867 679048843 678558350 678591843 678826294 679316940 679268494 679456787 680011749 680423355
2169.9 680423355 680923691 681160049 680892334 680296860 680248489 680027695 680058670 680590134 681018600 681383972
2179.5 681383972 681475449 682051392 682392807 682231903 681781616 681366730 681289215 681283646 681551819 681735458
2189.1 681735458 682392426 683102722 683821869 683977966 683223114 683221130 683096161 682579346 682176971 682330856
2198.8 682330856 682760468 683190918 684042053 684670334 685079193 684639587 684116669 683987122 683728409 683575363
2208.4 683575363 683520584 683883209 684193954 684818039 685330048 685653305 685938034 685865631 685824661 685076828
2218.1 685076828 684702759 684636078 684585114 684987564 685368576 686000443 686171265 686057587 685931396 686031494
$$ packed form
2150.6F78752594k48871r4757m38843M6463L54767L54538O43463L90778K01645n54352
2160.2F79407425j93558j65024m90493L3493K34451M90646m8446J88293N54962M11606
2169.9F80423355N00336K36358k67715n95474m8371k20794L0975N31464M28466L65372
2179.5F81383972R1477N75943L41415j60904m50287m14886p7515n569K68173J83639
2189.1F81735458O56968P10296P19147J56097p54852j984j24969n16815m02375J53885
2198.8F82330856M29612M30450Q51135O28281M08859m39606n22918j29547k58713j53046
2208.4F83575363n4779L62625L10745O24085N12009L23257K84729p2403m0970p47833
2218.1F85076828l74069o6681n0964M02450L81012O31867J70822j13678j26191J00098
$$ plain form
2227.7 686031494 685944366 685417252 685269012 685411301 685834808 685781631 685702362 685900650 686427536 686726913
2237.4 686726913 685886688 685443344 685572281 686021347 686169052 686060944 686082382 685945435 686293716 686612091
2247 686612091 686544189 686017456 685871887 685778351 685629425 686057968 686109772 686476746 686641235 686522522
2256.7 686522522 686440125 686415558 686494522 685971375 685722427 685413513 685743713 686398544 686532059 686870499
2266.3 686870499 686868973 686916885 686939392 686924515 686643600 686455994 686249390 685688858 685762634 686163483 686872330
2276.9 686872330 687042847 687372360 687606277 687107010 686820908 685753708 685164795 684911041 685112152
2285.6 685112152 685966492 686633682 687608719 687673569 687611771 687470245 686974182 686328201 686007843 686520157
2295.2 686520157 686222382 686646423 687637711 688284836 689048309 689593124 690079346 689773865 689568634 689179077
$$ packed form
2227.7F86031494q7128n27114j48240J42289M23507n3177p9269J98288N26886K99377
2237.4F86726913q40225m43344J28937M49066J47705j08108K1438j36947L48281L18375
2247F86612091o7902n26733j45569r3536j48926M28543N1804L66974J64489j18713
2256.7F86522522q2397k4567P8964n23147k48948l08914L30200O54831J33515L38440
2266.3F86870499j526M7912K2507j4877k80915j87606k06604n60532P3776M00849P08847
2276.9F86872330J70517L29513K33917m99267k86102j067200n88913k53754K01111
2285.6F85112152Q54340O67190R75037O4850o1798j41526m96063o45981l20358N12314
2295.2F86520157k97775M24041R91288O47125P63473N44815M86222l05481k05231l89557
$$ plain form
2304.9 689179077 688646164 688450851 688735809 689918289 690729218 692211456 693662338 693691559 692900085
2313.5 692900085 692201157 692409286 692284698 692484207 692567825 693055496 694847946 696118317 697653351
2322.2 697653351 698836975 697942505 697077484 698158875 698754883 698231888 698626404 699086761 699471283
2330.9 699471283 699579468 699892273 700617752 700450287 699654922 698898773 698932343 698957596 699968719 701695480
2340.6 701695480 701513824 700766602 700232620 700491638 700213547 697744904 694303360 691416168 692120972
2349.2 692120972 694975967 696200867 697530975 699012909 700149612 701934204 702976456 705055237
2356.9 705055237 705757294 704422684 704178238 705756378 706335831 704930267 703394165 701733398 701927261
2365.6 701927261 701767731 699880753 697879868 696047211 694344559 692222595 690590134 689468918
$$ packed form
2304.9F89179077n32913j95313K84958J182480Q10929J482238J450882K9221p91474
2313.5F92900085o98928K08129j24588J99509Q3618M87671J792450J270371J535034
2322.2F97653351J183624q94470q65021J081391N96008n22995L94516M60357L84522
2330.9F99471283J08185L12805P25479j67465p95365p56149L3570K5253J011123J726761
2340.6G01695480j81656p47222n33982K59018k78091k468643l441544k887192P04804
2349.2F92120972K854995J224900J330108J481934J136703J784592J042252K078781
2356.9G05055237P02057j334610k44446J578140N79453j405564j536102j660767J93863
2365.6G01927261j59530j886978k000885j832657j702652k121964j632461j121216
$$ plain form
2373.3 689468918 688564453 687369003 685968781 685562897 685380707 683875275 681804428 680451431 679210434
2382 679210434 678342819 677477112 676390686 676100388 676068649 676114655 675934982 675781479 675797195 675552979
2391.7 675552979 675275421 674629822 674185562 673791962 673674774 673938141 673946381 674190903 674053192 673736343
2401.3 673736343 673470230 673063278 672813034 672495422 672038422 671764297 671993790 672014084 672052765 672057877
2410.9 672057877 671615448 671273270 670877533 670459671 669898682 669512787 669538574 669636154 669672928 669724045
2420.6 669724045 669861526 669659805 669197235 668616409 668203964 667869186 667595291 667207184 666623535 666771851
2430.2 666771851 666902161 666661072 666432648 666434479 666422882 665782318 665142288 664675140 664483414 664138641
2439.9 664138641 663943939 663997345 663785172 663966370 663841019 663533630 663048553 662201462 661635056 661226120
$$ packed form
2373.3F89468918r04465j195450j400222m05884j82190j505432k070847j352997j240997
2382F79210434q67615q65707j086426k90298l1739M6006j79673j53503J5716k44216
2391.7F75552979k77558o45599m44260l93600j17188K63367Q240K44522j37711l16849
2401.3F73736343k66113m06952k50244l17612m57000k74125K29493K0294L8681N112
2410.9F72057877m42429l42178l95737m17862n60989l85895K5787R7580L6774N1117
2420.6F69724045J37481k01721m62570n80826m12445l34778k73895l88107n83649J48316
2430.2F66771851J30310k41089k28424J831j1597o40564o40030m67148j91726l44773
2439.9F64138641j94702N3406k12173J81198j25351l07389m85077q47091n66406m08936
$$ plain form
2449.5 661226120 660948105 660754852 661031570 661057281 660922928 661106796 660934296 660496063 659676361 659054108
2459.2 659054108 658711090 658447266 658525162 658748322 658727722 658490067 658448563 658068695 657545166 657270355
2468.8 657270355 657135696 656562881 656052704 656214905 655736923 655592575 655912170 655816879 655638580 655337143
2478.5 655337143 655213242 654770584 654276810 653941269 653664246 653607407 653653946 653699265 653420563 653219986
2488.1 653219986 652923279 652644348 652285843 651946487 652020569 651940079 652007065 651750107 651473083 651708832
2497.7 651708832 651688538 651370239 650981903 650523834 650012131 649897537 649642258 649492493 649757843 649873810
2507.4 649873810 649987946 649765472 649414139 648839798 648440247 648238831 647948151 647978973 647727661 648035812
2517 648035812 648578415 648524323 648321762 647583237 646733932 646309967 646333923 646245193 645881500 645662079
$$ packed form
2449.5F61226120k78015j93253K76718K5711j34353J83868j72500m38233q19702o22253
2459.2F59054108l43018k63824P7896K23160k0600k37655m1504l79868n23529k74811
2468.8F57270355j34659n72815n10177J62201m77982j44348L19595r5291j78299l01437
2478.5F55337143j23901m42658m93774l35541k77023n6839M6539M5319k78702k00577
2488.1F53219986k96707k78931l58505l39356P4082q0490O6986k56958k77024K35749
2497.7F51708832k0294l18299l88336m58069n11703j14594k55279j49765K65350J15967
2507.4F49873810J14136k22474l51333n74341l99551k01416k90680L0822k51312L08151
2517F48035812N42603n4092k02561p38525q49305m23965K3956q8730l63693k19421
$$ plain form
2526.7 645662079 645595856 645738220 646112747 646200714 645730209 645412979 644945679 644262390 643732758 643435135
2536.3 643435135 643370590 643061142 643012314 643061142 643004150 642882385 642524109 642352142 641945953 641200256
2546 641200256 640559158 640339432 640380249 640530548 640752106 640775528 640338135 639633446 639604378 639338341
2555.6 639338341 638522835 638021736 637743797 637906227 637927322 637609978 637413406 637495003 637539330 637164459
2565.2 637164459 636584740 636119385 635772667 635280228 635060310 634779625 634757347 635005798 634682922 634607925
2574.9 634607925 634325333 633960533 633790817 633161316 632545853 632291489 632342682 631990623 631707458 631665840
2584.5 631665840 631317673 631068268 630840454 630739288 630704689 630393028 629734077 629310036 629214363 629048767
2594.2 629048767 629266663 629567451 629387970 629119453 629018707 628319435 627309761 627014771 627170525
$$ packed form
2526.7F45662079o6223J42364L74527Q7967m70505l17230m67300o83289n29632k97623
2536.3F43435135o4545l09448m8828M8828n6992j21765l58276j71967m06189p45697
2546F41200256o41098k19726M0817J50299K21558K3422m37393p04689k9068k66037
2555.6F39338341q15506n01099k77939J62430K1095l17344j96572Q1597M4327l74871
2565.2F37164459n79719m65355l46718m92439k19918k80685k2278K48451l22876p4997
2574.9F34607925k82592l64800j69716o29501o15463k54364N1193l52059k83165m1618
2584.5F31665840l48167k49405k27814j01166l4599l11661o58951m24041r5673j65596
2594.2F29048767K17896L00788j79481k68517j00746o99272j009674k94990J55754
$$ plain form
2602.9 627170525 627137108 626967773 626993637 626560593 626173096 626050110 625534058 625030441 624351730 623884354
2612.5 623884354 623695793 623617973 623385010 622890511 622876587 622637329 622182999 621528358 620694771 620335007
2622.1 620335007 619840469 619420013 619298172 619160080 618923798 618351707 617782974 617559509 617015190 616192131
2631.8 616192131 615822945 615393906 614931145 614794426 614637833 614236450 613663712 613255043 612734375 611850090
2641.4 611850090 611182785 610885010 610474968 610205765 609862633 609374199 609155884 608554115 608165245 608112068
2651.1 608112068 607483673 606555557 605917358 605821342 605485268 604809303 604222527 603808556 603834038 603859863
2660.7 603859863 603454590 602944717 602429428 601693115 601104622 600681114 600455475 600241089 599710541 599390373
2670.4 599390373 599136887 598973351 598736458 598259506 597812500 597332840 597052536 596632576 596227188 595926285
$$ packed form
2602.9F27170525l3417j69335K5864m33044l87497j22986n16052n03617o78711m67376
2612.5F23884354j88561p7820k32963m94499j3924k39258m54330o54641q33587l59764
2622.1F20335007m94538m20456j21841j38092k36282n72091n68733k23465n44319q23059
2631.8F16192131l69186m29039m62761j36719j56593m01383n72738m08669n20668q84285
2641.4F11850090o67305k97775m10042k69203l43132m88434k18315o01769l88870n3177
2651.1F08112068o28395r28116o38199r6016l36074o75965n86776m13971K5482K5825
2660.7F03859863m05273n09873n15289p36313n88493m23508k25639k14386n30548l20168
2670.4E99390373k53486j63536k36893m76952m47006m79660k80304m19960m05388l00903
$$ plain form
2680 595926285 595487175 595166206 594698982 594369278 594386292 594137726 593696709 593361320 592748795 592373123
2689.6 592373123 592253418 591780205 591653557 591589890 591212234 590803909 590512657 590393257 590040550 589336929
2699.3 589336929 588584328 588155403 587790794 587611847 587442703 587302589 587371521 586650581 586105118 585897675
2708.9 585897675 585124588 584541054 584046707 583573303 583560143 583595695 583053703 582316589 581758194 581329956
2718.6 581329956 580876274 580279236 579882126 579536781 579168587 578790817 578687210 578700294 578197823 577473412
2728.2 577473412 576888161 576700211 576316757 575741577 575492020 575335464 575279999 575102882 574727859 574097633
2737.9 574097633 573661118 573420486 572838707 572315407 572266884 572494087 572178841 571470947 571075249 571095581
2747.5 571095581 570826225 570467911 570458908 569829865 569276161 568940964 568485565 568188210 567882767 567725525
$$ packed form
2680E95926285m39110l20969m67224l29704J7014k48566m41017l35389o12525l75672
2689.6E92373123j19705m73213j26648o3667l77656m08325k91252j19400l52707p03621
2699.3E89336929p52601m28925l64609j78947j69144j40114O8932p20940n45463k07443
2708.9E85897675p73087n83534m94347m73404j3160L5552n41992p37114n58395m28238
2718.6E81329956m53682n97038l97110l45345l68194l77770j03607J3084n02471p24411
2728.2E77473412n85251j87950l83454n75180k49557j56556n5465j77117l75023o30226
2737.9E74097633m36515k40632n81779n23300m8523K27203l15246p07894l95698K0332
2747.5E71095581k69356l58314r003o29043n53704l35197m55399k97355l05443j57242
$$ plain form
2757.2 567725525 567343941 567055244 566719933 566528244 566360474 565625153 565147285 564691010 564476852 564178810
2766.8 564178810 563836708 564001694 563601189 563002815 562738686 562819901 562719917 561980438 561154709 560629730
2776.4 560629730 560204773 559640999 559523659 559456520 559266739 558994217 558149986 557246933 556506348 556079292
2786.1 556079292 556018867 555853806 555204391 554288902 553569527 553230133 552871170 552471581 552217064 551172066
2795.7 551172066 550100136 549514160 548944969 548535500 547745171 547028313 546444931 545748749 545051651
2804.4 545051651 544406166 543631668 542563438 541880112 541020889 540227127 539762459 538957214 537787132
2813.1 537787132 536397820 535463638 534326477 533153610 532339249 531046791 529668808 528466034 527571449
2821.8 527571449 526915207 525850487 524102974 522379341 521203651 519846764 517714081 515671272
$$ packed form
2757.2E67725525l81584k88697l35311j91689j67770p35321m77868m56275k14158k98042
2766.8E64178810l42102J64986m00505n98374k64129Q1215r9984p39479q25729n24979
2776.4E60629730m24957n63774j17340o7139j89781k72522q44231r03053p40585m27056
2786.1E56079292o0425j65061o49415r15489p19375l39394l58963l99589k54517j044998
2795.7E51172066j071930n85976n69191m09469p90329p16858n83382o96182o97098
2804.4E45051651o45485p74498j068230o83326q59223p93762m64668q05245j170082
2813.1E37787132j389312r34182j137161j172867q14361j292458j377983j202774q94585
2821.8E27571449o56242j064720j747513j723633j175690j356887k132683k042809
$$ plain form
2829.5 515671272 514118958 512089424 510309639 508728447 506706009 504695168 502197952 499247208
2837.2 499247208 495890045 492528687 489061966 485133705 480655479 474936790 468879204 462308578
2844.9 462308578 454689140 446563759 438262825 430174141 421709023 413621902 406778374 401079674
2852.6 401079674 397097168 395176125 395311356 396574478 398937225 402660866 407091599 411456528
2860.3 411456528 415477638 419602394 423561172 426792526 428999825 430183830 430589333 430858727 430548325
2869 430548325 429470329 428555183 427750778 427318802 427050056 426853065 426826706 427038193 427488213 427178192
2878.7 427178192 426550293 425466690 424146996 423365173 422339745 421027870 419290466 417724075 416622200
2887.3 416622200 415093651 413347740 411748695 410167198 408346748 406299667 404190674 402117310
$$ packed form
2829.5E15671272j552314k029534j779785j581192k022438k010841k497216k950744
2837.2D99247208l357163l361358l466721l928261m478226n718689o057586o570626
2844.9D62308578p619438q125381q300934q088684q465118q087121o843528n698700
2852.6D01079674l982506j921043J35231J263122K362747L723641M430733M364929
2860.3D11456528M021110M124756L958778L231354K207299J184005M05503K69394l10402
2869D30548325j077996r15146q04405m31976k68746j96991k6359K11487M50020l10021
2878.7D27178192o27899j083603j319694p81823j025428j311875j737404j566391j101875
2887.3D16622200j528549j745911j599045j581497j820450k047081k108993k073364
$$ plain form
2895.1 402117310 399838104 397610359 395604286 393393250 391318817 389392586 387230682 384530602
2902.8 384530602 381584015 378724899 375914688 373161736 369909286 366116676 362020073 358064423
2910.5 358064423 353750610 348583603 343043327 336765976 330357399 323992958 317753506 311685848
2918.2 311685848 305320683 299857655 295387096 291658344 288259926 284973202 282621365 281941605
2925.9 281941605 282595634 283295555 284767075 286780891 289501400 293281670 297162342 301692333 306708755
2934.6 306708755 312077770 317550621 322955933 328466682 333924675 339324608 344550858 349664345
2942.3 349664345 354377975 358751869 362964897 366920280 370186920 372724915 374697304 376252975
2950 376252975 377784843 378648911 379179802 379899940 380841026 382037964 383213196 384969749 387438660
$$ packed form
2895.1D02117310k279206k227745k006073k211036k074433j926231k161904k700080
2902.8C84530602k946587k859116k810211k752952l252450l792610m096603l955650
2910.5C58064423m313813n167007n540276o277351o408577o364441o239452o067658
2918.2C11685848o365165n463028m470559l728752l398418l286724k351837o79760
2925.9B81941605O54029O99921J471520K013816K720509L780270L880672M529991N016422
2934.6C06708755N369015N472851N405312N510749N457993N399933N226250N113487
2942.3C49664345M713630M373894M213028L955383L266640K537995J972389J555671
2950C76252975J531868Q64068N30891P20138R41086J196938J175232J756553K468911
$$ plain form
2958.7 387438660 390298042 392970238 395682182 398880005 402541275 406802597 410916710 414711418
2966.4 414711418 418711891 423365555 427640495 431334114 435315514 439076157 442743034 446175499
2974.1 446175499 449446220 452484283 455168724 457850952 460475311 463080177 465187225 467454414
2981.8 467454414 469651527 471125526 472801056 474665947 476459999 478045158 479516373 480832825
2989.6 480832825 482055244 483132172 483612137 483929062 484238968 484625320 484852486 484407387 483798981
2998.2 483798981 483485069 482909431 481464043 479768181 478271942 476893272 475719223 474652367 473933411
3006.9 473933411 473312454 472685852 472601280 472701416 473194809 474348831 475497017 476716576 477753143
3015.6 477753143 478714104 479911842 481169281 482614746 483371391 483837471 484550934 484800301 484932060
$$ packed form
2958.7C87438660K859382K672196K711944L197823L661270M261322M114113L794708
2966.4D14711418M000473M653664M274940L693619L981400L760643L666877L432465
2974.1D46175499L270721L038063K684441K682228K624359K604866K107048K267189
2981.8D67454414K197113J473999J675530J864891J794052J585159J471215J316452
2989.6D80832825J222419J076928M79965L16925L09906L86352K27166m45099o08406
2998.2D83798981l13912n75638j445388j695862j496239j378670j174049j066856p18956
3006.9D73933411o20957o26602q4572J00136M93393J154022J148186J219559J036567
3015.6D77753143R60961J197738J257439J445465P56645M66080P13463K49367J31759
$$ plain form
3024.3 484932060 485132599 485267906 485052986 484606552 484264374 483968658 483673897 483242912 483049850 482858086
3033.9 482858086 481926079 480942726 480438881 479761391 478827858 477780342 477301254 477256851 476564941 475805435
3043.6 475805435 474972343 474063759 473045120 472039261 471687317 471007538 470133705 469376945 468774643
3052.2 468774643 467964401 466708565 465752487 464643936 463865891 463028908 462014427 461317749 460375748
3060.9 460375748 459523163 458454666 457515640 456582413 455839348 455386810 454316254 453578911 452958527
3069.6 452958527 452122803 450981026 450001869 449622345 448854828 448398628 447926865 446781540 445941010
3078.3 445941010 445532570 444508324 443136139 442630272 442196121 441191254 440007973 439096489 438092461
3087 438092461 437026253 436490631 435671272 434533119 433430939 432648582 432227745 431381874 430055199
$$ packed form
3024.3D84932060K00539J35307k14920m46434l42178k95716k94761m30985j93062j91764
3033.9D82858086r32007r83353n03845o77490r33533j047516m79088m4403o91910p59506
3043.6D75805435q33092r08584j018639j005859l51944o79779q73833p56760o02302
3052.2D68774643q10242j255836r56078j108551p78045q36983j014481o96678r42001
3060.9D60375748q52585j068497r39026r33227p43065m52538j070556p37343o20384
3069.6D52958527q35724j141777r79157l79524p67517m56200m71763j145325q40530
3078.3D45941010m08440j024246j372185n05867m34151j004867j183281r11484j004028
3087D38092461j066208n35622q19359j138153j102180p82357m20837q45871j326675
$$ plain form
3095.6 430055199 429110146 428716125 428099251 427551765 426860275 425457268 423991814 423296623 423080444
3104.3 423080444 422301750 421407051 420607872 419641724 418245316 416624908 415925980 415592613 414745750
3113 414745750 413880959 413251266 412161217 411134605 410671043 410080910 409275551 408097153 406947784
3121.7 406947784 405683327 404187241 403109093 402275162 401480675 400690155 400018883 399238358 398310776
3130.4 398310776 397169151 396151543 395395050 394400520 393115768 391524086 390927734 390600166 389468422
3139 389468422 388404198 387510033 386790619 385593452 384664116 383754692 382661133 382309189 381215591
3147.7 381215591 379539833 378075943 377174263 376564255 375540924 374717598 374250832 373541069 372221069
3156.4 372221069 371121902 370020065 369061546 368371086 367317123 366400719 365373230 364644928 363494263
$$ packed form
3095.6D30055199r45053l94021o16874n47486o91490j403007j465454o95191k16179
3104.3D23080444p78694q94699p99179r66148j396408j620408o98928l33367q46863
3113D14745750q64791o29693j090049j026612m63562n90133q05359j178398j149369
3121.7D06947784j264457j496086j078148q33931p94487p90520o71272p80525r27582
3130.4C98310776j141625j017608p56493r94530j284752j591682n96352l27568j131744
3139C89468422j064224q94165p19414j197167r29336r09424j093559l51944j093598
3147.7C81215591j675758j463890r01680o10008j023331q23326m66766p09763j320000
3156.4C72221069j099167j101837r58519o90460j053963r16404j027489p28302j150665
$$ plain form
3165.1 363494263 361969376 361403198 360869675 359628639 357955894 357478333 357651062 356854172 355593910
3173.8 355593910 354420509 353519745 352768784 352096291 350937996 349759102 348989754 348318367 347443161
3182.4 347443161 346248283 345237961 344123459 343447609 342601547 341485596 340997124 340064316 339015236
3191.1 339015236 338251991 337526970 336547470 335573921 334829636 333998833 333199577 332029877 331145248
3199.8 331145248 330499382 329762192 328885384 328147087 327894096 326987381 326062927 325485458 325000877 324205208
3209.4 324205208 322994194 322278938 321437302 320806580 320258827 319399586 318680172 317963085 317169628
3218.1 317169628 316313515 315649281 314827290 314179592 313497620 312683620 312115555 311344109 310843487 310563774
3227.8 310563774 310304451 309685917 308750801 307974529 307330189 306693401 305525208 304555225 303995476
$$ packed form
3165.1C63494263j524887n66178n33523j241036j672745m77561J72729p96890j260262
3173.8C55593910j173401r00764p50961o72493j158295j178894p69348o71387q75206
3182.4C47443161j194878j010322j114502o75850q46062j115951m88472r32808j049080
3191.1C39015236p63245p25021r79500r73549p44285q30803p99256j169700q84629
3199.8C31145248o45866p37190q76808p38297k52991r06715r24454n77469m84581p95669
3209.4C24205208j211014p15256q41636o30722n47753q59241p19414p17087p93457
3218.1C17169628q56113o64234q21991o47698o81972q14000n68065p71446n00622k79713
3227.8C10563774k59323o18534r35116p76272o44340o36788j168193r69983n59749
$$ plain form
3236.4 303995476 303533287 302995834 302388039 301870823 301001606 300115547 299441586 299294281 298895168 297960854
3246.1 297960854 297190170 296475124 296122208 295369129 294655819 294360065 293935852 293383732 292656593 291940842
3255.7 291940842 290784473 289891510 289200382 288609180 288407021 287881260 287281208 286560421 286057053
3264.4 286057053 285627823 285146217 284477139 283787842 283791771 283302441 282383919 281756401 281409302 280729656
3274 280729656 280139236 280055313 279067917 278533497 278521481 277563419 276557655 276098976 275762501 275468731
3283.7 275468731 275295124 274647465 274183273 273818512 273161526 272876911 272500019 272026806 271701794 271463928
3293.3 271463928 271110325 270747795 270393200 269912949 269288979 268698921 268784008 268613014 268122616 267745361
3303 267745361 267179317 266994915 266767426 266288929 266116352 265988922 265152588 264322968 264091187 263831348
$$ packed form
3236.4C03995476m62189n37453o07795n17216q69217q86059o73961j47305l99113r34314
3246.1B97960854p70684p15046l52916p53079p13310k95754m24213n52120p27139p15751
3255.7B91940842j156369q92963o91128n91202k02159n25761o00052p20787n03368
3264.4B86057053m29230m81606o69078o89297L929m89330r18522o27518l47099o79646
3274B80729656n90420q3923r87396n34420j2016r58062j005764m58679l36475k93770
3283.7B75468731j73607o47659m64192l64761o56986k84615l76892m73213l25012k37866
3293.3B71463928l53603l62530l54595m80251o23970n90058Q5087j70994m90398l77255
3303B67745361n66044j84402k27489m78497j72577j27430q36334q29620k31781k59839
$$ plain form
3312.6 263831348 263600903 263100300 262592583 262496777 262052193 261356487 261179924 261105137 260831680 260203648
3322.3 260203648 259362278 259254761 258880482 258252239 257742290 257121525 257044964 256618156 256214504 255857048
3331.9 255857048 255301399 255027580 254681377 254438610 253856182 253590698 253580933 253108845 252460937 251649818
3341.6 251649818 251191921 251082649 250968456 250248985 249758034 249825344 249461727 249169540 248617516 247687492
3351.2 247687492 247241573 247204304 246767883 246307831 245958099 245193863 244761715 244566307 244118843 243641376
3360.8 243641376 243846588 243639355 242779846 242346954 241417389 241097679 241457653 241384544 240777473 240170536
3370.5 240170536 240151424 239239655 238482418 238610210 238398056 237503414 236633301 236713753 236508064 236191044
3380.1 236191044 236252308 236112194 235485783 235012264 235154781 234759331 234271736 233728409 233479042 233798065
$$ packed form
3312.6B63831348k30445n00603n07717r5806m44584o95706j76563p4787k73457o28032
3322.3B60203648q41370j07517l74279o28243n09949o20765p6561m26808m03652l57456
3331.9B55857048n55649k73819l46203k42767n82428k65484r765m72088o47908q11119
3341.6B51649818m57897j09272j14193p19471m90951O7310l63617k92187n52024r30024
3351.2B47687492m45919l7269m36421m60052l49732p64236m32148j95408m47464m77467
3360.8B43641376K05212k07233q59509m32892r29565l19710L59974p3109o07071o06937
3370.5B40170536j9112r11769p57237J27792k12154q94642q70113Q0452k05689l17020
3380.1B36191044O1264j40114o26411m73519J42517l95450m87595n43327k49367L19023
$$ plain form
3389.8 233798065 233927708 234101620 233611298 233023758 232860317 232523022 232452011 232630749 232732391 232782478
3399.4 232782478 232520409 231830597 231478634 231405563 231419621 231430702 231091385 230889511 230939751 230835190
3409.1 230835190 230648708 230744629 230759888 230768204 230597553 230362854 230777035 230949135 230950546 230936050 230908337
3419.7 230908337 230799885 230370293 230318470 230070877 230154896 230775127 231220913 231619568 231286793 230763111
3429.3 230763111 231350899 232167282 231700802 231193237 231877918 232537231 232395420 232069740 231971493 232324944
3439 232324944 233092365 233506165 233771744 233948288 234100380 234328423 234932384 236111317 236083603 235918827
3448.6 235918827 236430187 237045746 237362957 237033520 237675571 238441315 238578300 238579121 238837910 239327717
3458.2 239327717 239772034 240937920 241216393 240992985 241440792 242123432 243001442 243440609 243815498
$$ packed form
3389.8B33798065J29643J73912m90322n87540j63441l37295p1011J78738J01642N0087
3399.4B32782478k62069o89812l51963p3071J4058J1081l39317k01874N0240j04561
3409.1B30835190j86482R5921J5259Q316j70651k34699M14181J72100J411j4496k7713
3419.7B30908337j08452m29592n1823k47593Q4019O20231M45786L98655l32775n23682
3429.3B30763111N87788Q16383m66480n07565O84681O59313j41811l25680r8247L53451
3439B32324944P67421M13800K65579J76544J52092K28043O03961J178933k7714j64776
3448.6B35918827N11360O15559L17211l29437O42051P65744J36985Q21K58789M89807
3458.2B39327717M44317J165886K78473k23408M47807O82640Q78010M39167L74889
$$ plain form
3466.9 243815498 244199677 245014114 245398254 245354729 246211205 247177277 247914333 247931023 248067493 248761444
3476.6 248761444 249377575 250067272 250937004 251881561 252290649 252570171 252627945 253599167 254927349 255109749
3486.2 255109749 255834675 256529884 257007942 257929115 258367157 258689785 259340343 260078602 261321507
3494.9 261321507 262406120 262695580 263456860 264109764 265108032 266138477 266075001 266534710 266778812
3503.6 266778812 266778164 267934628 269610996 270603237 271399364 272238445 272627697 273643990 274190006 275065269
3513.2 275065269 276439304 276963711 277644119 278589611 279632378 280401573 281694927 283139992 284356937
3521.9 284356937 285527592 285244045 285347424 286824398 288218365 288320065 288949795 290267525 291395397
3530.6 291395397 292653522 293182659 294259911 295014553 295815468 297104607 298008175 299585114 300591793
$$ packed form
3466.9B43815498L84179Q14437L84140m3525Q56476R66072P37056J6690J36470O93951
3476.6B48761444O16131O89697Q69732R44557M09088K79522N7774R71222J328182J82400
3486.2B55109749P24926O95209M78058R21173M38042L22628O50558P38259J242905
3494.9B61321507J084613K89460P61280O52904R98268J030445o3476M59709K44102
3503.6B66778812o48J156464J676368R92241P96127Q39081L89252J016293N46016Q75263
3513.2B75065269J374035N24407O80408R45492J042767P69195J293354J445065J216945
3521.9B84356937J170655k83547J03379J476974J393967J01700O29730J317730J127872
3530.6B91395397J258125N29137J077252P54642Q00915J289139R03568J576939J006679
$$ plain form
3539.2 300591793 301790428 302951431 303966885 305360088 306673527 307552509 307998848 309760094 310354004
3547.9 310354004 311645908 313093567 314109192 315897560 315276966 316560898 318109913 319470177
3555.6 319470177 321464615 322025871 324149971 325656967 326547852 327457962 329048500 330942192 331612740
3564.3 331612740 334376793 334825706 335039635 336450806 337070961 340181313 341832466 343281174 345027466
3573 345027466 346443825 347552032 349030647 351582413 353169632 355313187 356713753 358032303 360808487
3581.7 360808487 363145256 363975639 364634323 369075890 371713486 371050606 372991600 373163605 375786858
3590.4 375786858 378544197 381418915 383250542 383847580 386756058 386163254 388361244 392536392 393900299
3599 393900299 396706543 398246384 399258614 400952225 402874107 405401421 407864189 409838753 409919624
$$ packed form
3539.2C00591793J198635J161003J015454J393203J313439Q78982M46339J761246N93910
3547.9C10354004J291904J447659J015625J788368o20594J283932J549015J360264
3555.6C19470177J994438N61256K124100J506996Q90885R10110J590538J893692O70548
3564.3C31612740K764053M48913K13929J411171O20155L110352J651153J448708J746292
3573C45027466J416359J108207J478615K551766J587219K143555J400566J318550K776184
3581.7C60808487K336769Q30383O58684M441567K637596o62880J940994J72005K623253
3590.4C75786858K757339K874718J831627N97038K908478n92804K197990M175148J363907
3599C93900299K806244J539841J012230J693611J921882K527314K462768J974564Q0871
$$ plain form
3607.7 409919624 414266319 415361824 414303894 420016479 421047897 420166969 424034996 424157639 428198509
3616.4 428198509 432805176 433231163 434914436 434973755 436697540 440052376 442025414 444630699 448246803
3625.1 448246803 450548592 452166634 457455406 458787193 450408287 453545074 458015556 462822189
3632.8 462822189 464356117 463236580 465895271 469150543 471513901 472344360 473455200 475548630
3640.5 475548630 478378220 479815826 479936981 482118950 485587082 491368332 491374435 487879333 492432404
3649.2 492432404 492591515 491886635 491669083 496161766 500598412 504572334 509718132 502829552 503464775
3657.9 503464775 508547783 510494003 512390823 512874489 514682350 515957146 517034683 518579597
3665.6 518579597 520080833 524662323 527114639 526939087 527099648 521493263 523862762 531192513 538489075
$$ packed form
3607.7D09919624M346695J095505j057930N712585J031418q80928L868027J22643M040870
3616.4D28198509M606667M25987J683273N9319J723785L354836J973038K605285L616104
3625.1D48246803K301789J618042N288772J331787q378906L136787M470482M806633
3632.8D62822189J533928j119537K658691L255272K363358Q30459J110840K093430
3640.5D75548630K829590J437606J21155K181969L468132N781250O103l495102M553071
3649.2D92432404J59111p04880k17552M492683M436646L973922N145798o888580O35223
3657.9E03464775N083008J946220J896820M83666J807861J274796J077537J544914
3665.6E18579597J501236M581490K452316j75552J60561n606385K369499P329751P296562
$$ plain form
3674.3 538489075 536327324 521609154 525355873 532430115 536465187 535540276 536604843 539482002
3682 539482002 541256752 542355461 542704811 543467598 547577591 553858109 545939598 542808647 551479263
3690.6 551479263 546332855 545587044 551219254 552673454 554700470 554846802 554329033 555227318 555432549
3699.3 555432549 557911491 560601883 556201134 553496094 557941017 560346146 560706253 561097412 563359032
3708 563359032 567282639 560653114 563732147 568254967 555328217 558652916 563177032 563721924 563914490
3716.7 563914490 566025658 567897148 565267525 566383057 571602058 569316254 565559883 569772301
3724.4 569772301 570692101 569862328 567158813 567454529 570906639 571185150 576149788 573690071 567076759
3733.1 567076759 575408745 576417885 569459305 569227333 571305962 571392250 572826996 575557556 571899948
$$ packed form
3674.3E38489075k161751j4718170L746719P074242M035072r24911J064567K877159
3682E39482002J774750J098709L49350P62787M109993O280518p918511l130951Q670616
3690.6E51479263n146408p45811N632210J454200K027016J46332n17769Q98285K05231
3699.3E55432549K478942K690392m400749k705040M444923K405129L60107L91159K261620
3708E63359032L923607o629525L079033M522820j2926750L324699M524116N44892J92566
3716.7E63914490K111168J871490k629623J115532N219001k285804l756371M212418
3724.4E69772301R19800q29773k703515K95716L452110K78511M964638k459717o613312
3733.1E67076759Q331986J009140o958580k31972K078629Q6288J434746K730560l657608
$$ plain form
3741.8 571899948 574866676 586462364 576275482 560259056 569985809 575673409 582599792 580107765
3749.5 580107765 568228035 579220238 574756126 567397766 573184090 577251930 580212440 575324745
3757.2 575324745 577179794 581855125 574703293 573634682 577725220 579076576 579076347 582312355 580507088
3765.9 580507088 576082687 579071274 584156837 584911308 576598091 577903290 580817871 580900803 581320953
3774.5 581320953 581415825 583209114 583477478 585403290 585265656 578318672 580445633 582130852 582971611
3783.2 582971611 585337181 583036957 582046623 582837830 583357697 583937836 583874550 584437065 584504623 584464912
3792.9 584464912 584078636 585348854 588086662 584099579 580753136 582989655 586793251 592311668
3800.6 592311668 586978226 577774467 581227417 583890076 588158607 593804169 585430794 580895615
$$ packed form
3741.8E71899948K966728J1595688j0186882j6016426R726753N687600O926383k492027
3749.5E80107765j1879730J0992203m464112p358360N786324M067840K960510m887695
3757.2E75324745J855049M675331p151832j068611M090538J351356k29L236008j805267
3765.9E80507088m424401K988587N085563P54471q313217J305199K914581Q2932M20150
3774.5E81320953R4872J793289K68364J925812j37634o946984K126961J685219Q40759
3783.2E82971611K365570k300224r90334P91207N19867N80139o3286N62515O7558l9711
3792.9E84464912l86276J270218K737808l987083l346443K236519L803596N518417
3800.6E92311668n333442r203759L452950K662659M268531N645562q373375m535179
$$ plain form
3808.3 580895615 584983635 586430244 586718636 587125053 587201691 588243752 593167610 592136269 579057236
3817 579057236 583348618 588745308 592809029 594766121 579429016 580200005 585810852 588066597 589650879
3825.7 589650879 589346123 585897331 586579857 588593102 591111259 592480278 585130234 587550964 593702812
3834.3 593702812 587570114 587046051 595163994 588377914 583357506 591305656 587075005 586075020 592652206
3843 592652206 590132103 586258278 588328056 588861084 588504791 590358276 589567413 591170120 596662865
3851.7 596662865 591385994 593184509 580639687 580359306 590205307 589576797 587551384 589440842
3859.4 589440842 591481514 593470955 588557816 588888893 595562859 590643959 584820747 587907753
3867.1 587907753 592416458 599077721 593376007 583530159 586079254 591626091 595864029 586295776
$$ packed form
3808.3E80895615M088020J446609K88392M06417P6638J042061M923858j031341j3079033
3817E79057236M291382N396690M063721J957092j5337105P70989N610847K255745J584282
3825.7E89650879l04756l448792O82526K013245K518157J369019p350044K420730O151848
3834.3E93702812o132698n24063Q117943o786080n020408P948150m230651r99985O577186
3843E92652206k520103l873825K069778N33028l56293J853485p90863J602707N492745
3851.7E96662865n276871J798515j2544822k80381R846001o28510k025413J889458
3859.4E89440842K040672J989441m913139L31077O673966m918900n823212L087006
3867.1E87907753M508705O661263n701714r845848K549095N546837M237938r568253
$$ plain form
3874.8 586295776 586112976 590474854 590330658 592060242 596202812 591062775 583649254 589548950 591862030
3883.5 591862030 593510666 598303642 586395187 586237106 589282227 589552841 593748093 594293365 587538643
3892.2 587538643 588291740 591023750 589370880 590256958 590931816 593257828 595703926 585827065 589734802
3900.9 589734802 592023849 587809486 592961578 590197334 588709450 589405441 589716187 591484833 591141281
3909.6 591141281 590744820 589807358 590122032 590769196 590314178 591860313 594109726 590774460 587118225
3918.2 587118225 591184387 592507515 589493675 590428085 591086426 592000694 590852776 588015060 588883476
3926.9 588883476 590509796 590992889 589434738 589951248 591976051 589344864 587723656 588770599 589052696
3935.6 589052696 589890900 590467567 589740410 589597168 589551849 591058655 592412643 587849197 586999474
$$ packed form
3874.8E86295776j82800M361878j44196J729584M142570n140037p413521N899696K313080
3883.5E91862030J648636M792976j1908455j58081L045121K70614M195252N45272o754722
3892.2E87538643P53097K732010j652870Q86078O74858K326012K446098r876861L907737
3900.9E89734802K289047m214363N152092k764244j487884O95991L10746J768646l43552
3909.6E91141281l96461r37462L14674O47164m55018J546135K249413l335266l656235
3918.2E87118225M066162J323128l013840R34410O58341R14268j147918k837716Q68416
3926.9E88883476J626320M83093j558151N16510K024803k631187j621208J046943K82097
3935.6E89052696Q38204N76667p27157j43242m5319J506806J353988m563446q49723
$$ plain form
3944.3 586999474 589486923 590897102 591770782 589662323 590301208 590308571 588192749 589971962 589876709
3953 589876709 588991165 589577293 589897842 589584923 588667831 588704910 588381615 589231720 590002213 588987198
3962.6 588987198 589452057 590026207 589888649 589689293 589691620 590020409 589253387 588684807 589938889 590219955
3972.2 590219955 588689499 588058548 588846169 589196587 588342476 588097267 588219070 588802109 589497147
3980.9 589497147 589022064 588478203 588263397 589127350 589229698 588660698 589022598 588504639 588512726 588900871
3990.6 588900871 588921165 588884087 588520966 588938637 589316902 589030533 588914452 589089737 588749237 588178635
4000.2 588178635
$$ packed form
3944.3E86999474K487449J410179Q73680k108459O38885P363k115822J779213r5253
3953E89876709q85544N86128L20549l12919r17092L7079l23295Q50105P70493j015015
3962.6E88987198M64859N74150j37558j99356K327L28789p67022n68580J254082K81066
3972.2E90219955j530456o30951P87621L50418q54111k45209J21803N83039O95038
3980.9E89497147m75083n43861k14806Q63953J02348n69000L61900n17959Q087L88145
3990.6E88900871K0294l7078l63121M17671L78265k86369j16081J75285l40500n70602
4000.2E88178635
##END=$$ End of the data block
