##TITLE=$$ Begin of the data block
##JCAMP-DX=5.00 $$ ACD/SpecManager v 10.08
##SPECTROMETER/DATA SYSTEM=Varian
##DATE=04 Dec 2012 14:11:24
##DATA TYPE=INFRARED SPECTRUM
##DATA CLASS=XYDATA
##ORIGIN=
##OWNER=
##NPOINTS=3735
##FIRSTX=399.26403809
##LASTX=4000.35498047
##MAXX=4000.35498047
##MINX=399.26403809
##MAXY=70.90354156
##MINY=22.94532013
##XFACTOR=1.0000000000
##YFACTOR=0.000000100000000
##FIRSTY=48.37865067
##DELTAX=0.96440572
##XUNITS=1/CM
##YUNITS=TRANSMITTANCE
##XYDATA=(X++(Y..Y))
$$ plain form
399.3 483786507 503309135 490244598 479793549 476365814 476721725 473816223 472743530 473910370
407 473910370 476456184 467938881 464581108 474617462 477948494 481302872 476552887 470474167 472666206
415.7 472666206 471221771 466041641 462051086 475648117 479209709 480469208 481600380 478252869
423.4 478252869 478837814 481084976 480012474 473722305 468783150 464711342 463484383 469599113 472596855
432.1 472596855 472375946 472640152 470866623 466793327 463098717 466161804 469702873 466320343 462747192
440.7 462747192 463165283 467062263 471253510 471155548 468880234 467716675 468009453 467217827 468918953
449.4 468918953 472182045 470941048 467448769 469961472 476253090 476821594 480297241 483505859 471366692
458.1 471366692 465370712 467307892 473389702 471499710 469438591 473857079 476410637 477506142
$$ packed form
399.3D83786507J9522628j3064537j0451049l427735L55911k905502j072693J166840
407D73910370K545814q517303l357773J0036354L331032L354378m749985o078720K192039
415.7D72666206j444435n180130l990555J3597031L561592J259499J131172l347511
423.4D78252869N84945K247162j072502o290169m939155m071808j226959O114730K997742
432.1D72596855k20909K64206j773529m073296l694610L063087L541069l382530l573151
440.7D62747192M18091L896980M191247r7962k275314j163559K92778p91626J701126
449.4D68918953L263092j240997l492279K512703O291618N68504L475647L208618j2139167
458.1D71366692n995980J937180O081810j889992k061119M418488K553558J095505
$$ plain form
465.8 477506142 470512161 464372063 461433029 461879234 466745033 464060707 461440086 465139503 469996872
474.5 469996872 469139824 464250412 460892334 454906921 453773766 452504616 451004601 453192253 454616280
483.2 454616280 456580925 458972321 457584877 454915504 455332756 453493233 452394409 451649094 449384499
491.8 449384499 447004814 444373779 448180313 451162834 449580956 447912865 447643356 446794891 443419533
500.5 443419533 441759377 440945015 439043465 435955582 438637085 443461914 442332268 440017281 437178612
509.2 437178612 436650352 436637154 433876266 430247688 427889633 428365593 430466919 430889511 427535629
517.9 427535629 428433228 426632195 421038475 418301735 415499229 414540329 413888550 414204788 414112701
526.6 414112701 414841385 417610397 419554672 418767357 414870949 413788300 414635315 416678200 419189606
$$ packed form
465.8D77506142o993981o140098k939034M46205M865799k684326k620621L699417M857369
474.5D69996872q57048m889412l358078n985413j133155j269150j500015K187652J424027
483.2D54616280J964645K391396j387444k669373M17252j839523j098824p45315k264595
491.8D49384499k379685k631035L806534K982521j581878j668091k69509q48465l375358
500.5D43419533j660156q14362j901550l087883K681503M824829j129646k314987k838669
509.2D37178612n28260j3198k760888l628578k358055M75960K101326M22592l353882
517.9D27535629Q97599j801033n593720k736740k802506r58900o51779L16238r2087
526.6D14112701P28684K769012J944275p87315l896408j082649Q47015K042885K511406
$$ plain form
535.2 419189606 419481659 421106873 425000877 428709679 429364090 428390770 428592224 429885178 429318657
543.9 429318657 427154541 427248154 427398911 428630829 432292709 435413475 435756607 434245949 431764793
552.6 431764793 428395996 426866875 426274757 426040764 425907097 426638412 427210655 426006851 424971390
561.3 424971390 421133156 418153419 416840363 414417000 414043503 413791008 413054161 410752754 408016548
570 408016548 406868019 406321754 404663658 402289085 400893402 398254585 397634964 400127945 403158455
578.6 403158455 405025635 406665535 407795029 408041687 409823074 411140099 412069664 412483521 414091072
587.3 414091072 416684189 419301071 422128677 422897720 424910583 425826263 425090103 423463097 421193123
596 421193123 423054123 425670547 425835800 425109291 425187492 425209618 426394920 428041229 426260223 424401245
$$ packed form
535.2D19189606K92053J625214L894004L708802O54411r73320K01454J292954n66521
543.9D29318657k164116R3613J50757J231918L661880L120766L43132j510658k481156
552.6D31764793l368797j529121n92118k33993j33667P31315N72243j203804j035461
561.3D24971390l838234k979737j313056k423363l73497k52495p36847k301407k736206
570D08016548j148529n46265j658096k374573j395683k638817o19621K492981L030510
578.6D03158455J867180J639900J129494K46658J781387J317025R29565M13857J607551
587.3D14091072K593117K616882K827606P69043K012863R15680p36160j627006k269974
596D21193123J861000K616424J65253p26509P8201K2126J185302J646309j781006j858978
$$ plain form
605.6 424401245 423470726 423436470 423288879 422991180 424094200 425186424 426842728 428804398 431216316
614.3 431216316 431844139 433269043 435335503 433140526 431872482 432915878 435964699 439894524 443171463
623 443171463 446160164 448280869 449377251 449786530 450800591 450043564 449770012 452790260 454415588
631.7 454415588 454546661 456646576 460232544 462419128 463607788 463483963 462677917 463636017 463757439
640.4 463757439 462784576 462914238 465012741 467339020 467766304 467692909 469055748 471116104 470102043
649 470102043 467915649 468159447 468967247 469273605 469463425 470593071 472565613 474106750 474055214 472264709
658.7 472264709 470329704 470057907 470508575 469964600 470578918 471755867 472753601 475564003 479897194
667.4 479897194 481946030 477719421 474838943 473154297 473180542 474365349 476427345 477934189 478746529
$$ packed form
605.6D24401245r30519l4256j47591k97699J103020J092224J656304J961670K411918
614.3D31216316O27823J424904K066460k194977j268044J043396L048821L929825L276939
623D43171463K988701K120705J096382M09279J014061p57027k73552L020248J625328
631.7D54415588J31073K099915L585968K186584J188660j23825q06046R58100J21422
640.4D63757439r72863J29662K098503K326279M27284p3395J362839K060356j014061
649D70102043k186394K43798Q07800L06358J89820J129646J972542J541137n1536j790505
658.7D72264709j935005k71797M50668n43975O14318J176949R97734K810402M333191
667.4D79897194K048836m226609k880478j684646K6245J184807K061996J506844Q12340
$$ plain form
676.1 478746529 479273987 479847870 481193123 481551437 480185242 479329185 479618721 479846916 480266800
684.7 480266800 481120186 482236366 484339523 485852966 485104523 483813782 483284798 482229729 480768051
693.4 480768051 479816017 479292374 479971733 480095024 479018936 478728905 478909721 478673935 477018242
702.1 477018242 474619637 471876030 469226913 468740234 469455566 470392761 471815186 472742310 472844315
710.8 472844315 473785515 474542961 474279137 474712448 475185280 475639725 476579399 478525047 481504021
719.5 481504021 484649010 486986084 488613510 490386353 491027641 491014099 491052818 492066650 495354004
728.1 495354004 498897743 502593422 506483650 509391823 511150208 511948433 512453194 512647667 512577209
736.8 512577209 512767334 513921051 516245270 518159103 519127274 520597534 521854515 520799141 519594154
$$ packed form
676.1D78746529N27458N73883J345253L58314j366195q56057K89536K28195M19884
684.7D80266800Q53386J116180K103157J513443p48443j290741n28984j055069j461678
693.4D80768051r52034n23643O79359J23291j076088k90031J80816k35786j655693
702.1D77018242k398605k743607k649117m86679P15332R37195J422425R27124J02005
710.8D72844315R41200P57446k63824M33311M72832M54445R39674J945648K978974
719.5D81504021L144989K337074J627426J772843O41288j3542L8719J013832L287354
728.1D95354004L543739L695679L890228K908173J758385P98225N04761J94473p0458
736.8E12577209J90125J153717K324219J913833R68171J470260J256981j055374j204987
$$ plain form
745.5 519594154 519026260 516045723 513486824 513216286 512959442 512907219 513122177 513511696 512917137 510389900
755.1 510389900 507650871 505057869 502360497 500492210 499431458 498761139 498928757 500491142 502784348
763.8 502784348 504781494 505125847 503845062 504331703 505945625 506813393 508676567 511039276 513795891
772.5 513795891 517615471 521426086 524534073 527133026 529741745 531542091 532596588 533798294
780.2 533798294 535114479 537537460 540294456 542614975 544119987 545601578 547781296 548493309 548591919
788.9 548591919 548106194 547785645 548488808 549368935 551741791 554571800 557517166 559846573 561334457
797.6 561334457 562741394 562642479 562639046 563732986 564359970 564625282 567220268 570930214 573061028
806.2 573061028 573926735 574242859 576046257 577564278 577490730 577069473 576218910 575927544 576739235 578190727
$$ packed form
745.5E19594154n67894k980537k558899k70538k56844n2223K14958L89519n94559k527237
755.1E10389900k739029k593002k697372j868287j060752o70319J67618J562385K293206
763.8E02784348J997146L44353j280785M86641J613922Q67768J863174K362709K756615
772.5E13795891L819580L810615L107987K598953K608719J800346J054497J201706
780.2E33798294J316185K422981K756996K320519J505012J481591K179718P12013R8610
788.9E48591919m85725l20549P03163Q80127K372856K830009K945366K329407J487884
797.6E61334457J406937r8915l433J093940O26984K65312K594986L709946K130814
806.2E73061028Q65707L16124J803398J518021p3548m21257q50563k91366Q11691J451492
$$ plain form
815.9 578190727 580368500 582617645 583553009 582884102 580132942 578050919 577186852 575790367 575309258
824.6 575309258 574542923 574224358 574420280 574281769 573871078 571827431 568763161 565070305 561791420
833.3 561791420 558826256 556799316 555628090 554398193 554339027 554051933 552896576 551362648 549043198
841.9 549043198 546208458 543545265 541449661 539983292 538732872 538142548 538823738 539172935 538904877
850.6 538904877 538165359 537976074 538424683 537653694 536174126 534413261 533839989 534430161 536089973
859.3 536089973 538134270 538853683 540234032 541740761 543013191 543853989 544881401 547142448 549199753
868 549199753 553305588 557781219 561359978 565822983 569493675 571661873 573105125 574929390 575865326
876.7 575865326 576671486 577058525 577424126 577634926 575945511 575903664 576277771 575248413 573108788
$$ packed form
815.9E78190727K177773K249145R35364o68907k751160k082023q64067j396485m81109
824.6E75309258p66335l18565J95922j38511m10691k043647l064270l692856l278885
833.3E61791420k965164k026940j171226j229897n9166k87094j155357j533928k319450
841.9E49043198k834740k663193k095604j466369j250420n90324O81190L49197k68058
850.6E38904877p39518j89285M48609p70989j479568j760865n73272N90172J659812
859.3E36089973K044297P19413J380349J506729J272430Q40798J027412K261047K057305
868E49199753M105835M475631L578759M463005L670692K168198J443252J824265R35936
876.7E75865326Q06160L87039L65601K10800j689415m1847L74107j029358k139625
$$ plain form
885.3 573108788 570204010 566946030 563701973 561323624 558197594 556006393 554918327 553831367
893 553831367 552774277 551389122 549369850 545802498 543394699 541905327 539992638 538227425 536354370
901.7 536354370 534858208 533494530 532618713 530759010 527341957 524367828 521693306 518460312 514956055
910.4 514956055 512017326 509497871 506814728 504193153 501837311 499250984 495915680 492125854
918.1 492125854 488828621 485747604 482736855 480514870 478898239 477716026 477300949 477890549 478184853
926.8 478184853 477275200 475757027 474355431 473539658 473072510 473655243 475603256 477078896 478244514
935.5 478244514 479997787 480941315 481396446 482215271 483177109 484355698 485954437 487578926 488929443
944.2 488929443 490333366 491338272 492173882 492522736 491866570 490170212 487260666 483966599 480697594
$$ packed form
885.3E73108788k904778l257980l244057k378349l126030k191201j088066j086960
893E53831367j057090j385155k019272l567352k407799j489372j912689j765213j873055
901.7E36354370j496162j363678q75817j859703l417053k974129k674522l232994l504257
910.4E14956055k938729k519455k683143k621575k355842k586327l335304l789826
918.1D92125854l297233l081017l010749k221985j616631j182213m15077N89600K94304
926.8D78184853r09653j518173j401596q15773m67148N82733J948013J475640J165618
935.5D78244514J753273R43528M55131Q18825R61838J178589J598739J624489J350517
944.2D88929443J403923J004906Q35610L48854o56166j696358k909546l294067l269005
$$ plain form
952.8 480697594 477598801 474316063 470887604 467793579 463955193 459701958 455025330 449671555
960.6 449671555 444402466 439001808 433590469 427502747 422026634 416973534 410973549 404779701
968.3 404779701 398093796 391402473 383939705 376263351 368289261 360502052 353004875 344650002
976 344650002 337099037 329067268 322335548 315576305 307729969 300418510 293038559 286756649 280144711
984.7 280144711 275227776 270780182 266530266 262531548 259172382 257584667 254354057 252204857
992.4 252204857 249695873 248182850 247170029 245549335 245332794 244028072 244277649 244071617 244647808
1001.1 244647808 245061054 244288292 244202194 243457069 243893127 242722206 242433052 241949520 240620670
1009.7 240620670 239748096 238481026 238402443 236039906 235275536 234386597 232270641 230873260 229617176
$$ packed form
952.8D80697594l098793l282738l428459l094025l838386m253235m676628n353775
960.6D49671555n269089n400658n411339o087722n476113n053100n999985o193848
968.3D04779701o685905o691323p462768p676354p974090p787209p497177q354873
976C44650002p550965q031769o731720o759243p846336p311459p379951o281910o611938
984.7B80144711m916935m447594m249916l998718l359166j587715l230610k149200
992.4B52204857k508984j513023j012821j620694k16541j304722K49577k06032N76191
1001.1B44647808M13246p72762q6098p45125M36058j170921k89154m83532j328850
1009.7B40620670q72574j267070p8583k362537p64370q88939k115956j397381j256084
$$ plain form
1018.4 229617176 229985180 229453201 230399399 230276756 230168400 230949459 231312981 232076225 231582870 232590275
1028.1 232590275 232346230 232546329 233547726 234877262 236137638 236073360 237434998 237168846 237624340
1036.7 237624340 237516060 237533607 237806606 237487774 238765087 237971821 238910828 239653091 240500393 240998993
1046.4 240998993 240649052 241958218 241564579 242709045 243211155 245075207 247193050 247789497 249767780
1055.1 249767780 251849613 255234108 256945496 259827881 262381649 264848747 268249664 270831871
1062.8 270831871 274580631 277591839 282577782 285859470 288333092 289975357 288838158 287667046
1070.5 287667046 284247017 281647682 277679329 273828068 270378399 266578388 264408703 262431984
1078.2 262431984 263094425 261607628 261276608 262240486 262483635 263230247 263985825 267099400 268495293
$$ packed form
1018.4B29617176L68004n31979R46198j22643j08356P81059L63522P63244m93355J007405
1028.1B32590275k44045K00099J001397J329536J260376o4278J361638k66152M55494
1036.7B37624340j08280J7547K72999l18832J277313p93266R39007P42263Q47302M98600
1046.4B40998993l49941J309166l93639J144466N02110J864052K117843N96447J978283
1055.1B49767780K081833L384495J711388K882385K553768K467098L400917K582207
1062.8B70831871L748760L011208M985943L281688K473622J642265j137199j171112
1070.5B87667046l420029k599335l968353l851261l449669l800011k169685j976719
1078.2B62431984O62441j486797l31020R63878K43149P46612P55578L113575J395893
$$ plain form
1086.9 268495293 270820656 273428726 276704903 279783993 281676083 284995747 285872669 287643967
1094.6 287643967 289420414 291314487 292652607 293423634 295530491 296358032 298056679 298104687 298390751
1103.3 298390751 298498230 298568916 300105648 300860329 302693577 303440590 305017738 305881348 307304859
1112 307304859 309603710 310116768 311621857 312444267 314112015 314695606 315724964 317338448 317828388
1120.6 317828388 319359798 320208740 322170067 323169212 324413185 325162773 325123215 326927986 328191032
1129.3 328191032 330303383 332101402 334135208 334844780 334501877 334252777 333212433 333010788 330870781
1138 330870781 328612785 326004486 323561058 321734695 319601212 318084221 315016613 313168793 310590687
1146.7 310590687 307920609 305283623 301992588 300320683 298152370 297159595 295445118 294629936 294348125
$$ packed form
1086.9B68495293K325363K608070L276177L079090J892090L319664Q76922J771298
1094.6B87643967J776447J894073J338120P71027K106857Q27541J698647M8008K86064
1103.3B98390751J07479P0686J536732P54681J833248P47013J577148Q63610J423511
1112C07304859K298851N13058J505089Q22410J667748N83591J029358J613484M89940
1120.6C17828388J531410Q48942J961327R99145J243973P49588l9558J804771J263046
1129.3C28191032K112351J798019K033806P09572l42903k49100j040344k01645k140007
1138C30870781k257996k608299k443428j826363k133483j516991l067608j847820k578106
1146.7C10590687k670078k636986l291035j671905k168313r92775j714477q15182k81811
$$ plain form
1155.4 294348125 293783360 293933716 293662300 294748287 295094757 296791954 298507137 300969048 304340916
1164 304340916 307437305 312192421 315482845 319864292 324354401 329348526 334840355 339772186 345413094
1172.7 345413094 350084343 356038895 362181244 368230515 373705406 379149437 384557571 388783493
1180.4 388783493 393989601 398107452 402063713 406380196 410409737 414413872 418295860 422354507
1188.1 422354507 425132217 427795105 429682274 430768166 431966286 432898102 434485283 435916786
1195.9 435916786 437050972 437714958 438265686 438778992 438981400 439331703 439173813 439098396 439611969 440650101
1205.5 440650101 441543884 442452965 443624268 444850655 446406975 447773132 448942566 449550667 450216560
1214.2 450216560 451098976 451981354 452771683 453161850 454419403 455791817 456031303 455443230 455222282
$$ packed form
1155.4B94348125n64765J50356k71416J085987L46470J697197J715183K461911L371868
1164C04340916L096389M755116L290424M381447M490109M994125N491829M931831N640908
1172.7C45413094M671249N954552O142349O049271N474891N444031N408134M225922
1180.4C88783493N206108M117851L956261M316483M029541M004135L881988M058647
1188.1D22354507K777710K662888J887169J085892J198120R31816J587181J431503
1195.9D35916786J134186O63986N50728N13306K02408L50303j57890p5417N13573J038132
1205.5D40650101Q93783R09081J171303J226387J556320J366157J169434O08101O65893
1214.2D50216560Q82416Q82378P90329L90167J257553J372414K39486n88073k20948
$$ plain form
1222.9 455222282 455043945 453625336 451915207 450671005 450034637 449232368 448414040 447704773 446848717
1231.5 446848717 446247177 445036507 444217072 443542595 442449417 441466980 440962563 441308136 441682091
1240.2 441682091 442249146 442318459 442536430 442789574 443225784 444456139 444889717 445532951 446477432 447780380
1249.9 447780380 449309006 450898705 452453117 453314476 454353981 454917793 455386124 455755119 456212120
1258.5 456212120 457097664 457801781 459487610 461083221 462359161 463466492 463912086 464465714 465242577
1267.2 465242577 465896149 466229973 466791878 467525711 468742409 470280266 471578827 472928810 473604279
1275.9 473604279 473778191 474032631 474090233 473889351 473863716 474578094 475511932 476128311 476957016 478066177
1285.5 478066177 478768272 479268608 479546204 479220963 478802910 478518562 478212738 478213844 478391571 478553047
$$ packed form
1222.9D55222282j78337j418609j710129j244202o36368q02269q18328p09267q56056
1231.5D46848717o01540j210670q19435o74477j093178r82437n04417L45573L73955
1240.2D41682091N67055O9313K17971K53144M36210J230355M33578O43234R44481J302948
1249.9D47780380J528626J589699J554412Q61359J039505N63812M68331L68995M57001
1258.5D56212120Q85544P04117J685829J595611J275940J107331M45594N53628P76863
1267.2D65242577O53572L33824N61905P33833J216698J537857J298561J349983O75469
1275.9D73604279J73912K54440N7602k00882k5635P14378R33838O16379Q28705J109161
1285.5D78066177P02095N00336K77596l25241m18053k84348l05824J106J77727J61476
$$ plain form
1295.2 478553047 478782387 478628464 478300629 478091240 477431564 476373596 475588226 475224113 475103493
1303.9 475103493 475209236 475573997 476132393 476385231 475864220 475345306 474995537 474233360 473249779 472457886
1313.5 472457886 471795616 471262093 471157837 471146736 470676498 469867630 468959923 467984505 466819916 465692711
1323.2 465692711 464852219 464417953 464098282 463612595 462976723 462020226 461238480 460349960 459131279
1331.8 459131279 458011055 456874695 456056671 455367317 454702148 454192772 454203110 454234962 454280548 454762802
1341.5 454762802 454726601 454809303 454522247 453939629 453868523 453858376 453882828 453773308 453690300 453796921 453867035
1352.1 453867035 453296967 452576485 451804581 450838127 450322037 449576874 449013062 448865623 448640060 448083496
1361.7 448083496 447203751 446065178 445309334 444902496 443643036 442753448 442057037 441390724 441996117
$$ packed form
1295.2D78553047K29340j53923l27835k09389o59676j057968p85370l64113j20620
1303.9D75103493J05743L64761N58396K52838n21011n18914l49769p62177r83581p91893
1313.5D72457886o62270n33523j04256j1101m70238q08868r07707r75418j164589j127205
1323.2D65692711q40492m34266l19671m85687o35872r56497p81746q88520j218681
1331.8D59131279j120224j136360q18024o89354o65169n09376J0338L1852M5586M82254
1341.5D54762802l6201Q2702k87056n82618p1106j0147K4452j09520q3008J06621P0114
1352.1D53867035n70068p20482p71904r66454n16090p45163n63812j47439k25563n56564
1361.7D48083496q79745j138573p55844m06838j259460q89588o96411o66313O05393
$$ plain form
1370.4 441996117 442464790 442710915 442499123 442227707 441696472 441105423 440660362 439913940 440372314 441138191
1380.1 441138191 442450333 443627663 444785042 446119194 447148857 448928070 449739304 449987259 450559998
1388.7 450559998 451484337 452693634 453662415 454637947 455177231 455123177 454347382 454880333 454937820 454433441
1398.4 454433441 453153725 452163353 452669258 452366638 452668304 452924767 452438965 452849960 453196983
1407.1 453196983 453392639 452570915 451828156 450933266 449929733 449139786 448703308 448893394 448551598
1415.7 448551598 448359413 448195686 448829346 447972755 447729492 449163017 449618378 450298538 450568542
1424.4 450568542 451583519 452696266 453259659 453758888 453278923 452778778 452412834 452701988 452057076
1433.1 452057076 451627197 452456741 452849617 451898804 451403122 452866058 452635460 452492180 452736855
$$ packed form
1370.4D41996117M68673K46125k11792k71416n31235n91049m45061p46422M58374P65877
1380.1D41138191J312142J177330J157379J334152J029663J779213Q11234K47955N72739
1388.7D50559998R24339J209297R68781R75532N39284n4054p75795N32951N7487n04379
1398.4D54433441j279716r90372N05905l02620L01666K56463m85802M10995L47023
1407.1D53196983J95656q21724p42759q94890j003533p89947m36478J90086l41796
1415.7D48551598j92185j63727O33660q56591k43263J433525M55361O80160K70004
1424.4D50568542J014977J112747N63393M99229m79965n00145l65944K89154o44912
1433.1D52057076m29879Q29544L92876r50813m95682J462936k30598j43280K44675
$$ plain form
1441.8 452736855 452073936 452001953 451214638 451104660 450691032 450743103 450434494 450342216 450373688 448606606
1451.4 448606606 447237434 444767227 443746681 442261772 440997810 441081200 438753433 441828575 442392502
1460.1 442392502 444622993 445105286 445740891 446935768 445068130 447555885 449205246 454177399 459748459
1468.8 459748459 467046394 474349594 480201645 489219627 493027534 499620857 504049568 508537445
1476.5 508537445 512793427 516736412 521008377 524329376 528783340 531333885 534268913 536139603
1484.2 536139603 537120667 538453522 538025398 539016075 540192490 541106148 541517982 543906288 545654716
1492.9 545654716 545666924 546240540 545176888 541410065 541876755 541961098 540725594 541585655 542352486
1501.6 542352486 541947403 542175407 542328796 541519928 532961617 526920509 529659309 530318336 529728737
$$ packed form
1441.8D52736855o62919p1983p87315j09978m13628N2071l08609r2278L1472j767082
1451.4D48606606j369172k470207j020546j484909j263962Q3390k327767L075142N63927
1460.1D42392502K230491M82293O35605J194877j867638K487755J649361M972153N571060
1468.8D59748459P297935P303200N852051R017982L807907O593323M428711M487877
1476.5E08537445M255982L942985M271965L320999M453964K550545K935028J870690
1484.2E36139603R81064J332855m28124R90677J176415R13658M11834K388306J748428
1492.9E45654716J2208N73616j063652l766823M66690Q4343j235504Q60061P66831
1501.6E42352486m05083K28004J53389q08868q558311o041108K738800O59027n89599
$$ plain form
1510.2 529728737 529683304 529090652 527216568 527083397 526269112 524993629 523124275 519956589 522234459
1518.9 522234459 523843956 522700577 521142998 520695000 523266945 525033417 524256439 524125099 524699745
1527.6 524699745 523163795 522390289 522904587 522381783 522149429 520842896 519560623 521091576 521489754
1536.3 521489754 521934662 523256416 521079636 513806229 517523232 517520027 517052994 519654503 520972290
1545 520972290 522161903 524192810 526252785 527466621 528232880 528866234 530315475 531672630 532696800
1553.6 532696800 533280945 534605865 539050598 541902428 537745285 540524063 541485901 546355247 548533478
1562.3 548533478 550293579 551445999 551739616 553434792 555472260 557487602 557766991 557045250 558780403
1571 558780403 560793457 561653824 561977692 562910995 562443352 559000587 561013794 563936234 564683151
$$ packed form
1510.2E29728737m5433n92652j874084j33171q14285j275483j869354l167686K277870
1518.9E22234459J609497j143379j557579m47998K571945J766472p76978j31340N74646
1527.6E24699745j535950p73506N14298n22804k32354j306533j282273J530953L98178
1536.3E21489754M44908J321754k176780p273407L717003l205m67033K601509J317787
1545E20972290J189613K030907K059975J213836P66259O33354J449241J357155J024170
1553.6E32696800N84145J324920M444733K851830m157143K778778R61838M869346K178231
1562.3E48533478J760101J152420K93617J695176K037468K015342K79389p21741J735153
1571E58780403K013054Q60367L23868R33303m67643l442765K013207K922440P46917
$$ plain form
1579.7 564683151 564659615 564386635 563883247 563402061 562243195 561235657 560115128 559376106 558753090
1588.4 558753090 558245277 557305374 556381760 555310822 553896408 552398262 549756737 547901917 545910683
1597 545910683 544220085 542755890 541339417 539954529 538200417 536738052 533928604 531354523 528614426
1605.7 528614426 525777855 522623634 520230446 518086472 514710808 513047447 510161476 507532883
1613.4 507532883 504737473 502479324 499754562 489420662 488439865 486565285 483963242 480403976
1621.1 480403976 478219833 475391273 468806610 467048302 464397392 462566185 457430115 452619858
1628.9 452619858 449935341 446679153 444121895 440881805 440345078 438633156 432047501 428294029
1636.6 428294029 428604279 427253036 424868088 424294968 422238960 421844826 419870987 419858246 420771790
$$ packed form
1579.7E64683151k3536k72980n03388m81186j158866j007538j120529p39022o23016
1588.4E58753090n07813r39903r23614j070938j414414j498146k641525j854820j991234
1597E45910683j690598j464195j416473j384888j754112j462365k809448k574081k740097
1605.7E28614426k836571l154221k393188k143974l375664j663361k885971k628593
1613.4E07532883k795410k258149k724762j0333900r80797j874580k602043l559266
1621.1D80403976k184143k828560o584663j758308k650910j831207n136070m810257
1628.9D52619858k684517l256188k557258l240090n36727j711922o585655l753472
1636.6D28294029L10250j351243k384948n73120k056008l94134j973839j2741R13544
$$ plain form
1645.3 420771790 417508316 416472168 413444824 415364304 415401459 416390610 418125420 417175674 413609848
1653.9 413609848 413021240 416553879 417393494 419271698 420325508 421365623 422820358 424012108 426170425
1662.6 426170425 426228333 429939728 432009239 433861542 436185150 437906265 439780312 440741577 444789162
1671.3 444789162 446577377 449570770 452141762 453058777 455781212 459087639 463312988 465859680
1679 465859680 469060974 471170692 474057655 477428932 476816521 477767372 481852913 487633858 491083336
1687.7 491083336 493980217 497643471 500965919 504300346 506625443 509768066 513305626 516724663
1695.4 516724663 516521492 520461311 525676041 530277710 533093300 530630226 535909309 539665413
1703.1 539665413 541878738 542866554 544053192 545006638 546664467 549163857 550315475 551733360 553220444
$$ packed form
1645.3D20771790l263474j036148l027344J919480L7155R89151J734810r49746l565826
1653.9D13609848n88608L532639Q39615J878204J053810J040115J454735J191750K158317
1662.6D26170425N7908L711395K069511J852303K323608J721115J874047R61265M047585
1671.3D44789162J788215K993393K570992R17015K722435L306427M225349K546692
1679D65859680L201294K109718K886963L371277o12411R50851M085541N780945L449478
1687.7D91083336K896881L663254L322448L334427K325097L142623L537560L419037
1695.4E16724663k03171L939819N214730M601669K815590k463074N279083L756104
1703.1E39665413K213325R87816J186638R53446J657829K499390J151618J417885J487084
$$ plain form
1711.8 553220444 554333916 555735664 555468254 554930458 556704979 558314095 556396790 559800415 563103638
1720.5 563103638 564797935 565749893 565883560 565382576 564865189 563949394 562118263 560605164 559555702
1729.1 559555702 556107559 553242531 552920380 551803970 544901695 534898949 534271545 532205238
1736.9 532205238 528045044 524596672 517925148 509896774 508527565 507356339 503501930 502629280
1744.6 502629280 502612076 504162140 506995277 510656929 516400414 522616005 533006668 541628685
1752.3 541628685 551684875 561961555 571878777 581706924 590164680 599476395 606759453 613783798
1760 613783798 619762764 624478226 629920197 634862175 639437447 642994995 646562042 649085007 649658661
1768.7 649658661 652476501 655712585 656702881 655328369 655617905 659522934 662368546 662744598 664822540
$$ packed form
1711.8E53220444J113472J401748k67410n37796J774521J609116j917305L403625L303223
1720.5E63103638J694297R51958J33667n00984n17387r15795j831131j513099j049462
1729.1E59555702l448143k865028l22151j116410o902275j0002746o27404k066307
1736.9E32205238m160194l448372o671524q028374j369209j171226l854409q72650
1744.6E02629280j7204J550064K833137L661652N743485O215591J0390663Q622017
1752.3E41628685J0056190J0276680R917222R828147Q457756R311715P283058P024345
1760F13783798N978966M715462N441971M941978M575272L557548L567047K522965N73654
1768.7F49658661K817840L236084R90296j374512K89536L905029K845612L76052K077942
$$ plain form
1777.4 664822540 666370926 667350311 667731476 667005005 668076401 669621201 671041946 671072617 671408157
1786 671408157 673202438 674418259 675213242 676085815 676009521 675705643 673907623 673558655 676361923
1794.7 676361923 677858353 677971573 679121475 680670242 681130981 680378113 681332855 681074753 681146164
1803.4 681146164 682191010 682212830 682785339 683469849 684047623 684999084 685680237 685012970 685492020 686329651
1813 686329651 686032257 686359253 686557007 686994400 687179565 687682495 688671341 688923492 689521942 689429855
1822.7 689429855 689670105 689630051 687194519 687415237 689160156 690625153 690930710 689403763 690445328
1831.4 690445328 692327957 692451706 692228165 691950531 691662979 691361389 690836639 691637039 692348785
1840.1 692348785 693108292 693166733 693663177 694225464 690428391 691537018 693011551 692468033 692252960
$$ packed form
1777.4F64822540J548386R79385L81165p26471J071396J544800J420745L0671L35540
1786F71408157J794281J215821P94983Q72573p6294l03878j798020l48968K803268
1794.7F76361923J496430J13220J149902J548767M60739p52868R54742k58102P1411
1803.4F81146164J044846K1820N72509O84510N77774R51461O81153o67267M79050Q37631
1813F86329651k97394L26996J97754M37393J85165N02930R88846K52151N98450r2087
1822.7F89429855K40250m0054k435532K20718J744919J464997L05557j526947J041565
1831.4F90445328J882629J23749k23541k77634k87552l01590n24750Q00400P11746
1840.1F92348785P59507N8441M96444N62287l797073J108627J474533n43518k15073
$$ plain form
1848.7 692252960 692820129 693392334 693736343 694683914 694685059 694694977 694709702 694411850 694281693 693515778
1858.4 693515778 693384628 693436737 694016037 694425049 694854889 695601578 695818329 696111298 695365677 694832382
1868 694832382 693328400 692182312 693370590 694293900 695159531 695647888 696259232 696573563 696389389
1876.7 696389389 695974960 695633011 695554276 695162125 695259552 695293655 695618210 696091080 696553802 697159653
1886.3 697159653 697084045 697191696 696471710 694996414 695563278 696386337 696076508 696422119 696910706 696690598
1896 696690598 697180634 697099228 697278519 697374115 696836624 696462402 696344452 696752167 696647644 697080231
1905.6 697080231 697548141 697660141 697648163 697289047 696751862 695941620 696302338 696431808 696603546 696505356
1915.3 696505356 696600189 697843781 696582413 696308594 697113495 697017441 696711731 695244064 694666214
$$ packed form
1848.7F92252960N67169N72205L44009R47571J145R918J4725k97852j30157p65915
1858.4F93515778j31150N2109N79300M09012M29840P46689K16751K92969p45621n33295
1868F94832382j503982j146088J188278R23310Q65631M88357O11344L14331j84174
1876.7F96389389m14429l41949p8735l92151R7427L4103L24555M72870M62722O05851
1886.3F97159653p5608J07651p19986j475296N66864Q23059l09829L45611M88587k20108
1896F96690598M90036q1406J79291R5596n37491l74222j17950M07715j04523M32587
1905.6F97080231M67910J12000j1978l59116n37185q10242L60718J29470J71738r8190
1915.3F96505356R4833J243592j261368k73819Q04901r6054l05710j467667n77850
$$ plain form
1923.9 694666214 695344849 696321716 696778793 697249680 697400818 697180023 697104797 696926880 697104874 696257401
1933.6 696257401 695595856 695310898 695251694 696005707 696511383 697068253 697172623 697694626 697050247 695014191
1943.2 695014191 695321198 695632324 695261383 695000076 695314178 695634155 696207733 696874847 696894608 696931610
1952.9 696931610 696724930 696251526 695566177 695348511 695390549 695395050 695669861 695995407 696634216 696867294
1962.5 696867294 696854401 696635895 696127167 695699997 695298920 694966049 695130997 695772018 695881271 696342621
1972.2 696342621 696697769 696675262 696682892 696159058 695900269 695435867 695216980 694902344 694459534 694910889
1981.8 694910889 695608063 696144562 696042938 696318130 696530075 696083145 695270920 694517975 694625549 694366074
1991.5 694366074 693846283 694047928 694984207 695417404 695313568 695412292 694722137 694163284 693758774 693571243
$$ packed form
1923.9F94666214O78635R76867M57077M70887J51138k20795p5226j77917J77994q47473
1933.6F96257401o61545k84958n9204P54013N05676N56870J04370N22003o44379k036056
1943.2F95014191L07007L11126l70941k61307L14102L19977N73578O67114J9761L7002
1952.9F96931610k06680m73404o85349k17666M2038M501K74811L25546O38809K33078
1962.5F96867294j2893k18506n08728m27170m01077l32871J64948O41021J09253M61350
1972.2F96342621L55148k2507P630n23834k58789m64402k18887l14636m42810M51355
1981.8F94910889O97174N36499j01624K75192K11945m46930q12225p52945J07574k59475
1991.5F94366074n19791K01645R36279M33197j03836R8724o90155n58853m04510j87531
$$ plain form
2001.1 693571243 693669662 693708954 693937302 694202118 694544678 694139328 693843460 693627243 692959061 692469177
2010.7 692469177 691953888 691608582 691551666 692041473 692177353 691751251 691342392 691125488 691021423 690698929
2020.4 690698929 690364532 689701767 689657669 689758453 689516678 689514084 689163208 688879013 688435440 688088837
2030 688088837 687657242 687115936 686796722 686429138 686597977 686889038 687410965 687800903 687634354 687155457
2039.7 687155457 686442871 685790176 685160370 684843826 684629364 684848251 685227051 685416031 685506439 685503006
2049.3 685503006 685620041 685149612 684674759 684024353 683394547 683408508 683581467 683927460 684185410 684902573
2059 684902573 685437927 685383911 684886322 684209747 683852005 683120956 682698364 682693253 683059464 683462906
2068.6 683462906 683798599 684420395 684691696 684854431 684502563 683853073 683261185 682882156 682752075 683033447
$$ packed form
2001.1F93571243R8419L9292K28348K64816L42560m05350k95868k16217o68182m89884
2010.7F92469177n15289l45306n6916M89807J35880m26102m08859k16904j04065l22494
2020.4F90698929l34397o62765m4098J00784k41775k594l50876k84195m43573l46603
2030F88088837m31595n41306l19214l67584J68839K91061N21927L89938j66549m78897
2039.7F87155457p12586o52695o29806l16544k14462K18887L78800J88980R0408l433
2049.3F85503006J17035m70429m74853o50406o29806J3961J72959L45993K57950P17163
2059F84902573N35354n4016m97589o76575l57742p31049m22592n111L66211M03442
2068.6F83462906L35693O21796K71301J62735l51868o49490n91888l79029j30081K81372
$$ plain form
2078.2 683033447 683622665 683712921 684339294 685043869 685502090 685173187 684101257 683814011 683280411 682658310
2087.9 682658310 682289276 682552567 683105316 683518829 684222260 684517136 684925919 684810944 684293671 683669739
2097.5 683669739 682939529 682565918 682208939 682611847 683363571 684131546 684596329 684722366 684369125 683838196
2107.2 683838196 683827286 683136673 682709885 682633286 682818756 683348770 683616867 684144821 684104919 683784409
2116.8 683784409 683372498 683141937 683203201 683143311 682870102 682495117 682856750 683015060 683117371 683143158
2126.5 683143158 683244095 683410568 682837296 682831879 682681885 682228165 682031326 682193680 682623672 682996597
2136.1 682996597 683490906 683311615 683199081 682855606 682107315 681554260 681127548 681250992 681556778 682064819
2145.8 682064819 682468567 682886887 682905273 682623749 682416000 681998672 681769867 681320572 681610489 681894836
$$ packed form
2078.2F83033447N89218R0256O26373P04575M58221l28903j071930k87246n33600o22101
2087.9F82658310l69034K63291N52749M13513P03431K94876M08783j14975n17273o23932
2097.5F83669739p30210l73611l56979M02908P51724P67975M64783J26037l53241n30929
2107.2F83838196j0910o90613m26788p6599J85470N30014K68097N27954l9902l20510
2116.8F83784409m11911k30561O1264n9890k73209l74985L61633J58310J02311K5787
2126.5F83143158J00937J66473n73272n417j49994m53720j96839J62354M29992L72925
2136.1F82996597M94309j79291j12534l43475p48291n53055m26712J23444L05786N08041
2145.8F82064819M03748M18320J8386k81524k07749m17328k28805m49295K89917K84347
$$ plain form
2155.4 681894836 682002563 682676239 683038406 683234024 682799301 682635574 682338943 681813278 681710815 681755142
2165 681755142 682377548 682537308 683053360 683870392 684198303 684171066 683913040 684031067 683751984 683434982
2174.7 683434982 683187332 683297729 683888855 684535294 685127716 685351944 685696411 685618134 685340042 684943771
2184.3 684943771 684810410 685056610 685066833 685296326 685326157 685930634 686802139 687411041 687532806 686777039
2194 686777039 686215363 685866165 685818939 685545807 685524521 685934525 686464386 687531815 688350677 688791199
2203.6 688791199 688564529 688268890 687788696 687287674 687136002 686905060 687472305 688005676 688477859 688772659
2213.3 688772659 688940811 689353409 689250641 689038696 688635406 688516235 688317108 688257751 688698425 689007797
2222.9 689007797 689495850 689672470 689684601 689620895 689717102 689450226 688748703 688514938 688481293 688799362
$$ packed form
2155.4F81894836J07727O73676L62167J95618m34723j63727k96631n25665j02463M4327
2165F81755142O22406J59760N16052Q17032L27911k7237k58026J18027k79083l17002
2174.7F83434982k47650J10397N91126O46439N92422K24228L44467p8277k78092l96271
2184.3F84943771j33361K46200J0223K29493K9831O04477Q71505O08902J21765p55767
2194F86777039n61676l49198m7226k73132k1286M10004N29861J067429Q18862M40522
2203.6F88791199k26670k95639m80194n01022j51672k30942N67245N33371M72183K94800
2213.3F88772659J68152M12598j02768k11945m03290j19171j99127n9357M40674L09372
2222.9F89007797M88053J76620J2131o3706R6207k66876p01523k33765l3645L18069
$$ plain form
2232.5 688799362 689175034 689669724 689833374 689951706 690195236 690090485 689951553 689258118 689018631 689200974
2242.2 689200974 689470215 689630280 689650726 690082016 690179138 690298004 690051041 689794388 689588547 689391861
2251.8 689391861 689331665 689225311 690064621 690254669 690264664 690506134 690439224 690358658 689825745 689558563
2261.5 689558563 688975754 689070663 689500656 689862823 690499039 690488281 690789719 690689697 690412979 689909439
2271.1 689909439 689590225 689669037 689087677 689052582 689576797 690459824 690658264 690867004 691193924 690580368
2280.8 690580368 689917679 688907928 688618622 688617020 689060974 689709396 689996872 690987778 691450043 691659393
2290.4 691659393 691175232 690632629 690205460 689601669 690205612 690496521 690879059 691527100 692462234 693399811
2300 693399811 693608246 693664093 692967987 692770386 692506638 692143478 692267990 692793121 694194489 694909821
$$ packed form
2232.5F88799362L75672M94690J63650J18332K43530j04751j38932o93435k39487J82343
2242.2F89200974K69241J60065K0446M31290R7122J18866k46963k56653k05841j96686
2251.8F89391861o0196j06354Q39310J90048R995K41470o6910q0566n32913k67182
2261.5F89558563n82809R4909M29993L62167O36216j0758L01438j00022k76718n03540
2271.1F89909439l19214P8812n81360l5095N24215Q83027J98440K08740L26920o13556
2280.8F90580368o62689j009751k89306j602M43954O48422K87476R90906M62265K09350
2290.4F91659393m84161n42603m27169o03791O03943K90909L82538O48041R35134R37577
2300F93399811K08435N5847o96106j97601k63748l63160J24512N25131J401368P15332
$$ plain form
2309.7 694909821 695886002 697005920 697248764 696932983 696369553 696351318 696201935 696549606 696507950 696801758
2319.3 696801758 699057922 700576630 701024170 701637268 701649094 701547546 702010345 701476746 701398239 702773590
2329 702773590 702955780 702855072 702919922 703135452 703610153 703168182 703184509 703615341 703375702 703118286
2338.6 703118286 702876740 703368835 705029984 705748138 704442825 703779144 703268356 700903702 698116531
2347.3 698116531 695503922 695673065 698400803 699519958 700060883 701318893 703390274 706285782 707535706
2356 707535706 708623962 708101959 708170700 708805084 708910370 709035416 707819748 707044067 706301422 706393204
2365.6 706393204 704662170 701898193 701227417 700376740 698757477 696676712 694748764 692928391 691744690
2374.3 691744690 690940170 690014877 689194794 688228912 687306900 686035919 684627151 683194351 682097397
$$ packed form
2309.7F94909821R76181J119918K42844l15781n63430j8235j49383L47671m1656K93808
2319.3F96801758K256164J518708M47540O13098J1826j01548M62799n33599p8507J375351
2329G02773590J82190j00708O4850K15530M74701m41971J6327M30832k39639k57416
2338.6G03118286k41546M92095J661149P18154j305313o63681n10788k364654k787171
2347.3F98116531k612609J69143K727738J119155N40925J258010K071381K895508J249924
2356G07535706J088256n22003O8741O34384J05286J25046j215668p75681p42645R1782
2365.6G06393204j731034k763977o70776q50677j619263k080765j927948j820373j183701
2374.3F91744690q04520r25293q20083r65882r22012j270981j408768j432800j096954
$$ plain form
2383 682097397 681069565 680108032 680131531 680152206 679917831 679517899 679553909 679794388 679207687 678807831
2392.6 678807831 678367386 677906265 677700043 677544861 677440643 677538452 677813873 677619553 677600403 677420959
2402.3 677420959 676803818 676131668 675754089 675787582 675438614 675317764 675556870 675872498 675870972 675484543
2411.9 675484543 675084915 674576569 674167786 673570480 673286896 673293152 673354492 673343048 673326874 673777695
2421.6 673777695 673782120 673358231 672697296 672084503 671334152 670709763 670728455 670409393 670508804 670843658
2431.2 670843658 670698013 670324097 670259094 670277100 669458389 668746719 668344040 668259659 668011932 667771759
2440.8 667771759 667887421 667633820 667658081 667282867 666805267 666486053 665711670 665316925 665354996 665173645
2450.5 665173645 664606857 664701157 664869919 664664154 664532318 664198303 663943939 663557663 663249130 662739716
$$ packed form
2383F82097397j027832r61533K3499K0675k34375l99932L6010K40479n86701l99856
2392.6F78807831m40445m61121k06222j55182j04218R7809K75421j94320j9150j79444
2402.3F77420959o17141o72150l77579L3493l48968j20850K39106L15628j526l86429
2411.9F75484543l99628n08346m08783n97306k83584O256O1340j1444j6174M50821
2421.6F73777695M425m23889o60935o12793p50351o24389J8692l19062R9411L34854
2431.2F70843658j45645l73916o5003J8006q18711p11670m02679q4381k47727k40173
2440.8F67771759J15662k53601K4261l75214m77600l19214p74383l94745L8071j81351
2450.5F65173645n66788R4300J68762k05765j31836l34015k54364l86276l08533n09414
$$ plain form
2460.1 662739716 662108917 662012634 662197571 662201233 662102127 662204895 661799164 661322479 661099091 660939789
2469.8 660939789 660703430 660386810 660271454 659720535 659517212 659711075 659718552 659587631 659385986 659138947
2479.4 659138947 658489914 658196716 657862778 657550812 657688828 657823029 657561646 656909332 657053680 657237396
2489.1 657237396 657003937 656534348 656007919 655621109 655083542 655094833 654879684 654963150 655671310 655782852
2498.7 655782852 655460663 654933090 654577866 654211121 653938599 653761520 653813171 654057312 654033661 653887329
2508.3 653887329 653448715 653033524 652554474 652355347 652364655 652260208 652293167 652244110 652354126 652192535
2518 652192535 652051849 651730652 651137314 650771255 650354004 650251999 649854507 649528732 649603500 649680252
2527.6 649680252 649760590 649846420 650015945 649622498 649251938 648757706 648177185 647903061 647562637 647367630
$$ packed form
2460.1F62739716o30799r6283J84937L662r9106J02768m05731m76685k23388j59302
2469.8F60939789k36359l16620j15356n50919k03323J93863P477j30921k01645k47039
2479.4F59138947o49033k93198l33938l11966J38016J34201k61383o52314J44348J83716
2489.1F57237396k33459m69589n26429l86810n37567J1291k15149Q3466P08160J11542
2498.7F55782852l22189n27573l55224l66745k72522j77079N1651K44141k3651j46332
2508.3F53887329m38614m15191m79050j99127R308j04447L2959m9057J10016j61591
2518F52192535j40686l21197n93338l66059m17251j02005l97492l25775P4768P6752
2527.6F49680252Q0338Q5830J69525l93447l70560m94232n80521k74124l40424j95007
$$ plain form
2537.3 647367630 647104950 647231445 647313843 647112808 646849823 646644440 646357040 645397491 644752960 644187622
2546.9 644187622 644068680 644491882 644710007 644966431 644578552 644051056 643549881 643214874 643070297 642568283
2556.6 642568283 642132797 641854172 641839294 641683426 641568832 641608124 641417694 641103668 640519714 639821701
2566.2 639821701 639457512 639404068 638840179 638288651 638348923 638728600 639100952 639026680 638920288 638744965
2575.9 638744965 638504028 637924652 636971779 636292953 636140251 636087456 635413666 635122147 635235710 635304070
2585.5 635304070 635329285 635050125 634871712 634418869 634003792 633670654 633257179 633094330 632828903 632558708
2595.1 632558708 632718086 633048859 632892876 632799606 632480316 631626358 630957718 630710869 630794106 630490417
2604.8 630490417 630285339 630067329 629710655 629566841 629257050 629197807 628852882 628216515 627544441 626893616
$$ packed form
2537.3F47367630k62680J26495Q2398k01035k62985k05383k87400r59549o44531n65338
2546.9F44187622j18942M23202K18125K56424l87879n27496n01175l35007j44577n02014
2556.6F42568283m35486k78625j4878j55868j14594L9292j90430l14026n83954o98013
2566.2F39821701l64189n3444n63889n51528O0272L79677L72352p4272j06392j75323
2575.9F38744965k40937n79376r52873o78826j52702n2795o73790k91519J13563O8360
2585.5F35304070K5215k79160j78413m52843m15077l33138m13475j62849k65427k70195
2595.1F32558708J59378L30773j55983r3270l19290q53958o68640k46849Q3237l03689
2604.8F30490417k05078k18010l56674j43814l09791n9243l44925o36367o72074o50825
$$ plain form
2614.4 626893616 626732140 626707382 626558800 626251183 626215858 625951080 625120811 624367294 623736725 623421860
2624.1 623421860 623421173 623032227 622268600 622042732 621780624 621251411 620634651 619849091 619802208 619727821
2633.7 619727821 618991203 618425484 618310509 618074303 617615929 617187958 616538773 615916061 615294495 614762421
2643.4 614762421 614221535 613941841 613814049 613268051 613080711 612714882 612220993 611850548 611259499 610818100
2653 610818100 610251999 609713020 609088058 608793221 608632431 608073921 607744904 607357521 607140808 606937103
2662.6 606937103 606138115 605238495 604642105 604031296 603635101 603841248 603703651 603245049 603073807 603026657
2672.3 603026657 602723885 602151947 601673355 601123314 600551834 600084152 599804649 599700813 599539948 599210396
2681.9 599210396 598840332 598629570 598383560 597996979 597514687 597055893 596644363 596417122 596072388 595468178
$$ packed form
2614.4F26893616j61476k4758j48582l07617l5325k64778q30269p53517o30569l14865
2624.1F23421860o87l88946p63627k25868k62108n29213o16760p85560m6883p4387
2633.7F19727821p36618n65719j14975k36206m58374m27971o49185o22712o21566n32074
2643.4F14762421n40886k79694j27792n45998j87340l65829m93889l70445n91049m41399
2653F10818100n66101n38979o24962k94837j60790n58510l29017l87383k16713k03705
2662.6F06937103p98988q99620n96390o10809l96195K06147j37597m58602j71242m7150
2672.3F03026657l02772n71938m78592n50041n71480m67682k79503j03836j60865l29552
2681.9E99210396l70064k10762k46010l86581m82292m58794m11530k27241l44734o04210
$$ plain form
2691.6 595468178 595216484 595360527 595321655 594604111 594266396 594046211 593522720 593554192 593085327 592500534
2701.2 592500534 592147560 591658707 591291122 591043854 591129875 590663490 590238533 590148582 589566689 588912277
2710.9 588912277 588287926 587848244 587486725 586955566 586402626 586173706 585912437 585477982 585030632 584326935
2720.5 584326935 583944778 583400955 582634010 582462845 582494164 582318687 581843567 581218491 580756798 580459099
2730.2 580459099 579992599 579725685 579598579 579394531 579211502 578918724 578617744 577983017 577772942 577611122
2739.8 577611122 576913261 576773071 576684036 576156654 575675583 575679550 575544472 575216293 574980774 574623184
2749.4 574623184 574299583 573364296 572625389 572419243 572290268 572118874 571529045 571124420 570963593 571179466
2759.1 571179466 571078148 570500526 569873466 569033699 568629608 568429451 568439941 568369102 568124695 567711296
$$ packed form
2691.6E95468178k51694J44043l8872p17544l37715k20185n23491L1472m68865n84793
2701.2E92500534l52974m88853l67585k47268Q6021m66385m24957q9951n81893o54412
2710.9E88912277o24351m39682l61519n31159n52940k28920k61269m34455m47350p03697
2720.5E84326935l82157n43823p66945j71165L1319j75477m75120o25076m61693k97699
2730.2E80459099m66500k66914j27106k04048j83029k92778l00980o34727k10075j61820
2739.8E77611122o97861j40190q9035n27382m81071L967j35078l28179k35519l57590
2749.4E74623184l23601r35287p38907k06146j28975j71394n89829m04625j60827K15873
2759.1E71179466j01318n77622o27060q39767m04091k00157J0490p0839k44407m13399
$$ plain form
2768.7 567711296 567056694 566892776 566869545 566868210 566347847 565341530 564533844 564125900 563874016 563376770
2778.4 563376770 563284187 563135109 563297462 563355637 562247429 561206131 560477562 560023232 559441719 558756943
2788 558756943 558379669 557992363 557645988 557353401 557078476 556478539 555807838 555034447 554179497 553512077
2797.7 553512077 552787476 552151184 551585732 551100883 550349197 549710236 549249725 548273125 547214050
2806.3 547214050 546512375 546102867 545152626 543990517 543360176 542670479 541555061 540629768 540168571
2815 540168571 538997536 537290535 535848007 534852600 534160042 532944069 531163597 529635315 528674698
2823.7 528674698 527274551 525701981 524499207 522962837 521140137 519341011 517716866 515926552
2831.4 515926552 513940544 512091293 510707321 508802948 505827446 503346138 500467873 496634636
$$ packed form
2768.7E67711296o54602j63918k3231j335n20363j006317q07686m07944k51884m97246
2778.4E63376770r2583j49078J62353N8175j108208j041298p28569m54330n81513o84776
2788E58756943l77274l87306l46375k92587k74925n99937o70701p73391q54950o67420
2797.7E53512077p24601o36292n65452m84849p51686o38961m60511r76600j059075
2806.3E47214050p01675m09508r50241j162109o30341o89697j115418r25293m61197
2815E40168571j171035j707001j442528r95407o92558j215973j780472j528282r60617
2823.7E28674698j400147j572570j202774j536370j822700j799126j624145j790314
2831.4E15926552j986008j849251j383972j904373k975502k481308k878265l833237
$$ plain form
2839.1 496634636 492644577 488497658 484383278 479196129 472546959 465348434 458275070 450713387
2846.8 450713387 441744461 432729607 424430885 416580276 409779320 404404716 400711670 398674278
2854.6 398674278 398323135 399574890 402122536 405981789 410339241 414363289 418297462 422309494
2862.3 422309494 426491394 429829140 431680946 433018875 433564491 433455811 433101006 432254105 431390190
2870.9 431390190 430851555 430208244 429434128 429486237 430152397 430565338 430420876 429897995 429043388 428225594
2880.6 428225594 427881622 426782722 425123024 423609924 422141953 420585899 418864479 417613297
2888.3 417613297 416127892 414377785 412514954 410450935 408479691 406348152 404632835 402654076
2896 402654076 400568810 398807068 396501160 394122658 392030487 390012398 387411690 384694824 381965981
$$ packed form
2839.1D96634636l990059m146919m114380n187149o649170p198525p073364p561683
2846.8D50713387q968926r014854q298722p850609o800956n374604l693046k037392
2854.6C98674278l51143J251755K547646L859253M357452M024048L934173M012032
2862.3D22309494M181900L337746J851806J337929N45616j08680l54805q46901q63915
2870.9D31390190n38635o43311p74116N2109O66160M12941j44462n22881q54607q17794
2880.6D28225594l43972j098900j659698j513100j467971j556054j721420j251182
2888.3D17613297j485405j750107j862831k064019j971244k131539j715317j978759
2896D02654076k085266j761742k305908k378502k092171k018089k600708k716866k728843
$$ plain form
2904.7 381965981 378615952 375319138 371917496 368275528 364204407 359732590 355397415 350699730
2912.4 350699730 345105286 338995743 332944221 326684990 320322495 314033203 307999573 302651806
2920.1 302651806 297536583 293292484 289991550 286653957 284596825 284518871 284632282 284862213 286484222
2928.8 286484222 289371204 292455444 295446949 299762897 304327106 308378334 313609791 319393463
2936.5 319393463 324771156 330112228 335855484 341077576 346274185 351828041 356742668 361471252
2944.2 361471252 365666580 369594574 372856941 375179024 377131042 378266945 379467430 380863991
2952 380863991 381909256 382684479 383723488 385184097 386756516 388462753 390444336 393142776 395893555
2960.6 395893555 398662834 401933517 405816078 410037689 413864250 417698326 422018929 426712418
$$ packed form
2904.7C81965981l350029l296814l401642l641968m071121m471817m335175m697685
2912.4C50699730n594444o109543o051522o259231o362495o289292o033630n347767
2920.1C02651806n115223m244099l300934l337593k057132p7954J13411K29931J622009
2928.8B86484222K886982L084240K991505M315948M564209M051228N231457N783672
2936.5C19393463N377693N341072N743256N222092N196609N553856M914627M728584
2944.2C61471252M195328L927994L262367K322083J952018J135903J200485J396561
2952C80863991J045265P75223J039009J460609J572419J706237J981583K698440K750779
2960.6C95893555K769279L270683L882561M221611L826561L834076M320603M693489
$$ plain form
2968.3 426712418 430567627 433875656 437923584 442174606 445814438 449127998 452388229 455099373
2976.1 455099373 458452301 461761169 463909607 466153183 468679810 471282921 472958603 474286537
2983.8 474286537 476172142 477972679 479817276 481777687 483228378 484044151 485417595 486737823
2991.5 486737823 487393913 487802925 487898483 488083725 488169136 488280220 488108406 487564430 486900406 485789604
3001.1 485789604 484335670 482627335 480908585 479543037 479016685 478342896 477055130 476463509 476633186
3009.8 476633186 476906776 477092972 477680321 478673172 480020866 481602783 483212585 484735756 485767517
3018.5 485767517 486779671 487515450 487993622 488719444 489316902 489205208 489000931 489191208 488842926
3027.2 488842926 488564224 488392181 488213348 487937737 487418594 487348824 486891785 486124992 485186958 484476433
$$ packed form
2968.3D26712418L855209L308029M047928M251022L639832L313560L260231K711144
2976.1D55099373L352928L308868K148438K243576K526627K603111J675682J327934
2983.8D74286537J885605J800537J844597J960411J450691Q15773J373444J320228
2991.5D86737823O56090M09012R5558J85242Q5411J11084j71814n43976o64024j110802
3001.1D85789604j453934j708335j718750j365548n26352o73789j287766n91621J69677
3009.8D76633186K73590J86196N87349R92851J347694J581917J609802J523171J031761
3018.5D85767517J012154P35779M78172P25822N97458j11694k04277J90277l48282
3027.2D88842926k78702j72043j78833k75611n19143o9770m57039p66793r38034p10525
$$ plain form
3036.8 484476433 483932114 483236847 482902832 482212868 481768112 481394234 480612564 479552002 478476830
3045.5 478476830 477796288 476803551 475842438 474967079 474368439 473488121 472426643 471661453 470688782
3054.2 470688782 470421181 469591370 468300133 467418900 466561432 465809860 464499435 463655434 463151550
3062.9 463151550 462424622 461345749 460225639 459756775 458992157 457852669 456831398 456177444 455280495
3071.5 455280495 454518967 454104309 453357544 452667732 451933289 451294327 450370941 449545555 448376694
3080.2 448376694 447060814 446877213 446290665 445351677 444349709 443705788 443179703 442082710 441444969
3088.9 441444969 440437660 439065857 438082390 437758026 437419739 436489868 435486832 434535179 434159088
3097.6 434159088 433367615 432086334 431119232 429949455 428321953 427282791 427172546 426560173 425852013
$$ packed form
3036.8D84476433n44319o95267l34015o89964m44756l73878p81670j060562j075172
3045.5D78476830o80542r92737r61113q75359n98640q80318j061478p65190r72671
3054.2D70688782k67601q29811j291237q81233q57468p51572j310425q44001n03884
3062.9D63151550p26928j078873j120110m68864p64618j139488j021271o53954q96949
3071.5D55280495p61528m14658p46765o89812p34443o38962r23386q25386j168861
3080.2D48376694j315880j83601n86548r38988j001968o43921n26085j096993o37741
3088.9D41444969j007309j371803r83467l24364l38287r29871j003036r51653l76091
3097.6D34159088p91473j281281r67102j169777j627502j039162j10245o12373p08160
$$ plain form
3106.2 425852013 425054703 424158478 423314209 422067337 420929413 419787369 419087105 418417587 417522354
3114.9 417522354 416613922 415794868 415112686 413948860 413165207 412394180 411268082 409912109 408563156
3123.6 408563156 407708321 406875687 406256714 405339584 404348831 403585930 402978897 402219849 401001892
3132.3 401001892 399882164 398510628 397472801 396586571 395853958 394956741 393531952 392717476 391724243
3141 391724243 390753708 389706841 388677635 387878952 386695290 385590057 384391327 383806190 383087578
3149.6 383087578 382140617 381310234 380055008 379387436 378605690 377605286 376554489 375198250 373630829
3158.3 373630829 372421532 371707878 370596085 370133629 369832268 369084511 367974358 366251907 364964523
3167 364964523 364311485 363830757 362654953 361474686 360814743 360145378 359225731 357874413 356971436
$$ packed form
3106.2D25852013p97310q96225q44269j246872j137924j142044p00264o69518q95233
3114.9D17522354r08432q19054o82182j163826p83653p71027j126098j355973j348953
3123.6D08563156q54835q32634o18973r17130r90753p62901o07033p59048j217957
3132.3D01001892j119728j371536j037827q86230p32613q97217j424789q14476r93233
3141C91724243r70535j046867j029206p98683j183662j105233j198730n85137p18612
3149.6C83087578r46961q30383j255226o67572p81746j000404j050797j356239j567421
3158.3C73630829j209297p13654j111793m62456l01361p47757j110153j722451j287384
3167C64964523o53038m80728j175804j180267o59943o69365r19647j351318r02977
$$ plain form
3175.7 356971436 356065025 354872017 354014168 353572502 352745934 351245575 350523567 350402603 349572220
3184.4 349572220 348189659 347637062 347069931 345656013 344695129 344023285 343248978 342177353 340984230
3193 340984230 339995079 339156914 338265991 337375488 336838226 336030121 335123749 334204407 333472557 332916603
3202.7 332916603 331970711 331206818 330621033 329829941 328757439 328212662 327594643 326353989 325525093
3211.4 325525093 324779015 324109268 323110199 322377205 322044907 321320801 320962143 320333710 319226265
3220 319226265 318498402 318228550 317513065 316378899 315454445 314598675 314207191 313628311 313007584 312385941
3229.7 312385941 311351471 310909233 310583687 309687424 308762169 308243122 307736645 307098656 306287594
3238.4 306287594 305365467 304714909 304106522 303452988 302851658 302658882 301978226 300819702 300132389
$$ packed form
3175.7C56971436r06411j193008q57849m41666q26568j500359p22008j20964q30383
3184.4C49572220j382561n52597n67131j413918r60884o71844p74307j071625j193123
3193C40984230r89151q38165q90923q90503n37262q08105r06372r19342p31850n55954
3202.7C32916603r45892p63893n85785p91092j072502n44777o18019j240654q28896
3211.4C25525093p46078o69747r99069p32994l32298p24106l58658o28433j107445
3220C19226265p27863k69852p15485j134166r24454q55770l91484n78880o20727o21643
3229.7C12385941j034470m42238l25546q96263r25255n19047n06477o37989q11062
3238.4C06287594r22127o50558o08387o53534o01330j92776o80656j158524o87313
$$ plain form
3247 300132389 299293804 298764572 298366776 297605209 296630268 296102371 296023502 295207634 294424324 293580799
3256.7 293580799 292701988 292410069 291996040 291549892 290811939 289803486 288979588 288406849 288211823
3265.4 288211823 287930756 287144356 286449776 286351604 286113796 285356216 284513607 283726139 283213234 282916374
3275 282916374 282299309 281593456 280885887 280475178 280457821 279709930 279016552 279003029 278715782 277809906
3284.7 277809906 276963120 276655216 276239758 275956860 275513992 275219421 275394840 274954224 274549580 274057255
3294.3 274057255 273379841 272929535 272461758 272110729 271834984 271491051 270486698 269703751 269722252 269651928
3303.9 269651928 269612103 269269886 268271828 267718430 267825890 267281036 266375942 265952721 265846882 265358124
3313.6 265358124 264559078 264506569 264444447 263926601 263647556 263356419 262779274 262358475 262082920 261958179
$$ packed form
3247C00132389q38585n29232l97796p61567r74941n27897p8869q15868p83310q43525
3256.7B93580799q78811k91919m14029m46148p37953j008453q23898n72739j95026
3265.4B88211823k81067p86400o94580r8172k37808p57580q42609p87468n12905k96860
3275B82916374o17065p05853p07569m10709j7357p47891o93378j3523k87247r05876
3284.7B77809906q46786l07904m15458k82898m42868k94571J75419m40616m04644m92325
3294.3B74057255o77414m50306m67777l51029k75745l43933j004353p82947J8501p0324
3303.9B69651928l9825l42217r98058n53398J07460n44854r05094m23221j05839m88758
3313.6B65358124p99046n2509o2122n17846k79045k91137n77145m20799k75555j24741
$$ plain form
3323.2 261958179 261980629 261157417 260604649 260467262 259687214 259216442 258941078 258606930 258126011 257738037
3332.9 257738037 257204781 256803703 257065868 256343575 255675049 255725727 255106983 254312744 253857365 253558712
3342.5 253558712 253320999 253440380 253205853 252543736 252315216 251785793 251016846 250886135 250427074 249653759
3352.2 249653759 249748077 249684792 249110012 248509312 247659645 246911945 246598778 246282787 245666027 245393314
3361.8 245393314 244910889 244497738 244621353 244256229 243562088 242699947 242297344 242272568 242117901 242002602
3371.4 242002602 241423035 240710754 240509872 240125160 239144821 239126663 239247456 238675079 238453636 237968922
3381.1 237968922 237563438 237059479 236803989 237011929 236864510 237021999 237078266 236692581 236211872 236075306
3390.7 236075306 235846252 235539398 235202675 234519291 234418392 233969898 233572598 233831024 233858109 233716335
$$ packed form
3323.2B61958179K2450q23212n52768j37387p80048m70772k75364l34148m80919l87974
3332.9B57738037n33256m01078K62165p22293o68526N0678o18744p94239m55379k98653
3342.5B53558712k37713J19381k34527o62117k28520n29423p68947j30711m59061p73315
3352.2B49653759R4318o3285n74780o00700q49667p47700l13167l15991o16760k72713
3361.8B45393314m82425m13151J23615l65124o94141q62141m02603k4776j54667j15299
3371.4B42002602n79567p12281k00882l84712r80339j8158J20793n72377k21443m84714
3381.1B37968922m05484n03959k55490K07940j47419J57489N6267l85685m80709j36566
3390.7B36075306k29054l06854l36723o83384j00899m48494l97300K58426K7085j41774
$$ plain form
3400.4 233716335 233359814 233435440 233447189 233396931 233585243 233656960 233384304 232780590 232732105 232973843
3410 232973843 233443279 233477592 232989349 233144321 233231430 232579975 231981297 232024975 232080154 232491417 232777672
3420.6 232777672 232661858 233024807 232859478 232596550 232761135 232978268 232965298 232916527 233263912 233499527
3430.3 233499527 233571587 233469982 233499470 233870029 234574909 234923801 234607677 234654331 234888287 234853630
3439.9 234853630 234980812 235621758 235820465 236157627 236777821 236797485 236907463 236668167 237432880 238438053
3449.6 238438053 238444881 238584042 238887119 239459076 239692326 240343323 240762157 240443115 241140499 242292976
3459.2 242292976 243100948 243008461 243232746 243752251 244208660 245038910 245057945 245379581 246045971 246474590
3468.8 246474590 246881924 247389679 248334904 249089222 249781303 250301838 250681629 251060581 251496773 252328033
$$ packed form
3400.4B33716335l56521P5626J1749n0258J88312P1717k72656o03714m8485K41738
3410B32973843M69436L4313m88243J54972Q7109o51455n98678M3678N5179M11263K86255
3420.6B32777672j15814L62949j65329k62928J64585K17133j2970m8771L47385K35615
3430.3B33499527P2060j01605K9488L70559P04880L48892l16124M6654K33956l4657
3439.9B34853630J27182O40946J98707L37162O20194J9664J09978k39296P64713J005173
3449.6B38438053O828J39161L03077N71957K33250O50997M18834l19042O97384J152477
3459.2B42292976Q07972r2487K24285N19505M56409Q30250J9035L21636O66390M28619
3468.8B46474590M07334N07755R45225P54318O92081N20535L79791L78952M36192Q31260
$$ plain form
3478.5 252328033 253445148 254089680 254084167 254433575 254935818 255914230 256943512 257475910 258141212 258279495
3488.1 258279495 258208885 259161358 260594788 261277428 262054558 262698574 263100452 264163513 264795055
3496.8 264795055 265556641 266365566 267037697 267591629 267818966 268478088 269364147 270507164 271276417
3505.5 271276417 272185802 273226490 274236450 274793339 274416523 275518589 276633377 277504082 278867702
3514.2 278867702 279443283 279811039 280729122 282092609 282740288 283379211 284517250 285915260 286792927
3522.9 286792927 286714363 287738647 288829708 289782944 290618801 291609554 293068504 294028339 295157661
3531.5 295157661 296256542 297321663 298432808 299996204 300797825 300740814 301630707 302426281 303805370
3540.2 303805370 305333405 306474113 307451706 308648758 309618359 310498714 312485294 312742710 313805485
$$ packed form
3478.5B52328033J117115O44532n513L49408N02243R78412J029282N32398O65302J38283
3488.1B58279495p0610R52473J433430O82640P77130O44016M01878J063061O31542
3496.8B64795055P61586Q08925O72131N53932K27337O59122Q86059J143017P69253
3505.5B71276417R09385J040688J009960N56889l76816J102066J114788Q70705J363620
3514.2B78867702N75581L67756R18083J363487O47679O38923J138039J398010Q77667
3522.9B86792927p8564J024284J091061R53236Q35857R90753J458950R59835J129322
3531.5B95157661J098881J065121J111145J563396Q01621n7011Q89893P95574J379089
3540.2C03805370J528035J140708R77593J197052R69601Q80355J986580K57416J062775
$$ plain form
3548.9 313805485 315389519 316942787 319338093 319556084 320638084 321626968 322619972 324035187 324339294
3557.6 324339294 325703201 327208900 329169731 330490837 332344246 334063263 335003090 338568573
3565.3 338568573 339420929 338952789 339151154 339540977 342763367 344740105 346250610 347795677 349740295
3574 349740295 351441116 352943077 355248146 356508141 358619347 360617638 362329521 364266243 365655518
3582.6 365655518 367076530 368343811 371827545 373513870 372994194 375113106 375755577 378844910 381709213
3591.3 381709213 384341736 386652107 387959785 390620308 389874153 391874199 395462227 397076683
3599 397076683 400541191 402083702 403450432 405515175 407017860 409340630 412115517 414434624 414437981
3607.7 414437981 417490158 417365990 417695236 424630356 426571350 425844727 428847160 429052010 433385086
$$ packed form
3548.9C13805485J584034J553268K395306K17991J082000R88884R93004J415215L04107
3557.6C24339294J363907J505699J960831J321106J853409J719017R39827L565483
3565.3C38568573Q52356m68140J98365L89823L222390J976738J510505J545067J944618
3574C49740295J700821J501961K305069J259995K111206J998291J711883J936722J389275
3582.6C65655518J421012J267281L483734J686325n19676K118912O42471L089333K864303
3591.3C81709213K632523K310371J307678K660523p46155K000046L588028J614456
3599C97076683L464508J542511J366730K064743J502685K322770K774887K319107L357
3607.7D14437981L052177j24168L29246O935120J940994p26623L002433K04850M333076
$$ plain form
3616.4 433385086 437288208 436780396 438141403 438591957 440750999 444349518 447225380 449954338 452161293
3625.1 452161293 454192924 456476326 461832619 463110085 453595047 457346649 462816544 468141479
3632.8 468141479 469505234 467402267 469921417 473887291 476788597 477538338 478836441 480629234
3640.5 480629234 482935715 484759178 484983788 487331581 490837898 496101151 495684967 492329330 497871170
3649.2 497871170 498111534 495902252 495799103 501325760 505719833 508497200 512577248 505915527 507674522
3657.9 507674522 512999916 514578476 516390038 517431755 519684792 520769691 522252159 523976212
3665.6 523976212 524654121 528620262 530372925 530257988 532243309 526902275 528627510 536223412 543687820
3674.3 543687820 541792030 526735001 529643898 537364426 542079964 541233063 542191162 544926949
$$ packed form
3616.4D33385086L903122n07812J361007M50554K159042L598519K875862K728958K206955
3625.1D52161293K031631K283402N356293J277466r515038L751602N469895N324935
3632.8D68141479J363755k102967K519150L965874K901306P49741J298103J792793
3640.5D80629234K306481J823463K24610K347793L506317N263253m16184l355637N541840
3649.2D97871170K40364k209282j03149N526657M394073K777367M080048o661721J758995
3657.9E07674522N325394J578560J811562J041717K253037J084899J482468J724053
3665.6E23976212O77909L966141J752663j14937J985321n341034J725235P595902P464408
3674.3E43687820j895790j5057029K908897P720528M715538q46901R58099K735787
$$ plain form
3682 544926949 546594048 547656364 548115311 548924866 553306694 560087585 551607132 546951714 555312271
3690.6 555312271 551570702 550783691 555109596 555550194 557671013 558564796 558763847 560178108 560693474
3699.3 560693474 563628311 566460075 561872597 559576530 563732262 565320206 565193443 565204086 567407341
3708 567407341 571680222 565205917 568106232 572788391 561196899 564749146 568269081 568591614 570103302
3716.7 570103302 572711792 573938522 570848427 571690407 576421585 573221512 569511223 574751434
3724.4 574751434 576405029 575607147 572639465 572499428 575755310 576051254 581332779 579338722 572850647
3733.1 572850647 581533661 581373138 571761322 571993752 574287910 574789810 577808800 581075668 576713371
3741.8 576713371 579083481 590081024 581233635 565167236 574737396 580941048 587238579 585253143
$$ packed form
3682E44926949J667099J062316M58947Q09555M381828O780891q480453m655418Q360557
3690.6E55312271l741569p87011M325905M40598K120819Q93783J99051J414261N15366
3699.3E60693474K934837K831764m587478k296067M155732J587944j26763J0643K203255
3708E67407341M272881o474305K900315M682159j1591492L552247L519935L22533J511688
3716.7E70103302K608490J226730l090095Q41980M731178l200073l710289N240211
3724.4E74751434J653595p97882k967682j40037L255882K95944N281525j994057o488075
3733.1E72850647Q683014j60523r611816K32430K294158N01900L018990L266868m362297
3741.8E76713371K370110J0997543q847389j6066399R570160O203652O297531j985436
$$ plain form
3749.5 585253143 574731827 584414330 579216728 572615852 578548737 582897263 585538445 579824066
3757.2 579824066 582174835 587597275 580062981 578246346 582103004 583802109 584392891 587788620
3764.9 587788620 585856667 581745644 584658623 589124832 589536591 580666733 581941338 585810928
3772.6 585810928 586417236 587184448 587279053 587725334 587391396 590080490 591182480 584812698 586708717
3781.3 586708717 588595085 589116058 591085815 588657494 587170067 587737656 588209114 589285431 589457283
3790 589457283 589458351 589712219 590482445 590062332 590668488 593968124 590952530 586615829 588330460 592132721
3799.6 592132721 596976204 590742798 582244263 585651207 588691635 593769989 599267235 589520035
3807.3 589520035 584590569 588865089 590610199 591754608 592885895 592684364 593601837 598560181 597269821
$$ packed form
3749.5E85253143j0521316R682503n197602o600876N932885M348526K641182n714379
3757.2E79824066K350769N422440p534294j816635L856658J699105N90782L395729
3764.9E87788620j931953m111023K912979M466209M11759q869858J274605L869590
3772.6E85810928O06308P67212R4605M46281l33938K689094J101990o369782J896019
3781.3E86708717J886368N20973J969757k428321j487427N67589M71458J076317J71852
3790E89457283J068K53868P70226m20113O06156L299636l015594m336701J714631L802261
3799.6E92132721M843483o233406q498535L406944L040428N078354N497246r747200
3807.3E89520035m929466M274520J745110J144409J131287k01531R17473M958344j290360
$$ plain form
3816 597269821 584365921 588586540 593858604 598168831 600140343 584335403 585868607 590993309
3823.7 590993309 592654648 595167007 595121269 590698891 590864296 592809601 595734558 597668991 590623894
3832.4 590623894 592796326 598711967 591697884 590939255 600094109 594621811 589672699 595549316
3840.1 595549316 589566612 589619179 596486473 594315224 590332489 592847061 594929886 595081902 596592827
3848.8 596592827 595199280 596895180 603108826 596897202 596400871 583078270 584979858 595411110
3856.5 595411110 594252815 591975822 593950882 596299400 599063797 594650421 593906822 599937286
3864.2 599937286 596203308 590714722 593210945 597312546 604023628 598775520 589154320 592129631
3871.9 592129631 597861023 601069794 590780830 590893898 594908028 595147552 597445526 601855049
$$ packed form
3816E97269821j2903900M220619N272064M310227J971512j5804940J533204N124702
3823.7E90993309J661339K512359m5738m422378J65405J945305K924957J934433p045097
3832.4E90623894K172432N915641p014083p58629R154854n472298m949112N876617
3840.1E95549316n982704N2567O867294k171249l982735K514572K082825J52016J510925
3848.8E96592827j393547J695900O213646o211624m96331j3322601J901588J0431252
3856.5E95411110j158295k276993J975060K348518K764397m413376p43599O030464
3864.2E99937286l733978n488586K496223M101601O711082n248108r621200K975311
3871.9E92129631N731392L208771j0288964J13068M014130K39524K297974M409523
$$ plain form
3879.7 601855049 597765656 590618210 596105003 597373734 598486938 603982391 592709694 592232399
3887.4 592232399 595513916 596685066 600692406 600190086 593045921 593844032 597026024 595569267 596704636
3896.1 596704636 597427483 599018898 600684547 591085167 595993156 598935928 594128227 598333282
3903.8 598333282 594901276 593078194 593587189 594261932 596689034 596786308 596486244 595945778 596228638
3912.5 596228638 596618919 596447792 597734756 599250908 595358696 592040672 597034874 598413696 594622688
3921.1 594622688 595750618 596844978 597746620 596339645 593584557 594885178 596200409 597152748 596078796
3929.8 596078796 595372620 597987518 595767708 593228760 594306641 594391594 595040474 595084190 594268417
3938.5 594268417 594767647 594714546 595737953 597206154 593922958 592839394 594591637 595996857 596746674
$$ packed form
3879.7F01855049m089393p147446N486793J268731J113204N495453j1272697m77295
3887.4E92232399L281517J171150M007340n02320p144165P98111L181992j456757J135369
3896.1E96704636P22847J591415J665649r599380M907989K942772m807701M205055
3903.8E98333282l432006j823082N08995O74743K427102R7274l00064n40466K82860
3912.5E96228638L90281j71127J286964J516152l892212l318024M994202J378822l791008
3921.1E94622688J127930J094360R01642j406975k755088J300621J315231R52339j073952
3929.8E96078796p06176K614898k219810k538948J077881Q4953O48880M3716q15773
3938.5E94268417M99230n3101J023407J468201l283196j083564J752243J405220P49817
$$ plain form
3947.2 596746674 594363556 594719505 595126114 593417397 595560150 596199417 595307655 595325241 595264549
3955.8 595264549 595407562 594711494 594565887 594610710 595472946 596020355 594670334 594857025 595340958 594733925
3965.5 594733925 594642220 595375023 596151543 595749130 594998207 595295525 595173759 594753723 595069122 595308304
3975.1 595308304 595127716 594579086 594776459 595026398 594926605 594626579 593985977 593860703 593694115 594551010
3984.8 594551010 594917870 594225616 594023666 593865891 594774628 594599838 593829956 594048424 595004768 596180077
3994.4 596180077 595074196 594422646 594344444 593962822 594783096 594982910
4000.2 594982910
$$ packed form
3947.2E96746674k383118L55949M06609j708717K142753O39267q91762J7586o0692
3955.8E95264549J43013o96068j45607M4823Q62236N47409j350021J86691M83933o07033
3965.5E94733925r1705P32803P76520m02413p50923K97318j21766m20036L15399K39182
3975.1E95308304j80588n48630J97373K49939r9793l00026o40602j25274j66588Q56895
3984.8E94551010L66860o92254k01950j57775R08737j74790p69882K18468R56344J175309
3994.4E96180077j105881o51550p8202l81622Q20274J99814
4000.2E94982910
##END=$$ End of the data block
