##TITLE=$$ Begin of the data block
##JCAMP-DX=5.00 $$ ACD/SpecManager v 10.08
##SPECTROMETER/DATA SYSTEM=Varian
##DATE=04 Dec 2012 14:00:54
##DATA TYPE=INFRARED SPECTRUM
##DATA CLASS=XYDATA
##ORIGIN=
##OWNER=
##NPOINTS=3735
##FIRSTX=399.26403809
##LASTX=4000.35498047
##MAXX=4000.35498047
##MINX=399.26403809
##MAXY=69.96619415
##MINY=29.02968407
##XFACTOR=1.0000000000
##YFACTOR=0.000000100000000
##FIRSTY=53.29547501
##DELTAX=0.96440572
##XUNITS=1/CM
##YUNITS=TRANSMITTANCE
##XYDATA=(X++(Y..Y))
399.3 532954750 531643829 535646210 541184082 543360252 542473183 542553902 540953255 546128273 546882286
407.9 546882286 542473030 539184914 538846436 542042046 542542763 538111420 530467529 526482925 531217804
416.6 531217804 541627388 547223930 555644302 552229881 540637856 538846359 537149086 535011902
424.3 535011902 536517906 539267845 538722458 534166718 533394318 533881149 534308319 533154984 534920120
433 534920120 535621872 533287811 532181511 521799927 521339951 527817993 529341316 534107971 532544060
441.7 532544060 530776939 534584389 528615036 524885139 528711395 530706367 535069237 537985268
449.4 537985268 537975502 540035133 537081261 538504257 538631210 534041252 533217468 530980606 531957474
458.1 531957474 532853165 536154480 540059052 535800171 531918182 531234741 531881828 530534935 526435013
466.8 526435013 521393814 522517738 527532349 530670624 532653465 529265251 529301224 529026375 523637924
475.5 523637924 517175713 515050278 517014656 517471199 518155289 517765121 519988708 523263512 525141373
484.1 525141373 526088028 522667236 521558342 517579460 513157158 512232475 510992584 513284950 513584480
492.8 513584480 513474274 512600861 513099098 516442719 516337242 516071815 514512596 509829369 502535553
501.5 502535553 499714546 504044991 506662788 508635559 508984375 510003281 508239975 506018715 506228142
510.2 506228142 503986397 500797577 497589531 495647507 496290169 497902260 496773911 494607582 495851936
518.9 495851936 496347618 494763069 490318146 486278496 485481224 483435860 480222130 483249054 488698845
527.5 488698845 487699699 486686974 488140984 488717880 489100914 489285507 488417397 485693398 485748253
536.2 485748253 487958908 491535149 495373497 496736832 499322319 499778023 497273827 496338081 496736641
544.9 496736641 496544304 495326118 495182381 497278061 499850616 500642433 502038460 502319565 499859581
553.6 499859581 498156853 497483635 496108284 493327408 492640991 493281288 492069435 491801834 493072357
562.3 493072357 493866043 493002434 491429214 489487724 487134323 483769341 479338570 476680756 475370140
570.9 475370140 475573883 477042046 478018036 477307396 476992950 478291245 477402306 476095047 475364838
579.6 475364838 476240158 476993637 476692085 479185295 482716408 487197495 491970787 494328384 493954620
588.3 493954620 493416214 492369881 490609512 490272751 490700226 492148972 493042870 494117889 496365395
597 496365395 497716675 497545853 495881500 495823898 495174561 492906647 492310791 492122307 491684494 492570686
606.6 492570686 495671196 498509674 499640961 499764786 499822655 498506966 495633049 493907814 493031960
615.3 493031960 494519997 497983475 501386299 504644814 507292976 509305649 510097580 511062546 511768761
624 511768761 511234627 509935303 509663620 511494370 514090652 517490044 520726738 523223877 525212250
632.7 525212250 525972557 525156288 523667412 521901283 519742661 519982834 522018890 523261681 525100403
641.3 525100403 527844543 530317650 532068977 532864761 532504807 531268806 528877640 526845436 526372643
650 526372643 526509705 527233887 530028801 534439507 536769600 536377831 535156059 534372368 532685814
658.7 532685814 530171242 529211082 529699783 531268806 532682648 534131966 536141319 538531456 542444420
667.4 542444420 540375137 535094986 532262878 531407013 532722855 532557030 533111191 534080505 535339394
676.1 535339394 537300148 538899078 540377617 541496964 540808716 537878456 536355858 536279144 536703339
684.7 536703339 537346497 537974663 540215759 542467766 544491730 545233040 543586044 541411133 540030785
693.4 540030785 538784981 536362572 534778976 534827957 535981407 537488480 538225708 538701210 538147469
702.1 538147469 536517944 533984604 531194763 529385185 528463020 528620682 529423256 531045418 532356567
710.8 532356567 532723770 534434700 536677437 537181931 536358223 535056877 533461952 532268333 533557625
719.5 533557625 536464424 538588104 541488228 544386139 546408577 548767891 550457916 551220703 550848999
728.1 550848999 550984116 552622108 554410667 556405525 559579659 563109970 565544701 567730179 568539276
736.8 568539276 568511734 568356552 567513084 566861229 566824417 567835426 567879868 568705139 571922226 574795799
746.5 574795799 575430870 574159126 573503151 570756149 567122688 565618629 564051323 563397369 563961754
755.1 563961754 564894905 565530243 564950829 563474159 562265778 561300011 559894485 559442520 559506073
763.8 559506073 558992195 558823662 560619087 563045464 564465485 566692085 569089813 571123390 572183876
772.5 572183876 572306099 573158913 574926338 576861801 578148308 580544357 583350754 585555725 587959251
781.2 587959251 590258789 592132034 592222481 591586571 591900902 592367935 592733231 594404945 596003227
789.9 596003227 596836395 598983803 600466194 600351868 600804405 601894989 602063217 602860832 604404259
798.5 604404259 605255432 607542305 609811478 611530876 613956413 615503845 616027489 616524925 616906319
807.2 616906319 616572838 616215591 616293526 617205658 618272705 619474564 620772247 621606407 621953201
815.9 621953201 621454582 621843147 621736870 621264343 621249161 620692253 620608368 620044250 619849625 619387779
825.5 619387779 618367958 617540207 616053429 614577637 613260498 612561378 611134911 609560165 608381042
834.2 608381042 607180901 606760445 605051804 602792854 600987206 599506187 598790169 598103790 597502594
842.9 597502594 596730843 595763245 594556847 593307610 592552032 592095757 591545677 590813446 590241890
851.6 590241890 590338364 590635376 590363235 590406799 590238953 589714584 589117432 588020935 588161354 589373512
861.2 589373512 590202179 590730400 592411385 594739532 596649094 599316521 601770554 604327087 606853561
869.9 606853561 608723907 610605621 612345009 614505005 616382294 618225670 620111160 622071991
877.6 622071991 623594093 624031296 623776703 622845573 621765327 619567833 617679749 616652412 615882530
886.3 615882530 614828033 613208733 612407799 611109619 609768448 608136940 605603485 602875633 600228081
895 600228081 598427696 596297913 595159607 595150909 594898682 594949417 594298210 593248711 591037064 587371063
904.6 587371063 584875984 583204956 580802879 578045769 576048851 575150223 573440247 571055374 568797989
913.3 568797989 566339073 564099350 560810318 557087135 553530350 550055962 547802658 546381111
921 546381111 545914497 545828056 545299377 544716835 544089165 542848969 541329231 540535851 539705162 539195366
930.7 539195366 539363022 539711647 541317825 543300552 544828720 546037941 546286087 546547928 546833000
939.3 546833000 547070503 547747612 547949028 548349609 549751625 551271248 552925529 554239807 554332161
948 554332161 553307304 551328201 549310265 546808510 543507614 540412445 537838669 535553360 533467026
956.7 533467026 531496239 528512230 525140038 522051888 517666321 512228928 506728401 501279640
964.4 501279640 496834793 492881012 488496475 483751869 478763733 474367294 468861961 461926956
972.1 461926956 454939308 448222389 441474075 433992043 426821518 419848976 413706131 407273674
979.8 407273674 400842896 395859337 390974426 385534058 379026146 373937569 369242439 364853897
987.6 364853897 360703239 356454735 354331741 352325325 351237297 350408325 349557114 347971725 346332626
996.2 346332626 345899162 344518585 343843575 343214149 343104210 342797623 343253822 344734688 344825897 345183449
1005.9 345183449 344622269 344039421 342693443 340899506 339110641 337202454 336024895 334587097 334811096
1014.6 334811096 334065132 333964005 333648872 332239075 331986504 330615387 330286636 329057541 328593712
1023.2 328593712 328664932 328947144 330548210 331189041 333224220 333620338 333623238 333614006 333886871 334553909
1032.9 334553909 334123688 334641991 333528137 333712730 333775139 333824768 334913712 335563431 336717300
1041.6 336717300 335336990 334960480 334682999 334277611 333960762 333829308 335451965 336016006 337171669
1050.2 337171669 337542953 339343414 341058350 342098808 343395767 343521156 345894890 347196007 349667511
1058.9 349667511 352750244 355471687 359294090 363180809 367626076 369899559 372738914 375096931
1066.6 375096931 377289886 378208809 376194725 374601669 371966019 370208206 367802505 365485916
1074.4 365485916 363522911 360507698 357885132 355137367 354159546 352531013 351821518 351948891 353124809
1083 353124809 355047493 356237793 359427719 361798553 364365807 366353035 367821388 368516273 369350281
1091.7 369350281 371978874 372650108 373563805 375048523 378224716 380263710 380591431 382501564 383626328
1100.4 383626328 384225769 383585129 383705826 383141937 383022346 384632607 385355263 387228203 388787041
1109.1 388787041 390998077 392506828 393783073 394885521 394767876 395504723 395341148 395855064 396402092
1117.7 396402092 398305740 400935516 402184067 403292885 404093895 405938568 406423492 407007065 407565498
1126.4 407565498 407874451 409417343 410484734 412144737 413266106 414991379 416012001 415959816 415910454
1135.1 415910454 414346886 412658310 410563889 408559990 406151810 404388504 403011360 401561127
1142.8 401561127 400476303 398257332 396752548 394298973 391978874 389561577 387006111 385471687
1150.5 385471687 383153725 381838989 380062256 379359894 378698425 378377914 379300499 379065552 379388046
1159.2 379388046 379157791 380186386 381407051 383176727 385852089 388567085 392452888 395769348
1166.9 395769348 400321808 404510422 409036827 413316536 416978989 421367035 424988747 429771004
1174.6 429771004 434213409 438982925 443741150 448344154 453748817 458473091 463270798 467132263
1182.4 467132263 470399284 473474159 476614990 479011536 481125183 484532394 487343369 490016403
1190.1 490016403 492445564 494704819 496603851 497655182 498665161 498933678 498933678 498964996 499355202 499765129
1199.7 499765129 499958649 500765495 502139664 503899612 504931679 505513039 505716362 505773849 506158028
1208.4 506158028 506286583 506691208 507482643 508882332 510692978 512428513 513765717 514807129 515663757
1217.1 515663757 515727539 515371742 515101318 514684868 513913269 513495712 513424835 513108444 512934341 513010597
1226.7 513010597 513132210 512397957 511298485 510115013 508203201 506413994 505152702 504421272 504013062
1235.4 504013062 504247894 504363937 504327469 504672775 504609108 504835091 504510651 503801270 503213959 502914963
1245 502914963 503552055 504082642 505417290 507717934 510129814 511789398 512807350 513671951 513689651
1253.7 513689651 513544121 513857880 514314308 514531670 515128059 516375999 518119545 520118332 521507187
1262.4 521507187 522513123 523187828 523572083 523244858 522747993 522890511 523293839 524542809 525940094
1271.1 525940094 527203255 529118233 530946503 531909065 532350655 532172318 531567917 531081543 530386391
1279.8 530386391 530367889 531059608 531969414 533807678 535654449 536748924 537378159 537683220 537487602
1288.4 537487602 537059059 536525002 535838776 535481949 535431595 535770988 536557503 537286873 537851486 537995110
1298.1 537995110 537658501 537055664 535771370 534229965 533302956 532844429 532639160 533371887 534611282
1306.8 534611282 535166969 535767479 536504097 536105156 534945183 533417358 531837578 530805969 530253334
1315.4 530253334 530083847 530509872 530983276 531143036 531445541 531360817 530822868 529901237 528037262 526360474
1325.1 526360474 525585670 524854240 524299240 524216919 524315300 524517784 524748039 524403229 523323135 521814461
1334.7 521814461 520263481 518758545 517492714 516845016 516398392 516873055 518383179 519383888 520147820
1343.4 520147820 520625839 520550117 519712486 518753357 518007584 517026520 516396980 516350670 516663017 517265244
1353.1 517265244 518308601 518733101 518223076 517626114 516480865 515160637 513735771 512245522 511467133
1361.7 511467133 510656853 509778137 510213547 511324272 511744194 511614151 510412292 509085197 508715210
1370.4 508715210 507644806 506974297 506295280 505517883 505088501 505397606 506385269 506340904 506700668 507388306
1380.1 507388306 508026543 508262978 508122902 508578033 509259567 510845566 512316589 513918724 516069717
1388.7 516069717 517985916 519367905 519998436 519943275 519532127 518120613 516247025 516728973 517163734
1397.4 517163734 517221870 516761703 517060242 518541985 518868256 518869362 518379593 516886559 516448975 516236954
1407.1 516236954 515994911 516109924 516571045 516437988 516206665 515692749 514889374 514134293 513312225 512717018
1416.7 512717018 512043915 511792412 509936256 511262207 513753929 515059433 515762863 515563202 516793518
1425.4 516793518 517425652 516852798 516687622 515869942 514855766 514605103 515545273 515543022 515441971 516417007
1435 516417007 516275253 513423653 512449036 513569107 513201523 512410965 511968803 511718903 512239456 511939201
1444.7 511939201 512277756 512569847 512315445 510311394 509589157 509199982 506922646 505481987 503562126
1453.3 503562126 502662163 501703300 500957756 498249741 495464516 499279480 500189934 502277031 502387276
1462 502387276 502489777 503659515 502015266 503350601 504554367 509072113 514131508 521170197 528294182
1470.7 528294182 533292198 540836296 545442276 552373657 556376266 559996910 564361305 568247604
1478.4 568247604 572263794 574646111 577117424 578950119 581227646 582826080 584002419 585446243
1486.1 585446243 585647545 586753540 587910347 587909966 587365494 589289856 590738335 590528564 590467453 588821068
1495.8 588821068 585654335 587397995 587776375 586688995 587611542 587543945 586405296 586240501 586224861
1504.5 586224861 585294418 579443970 573428383 574206314 575299911 575346603 575797195 574712257 572764549
1513.1 572764549 572817879 571702919 570120659 567764854 565460091 567499199 568927460 566389198 563124046
1521.8 563124046 565269890 568252945 569817696 568168297 566949959 566564369 564501114 564073830 564628105
1530.5 564628105 564434052 564294662 562086334 559737892 561864395 563067360 563632126 564419060 561851616
1539.2 561851616 555532150 557379837 558485298 558780708 560182381 560018120 560039635 562237358 563912659
1547.9 563912659 564966621 564488068 563469772 565302162 566888237 567980499 567658577 568883057 572728806
1556.5 572728806 574520569 570059052 567530174 571746902 577787132 580370789 581869583 582618675
1564.2 582618675 582912407 584044876 585997467 588374748 588885460 587045479 589360390 591745453 591920815
1572.9 591920815 592063026 592888870 591992302 588269997 590172806 592879829 593917236 594915123 595416718
1581.6 595416718 594940910 594281998 593306808 592422333 591018906 589844437 588983116 588697777 588324585
1590.3 588324585 588010597 587558937 586788368 585706787 583518295 581793060 579357338 577303658 575382805
1599 575382805 573788033 572848740 571461220 570294609 568525200 567340431 565407028 562763519 559389343
1607.6 559389343 556169128 553254013 549821701 547950592 545233955 543597717 541614799 539843674
1615.4 539843674 537525902 528241463 527579765 525448570 522403145 518972664 516999474 513688622
1623.1 513688622 507561913 507368431 506199417 505040588 500176926 496196938 494208298 491220894
1630.8 491220894 488396912 484619179 483480110 481594582 477342033 474877014 475238342 474673729 473326569
1639.5 473326569 473160324 470823059 470158882 467968216 467083397 466824188 463739204 464994545 463652496
1648.1 463652496 465947456 466497841 468285294 470709229 466092911 460504227 461553688 465415268
1655.9 465415268 466427155 468067169 469574738 471473236 473781776 475511971 478140182 478548851
1663.6 478548851 481225128 482736206 484342422 486159630 487704086 489938812 490848045 494696846
1671.3 494696846 496944237 500444374 503755760 504979248 506661186 509255104 512108955 513307838
1679 513307838 514951286 516441727 520129700 524702339 525258293 524953995 529689484 535207787 537864571
1687.7 537864571 538987885 541071777 543108597 545868759 548387260 551785545 555500107 558700333
1695.4 558700333 559050522 563244400 567999535 572146187 572216187 568213310 573935738 577501335 579293823
1704.1 579293823 580179367 581796379 583809280 586108742 588563614 589194260 588943329 589454765 590257530
1712.8 590257530 590583839 589309082 589358711 591729050 592042770 588767242 593396797 597015228 598285713
1721.4 598285713 598052292 596605492 594898987 593910980 592905197 591274643 590132179 589085464 585266418
1730.1 585266418 582075043 581857872 580904121 571972084 558104248 556326561 553104439 547822075
1737.8 547822075 543246651 535114250 526929779 525282021 522928543 516795044 514792747 514286270
1745.5 514286270 514585609 516077843 519295654 525017242 530499382 540969925 550985413 562026443
1753.3 562026443 572907791 582957191 592969475 601655807 611312866 618626251 625595131 631351013
1761 631351013 635838318 641478500 646851425 652197037 655962677 659514771 661685562 661654282 663905869
1769.7 663905869 666235657 666357193 664313583 665580673 669298782 671530838 672632446 675273666
1777.4 675273666 676703873 677320099 677660522 676112366 676376190 677402039 678358154 678672562 679425888
1786 679425888 681459579 682496033 683319626 683978271 683667450 684163437 682043076 681180573 683129807
1794.7 683129807 683444290 683545456 685211182 686938248 687193985 686964874 688216019 688013077 687925644
1803.4 687925644 688492813 688356171 688493195 688417206 688766098 689988861 690796051 690361557 690963821 691974106
1813 691974106 692293243 692766342 692544022 692455215 692106552 691940384 692369995 692571564 693549347 694061356
1822.7 694061356 694782104 695066071 692761307 693223572 694715347 695059280 693897095 691641617 693122635
1831.4 693122635 695056839 695476379 696085281 696694870 696681900 696138763 695752716 696056976 695631638 695730133
1841 695730133 696124191 696958008 696715927 693430252 695579453 697490692 697305756 697153625 697352295
1849.7 697352295 697560883 697124557 696892395 696577530 696861420 697430954 697478867 697838974 697886429 697847748
1859.3 697847748 697808533 697670517 697307816 697259140 697396317 697460785 697813873 697603607 697475433 696589279
1869 696589279 696405945 697751389 698438568 698545074 698401871 698392944 697962036 697851562 698180008 698319550
1878.6 698319550 698484879 698508835 698741989 698544769 698614883 698692932 698562775 698939133 698984604 699207077
1888.3 699207077 698414688 697238235 698266296 699108505 698815231 698754120 699097595 698906250 698772125
1896.9 698772125 698674316 698983765 699512634 699371719 698975372 698888931 698982010 698815765 699113617 699314194
1906.6 699314194 699001236 698948212 699034882 698829346 698742065 699180069 699033432 698938751 698847427 699001541
1916.2 699001541 699661942 698079224 697490311 698600235 699173965 699147644 697910233 697392044 697978210
1924.9 697978210 698312454 698341217 698500061 698490982 698169479 698003159 698215027 698555984 698509445 698371582
1934.6 698371582 698105011 697938232 697789841 697864685 698203888 698427200 699046555 697907715 696190796
1943.2 696190796 697114410 697750397 697514191 697454681 697458344 697003555 696796875 696992950 697290421 697556229
1952.9 697556229 697469406 697522507 697509460 697616348 697588654 697304382 697335510 697230453 696963043 696954956 697250900
1963.5 697250900 697244263 697144012 696978226 696622009 697073593 697847748 697807541 697304535 697216949 696575470
1973.1 696575470 696079330 696362457 696440353 696670303 696665192 696755219 696907883 696569214 696325150 696367264
1982.8 696367264 696420822 695979538 695534134 695481644 695836334 696005173 695887375 696225815 696069641 695195084
1992.4 695195084 694961853 695213089 694993896 694617767 694669266 694939423 695221100 695219269 695341873 695490036
2002.1 695490036 695367279 694926453 694452286 694163742 693760300 693455582 693328476 693658142 693899460 693736115
2011.7 693736115 693432236 693252563 693493652 693327866 692784348 692070770 691910858 691929169 691385880 691223984
2021.3 691223984 691293793 691473160 691448212 691410294 691279984 690590210 690061417 689840393 689738388 689328232
2031 689328232 689359283 689637451 689780960 689930801 689482040 689267578 688889694 688401871 688118134 687618408
2040.6 687618408 687398987 687674866 688062286 688062057 688345413 688031464 687172546 687246170 687441483 687123260
2050.3 687123260 686557693 686477127 686431427 686444168 686697235 686940079 687179794 687088165 687187653 686855621
2059.9 686855621 686566772 686482773 686007080 685740280 685564117 685859222 685968018 686172180 686599197 686842422
2069.6 686842422 687008743 686545792 686401978 686188431 685803223 685647202 685362396 685421982 685894547 686441650
2079.2 686441650 686229019 685920639 685868835 685642471 685513229 685416336 685274582 685027618 685090485 685277252
2088.9 685277252 685593643 685894394 685986938 686017761 685819244 685716476 685417862 685296021 685182419 685066223
2098.5 685066223 685363007 685494919 685913467 686434402 686480560 686124191 686107101 685856781 685094452 685043182
2108.1 685043182 685059967 685284500 685626526 685620422 685594025 685543442 685424957 685191269 685439758 685579224
2117.8 685579224 685285416 684760056 684480438 684848480 685048370 685087128 684967957 684951019 684883881 684728851
2127.4 684728851 684699783 684393387 684133835 684027786 684146805 684177399 684326172 684525757 684581299 684755783
2137.1 684755783 684604874 684494019 684206467 683991394 683810806 683490601 683683014 683910294 684236908 684440536
2146.7 684440536 684423218 684305267 684312057 684195251 683528748 683341217 683425674 683421707 683150787 683015060 683373642
2157.3 683373642 683728790 684206924 684375610 684252167 683861160 683792038 684038391 683807602 683602524 683702545
2167 683702545 684257965 684548798 684564362 684659042 684758987 685134735 685216904 684898376 684579773 684393616 684006348
2177.6 684006348 684183121 684761124 684912872 685137100 685204926 685514603 685605545 685666809 686016998 685624008
2187.2 685624008 685240097 685207672 685445175 685828781 686380157 686659546 686528168 686840134 687013168 686687775
2196.9 686687775 686120605 685930710 685845718 685816193 686370239 686790924 687027969 687119904 687230072 687440872
2206.5 687440872 687516708 687053223 686492996 686489639 686415100 686645584 686972046 687099762 687163773 687415695
2216.1 687415695 687883224 687893448 687979050 687752075 687215500 686943970 687111053 687365875 687245712 687567062
2225.8 687567062 687865753 687988281 687794418 687483673 687619019 687540436 687360840 687107620 686957016 686915894
2235.4 686915894 687449722 688096008 688319855 688775711 688612747 688165054 687522202 686789627 686489868 686378174
2245.1 686378174 686601334 686767654 686975327 687346954 688125305 688612518 688382263 688035355 687523193 687212906
2254.7 687212906 686994400 686985855 686861954 687016830 687593689 687942276 688127975 687746658 687702942 687494736
2264.4 687494736 686842270 686300964 686083603 686530075 686642761 687088623 687303314 687132950 687515335 687717056
2274 687717056 687660828 687574921 687524490 686715775 686377640 686614304 686557770 686718445 686670227 687075653 687211456
2284.6 687211456 687197952 687206039 686710434 686583710 686459274 686596375 686552048 686583786 686606827 686493149 687166519
2295.2 687166519 687234116 687029953 687104034 687040558 686946411 686952057 686800003 686346970 686429291 686609192 687365875
2305.8 687365875 688126678 688007050 687998962 687902679 687857056 687967606 688431320 688609924 688319473 687950668
2315.5 687950668 687347794 687723312 688534470 689173889 689551010 689358826 688894119 688637924 688956528 689077988
2325.1 689077988 689788971 690502777 690059814 690259247 691267471 691003342 689952774 689719238 688579712
2333.8 688579712 687675095 688943024 689888153 690462112 690867157 689912567 689894638 690413666 690090866 690026321
2343.4 690026321 689563446 688659744 688068848 687287216 686188736 686461029 687597885 687492142 687758713
2352.1 687758713 688638000 689837646 691157532 691127319 691714554 691403198 690571899 689822693 689905853 690318069
2361.8 690318069 688860397 688067780 688559113 689525452 688730392 687737656 687422562 686221237 684832687
2370.4 684832687 683723679 684013596 683748245 683007431 682860718 682487411 681998444 681162872 680870132
2379.1 680870132 680635452 679682007 678830490 678615799 678570480 678464890 678545074 678280792 678311234 678352509
2388.8 678352509 677792740 677315826 676927261 676687393 676439056 676691818 677027206 676771240 676582031 676628723
2398.4 676628723 676693954 676193161 675717316 675409851 675059433 675161896 675167236 674947205 674773331 674799118
2408.1 674799118 674949188 674953232 674575195 673988113 673863602 673837128 673206329 672698822 672832031 672906418
2417.7 672906418 673119507 673226013 673164444 673267746 672770920 672337036 672150726 671938553 671917038 671603088
2427.3 671603088 670982361 670660477 670760956 670421982 670194321 670128174 669651031 669611816 669658432 669273911
2437 669273911 668739548 668477173 668386383 668239746 667997360 667874146 668040085 667678528 667444305 667546158
2446.6 667546158 667220688 666786194 666299667 666244278 666534042 666432953 666137161 666075211 666085510 665932312
2456.3 665932312 665522690 664845810 664288025 664274826 664647141 664434433 664034424 664036560 663932724 663809814
2465.9 663809814 663592377 663460388 663343887 663027267 662805176 662673416 662397461 662022018 661925125 661885986
2475.6 661885986 661763611 661390381 660992050 661069641 661297913 661066589 660278854 659799271 659578857 659571304
2485.2 659571304 659794235 659971466 659980240 659728012 660084839 660021057 659367905 659098663 658759384 658372345
2494.8 658372345 657670288 657522964 657754440 657715225 657987595 657995377 657768860 657579269 657542648 657504044
2504.5 657504044 657248154 656693039 655957489 655913544 656236649 656327286 656339340 656326218 656393204 656526031
2514.1 656526031 656125107 655589752 655251236 654521484 654412842 654527969 654073486 653946457 654063339 653989639
2523.8 653989639 653687897 653607864 653611679 653355331 653082581 653171463 653385544 653257446 652950058 652230606
2533.4 652230606 651813278 652004852 652157593 652053299 651468201 651011734 650785446 650425491 650206985 650408096
2543.1 650408096 650279007 649969940 650128479 649839935 649620667 649685974 649579239 649468002 649002533 648474960
2552.7 648474960 648162842 647906570 647554474 647407990 647486572 647505646 647226105 646717758 646595612 646582870
2562.4 646582870 646195908 645519028 645411453 645351181 644886932 644947815 645018768 645026550 644641037 644296646
2572 644296646 644466629 644082642 643505630 643181305 643305969 643362350 642908020 642210083 642061844 642569733
2581.6 642569733 642249832 641789780 641808853 641930389 641800613 641421356 641446991 640992050 640218658 639936066
2591.3 639936066 639971123 639989510 639862442 639757309 639590569 639340096 639007988 638849487 638569794 638136520
2600.9 638136520 637798653 637841072 637893295 637356148 637744408 638207932 637509270 636785240 636351357 636289330
2610.6 636289330 636070747 635345039 634759140 634938087 634943657 634645271 634645576 634184227 633759727 633421402
2620.2 633421402 633155899 633046379 632598953 632005043 631524811 631498756 631255989 630920944 630722237 630388489
2629.9 630388489 630112801 629689598 629499855 629029694 628318672 628103676 627760391 627090836 626826439 626915245
2639.5 626915245 626428947 625708656 625289917 625287361 625379753 625076637 624646378 624197960 623801956 623150368
2649.1 623150368 622619476 622552490 622373810 622212372 621982841 621307602 620673065 620518074 620279961 619840698
2658.8 619840698 619063988 618336945 618280792 618069496 617849998 617759628 617625389 617418327 616968231 616773376
2668.4 616773376 616521530 615928307 615482941 615405350 615009155 614269295 613976479 614074821 613899231 613084412
2678.1 613084412 612678947 612961655 613085937 612481880 611963921 612084389 611611290 611464539 611604767 610978699
2687.7 610978699 610773125 611107101 610968056 610207672 609743652 609352646 608743553 608487320 608495140 608412704
2697.4 608412704 608200684 607875061 607067604 606693077 606624756 606270828 606262512 606178741 605908356 605273361
2707 605273361 604641533 604308052 604130096 604115982 603943443 603934669 603426857 602946320 602758217 602065773
2716.6 602065773 601691322 601279144 600781746 600425758 600205917 600230598 600010223 600049973 600060768 599789886
2726.3 599789886 599538078 598768005 597941933 597275276 596773834 596835556 596504707 596054726 596033821 595839233
2735.9 595839233 595898247 595847282 595638351 595541801 595114784 594528046 594040451 593871460 593408623 593159409
2745.6 593159409 593583870 593695183 593381157 592754517 592339668 592026901 591628571 591272736 590996819 590788918
2755.2 590788918 590148163 589913750 589959221 589812622 589790535 589734039 589958420 589659119 588785553 588241158
2764.9 588241158 587669067 586955452 586597481 586646461 586584511 586598816 587016449 587162247 586571732 585799141
2774.5 585799141 585124321 584530983 583994865 583471603 583229065 583109512 583249779 583365250 583101311 582715759
2784.2 582715759 582002602 581171532 580460434 580036354 579280663 578256989 577939873 577684479 577432785
2792.8 577432785 577440796 577654457 577548103 576570778 575763435 575206680 574412651 573450928 572426338 571935539
2802.5 571935539 571927338 571642647 571098747 570620537 570119247 569653931 568886299 567629738 566391449 565477524
2812.1 565477524 564684982 563797188 563167038 562688408 562011337 561230392 560369987 559566116 558822060 557509995
2821.8 557509995 555675621 554360085 553334999 552072792 550962372 549963303 548863716 547648048
2829.5 547648048 546004219 543948975 541965218 539830894 537788620 535735588 533011436 530516129
2837.2 530516129 528380127 525814514 522399139 518166924 513193207 507421112 501296921 494218140
2844.9 494218140 486423988 478770714 470567055 462031555 453869781 446220474 439084816 433446274
2852.6 433446274 429886017 427773552 427911911 429888039 432975159 437115746 441464882 446204872
2860.3 446204872 451760178 457337456 461422577 464349060 467167473 469538879 470580292 470513496 470524712
2869 470524712 470320549 469840279 469849434 470114937 470648727 471523170 472086906 472344513 472472382 472110901
2878.7 472110901 471623878 470984459 470080719 469349136 468539238 467581406 466307297 464737930 463584099
2887.3 463584099 462570839 460964317 459032097 457142677 455119629 453133774 451254120 449249001
2895.1 449249001 447307243 445500488 443527870 441283875 438886986 436627617 434519958 431967850
2902.8 431967850 428928146 425495644 422149467 419214401 415634537 411849403 407959557 403502197
2910.5 403502197 399290657 394354515 388429871 382406654 376038322 369335785 362614098 356152267
2918.2 356152267 349857635 344030190 338689461 333761177 330034790 327781219 326275558 325279274
2925.9 325279274 325568542 327173386 329429169 331777496 334867249 338987045 343164253 347613792
2933.6 347613792 352864304 358255348 363740692 369677658 375439148 381244392 386674957 391897850
2941.3 391897850 397478256 402357979 406747246 410456390 413552895 416771202 419760895 421813583
2949.1 421813583 422797737 423391380 423775253 424479179 425204201 425801811 426992416 428348122 429840202
2957.7 429840202 431426544 433276176 435744514 438778610 442226982 445882454 449490128 453046494
2965.5 453046494 457130737 461217766 465345955 469511261 472894821 476319122 480088844 483232536
2973.2 483232536 485932465 488751297 491422958 494216003 496591301 498290596 500640335 503348694
2980.9 503348694 505082016 506213837 508194542 510177956 511172791 511994667 513347626 515124359 516159477
2989.6 516159477 516792679 517607613 518218002 518521118 518443489 518177414 517878075 517662163 516945686 515769463
2999.2 515769463 514747047 513844757 512815704 511453590 510266228 509037514 507861862 507124443 506571579
3007.9 506571579 506530342 506608353 506593208 506974907 507770576 508627052 509657898 511122513 512575417 513756180
3017.5 513756180 514816780 515925598 516680145 517037125 517220688 517564354 518237305 518548088 518312073
3026.2 518312073 517870941 517984047 518116989 517862396 517826805 517534103 517309647 517084122 516441879 515518188
3035.9 515518188 514785805 514646721 514386330 514337769 514232864 513296051 512636108 512292480 511432762 510543213
3045.5 510543213 509434166 508011932 507244263 506902809 506749001 506450577 506030006 505859909 504981842
3054.2 504981842 503737793 502930489 502293129 501427841 500497475 499675484 498760223 498302612 498243294 497863159
3063.8 497863159 496888237 496006241 495545807 494877853 493929176 493004990 492411804 491647949 490953331 490532761
3073.5 490532761 490024681 490088387 490118752 489585571 489005394 488362617 487163620 485972023 485407677 484657364
3083.1 484657364 483793030 483170242 482798843 482090988 481366463 481463852 481155815 480108452 478876228
3091.8 478876228 477834091 476783638 476102295 476065178 475466499 475070000 474776230 474027519 473291206
3100.5 473291206 472328644 471518021 470638199 469844818 469100380 468277512 467981186 467483482 466450768
3109.1 466450768 465477524 465188026 465073929 464147644 463301849 462952919 462155914 461102486 460491676
3117.8 460491676 459888535 459102364 458702774 458175659 456975555 455933533 455081673 454001389 453018112
3126.5 453018112 452092285 451295853 450777283 450022354 449220161 449121933 448911781 447928467 446981392 446449509
3136.1 446449509 445844688 444786797 443962173 443021049 441717987 440763130 440021935 439574013 439075165
3144.8 439075165 438339348 437112617 436023102 435727081 434775810 433678131 433211021 432599030 431385269
3153.5 431385269 430213547 429689369 429183350 428782616 428101234 427040443 426089020 425359001 424610825
3162.2 424610825 423253517 422039566 421416588 421096268 420359001 419417801 418926048 418499222 418138390
3170.9 418138390 417318687 416225853 415069046 414302979 413698311 412286720 411345978 410542641 409865150
3179.5 409865150 409728851 408887520 407682762 406801872 406319733 405788193 404870224 403799210 402981339
3188.2 402981339 402262459 401507263 400993423 400635185 400483360 399688644 398313332 397429314 396849327
3196.9 396849327 395563011 394340172 394207726 393472137 392686844 392524948 391994743 391118431 390378609
3205.6 390378609 390416145 389763298 388516808 387708588 386951752 386337204 385629120 385324669 385215759 384529266
3215.2 384529266 383391991 382572823 382295074 381995125 381176682 379661827 378766174 378357468 377801208
3223.9 377801208 377316856 376987915 376717377 375731964 374971962 374704857 374118958 373471756 373060951 372193565
3233.5 372193565 371132507 370980415 370140343 369164276 369332047 369306793 368606186 367472801 366643372
3242.2 366643372 366145096 365976334 365347748 364371300 363947334 362963524 362253494 362233009 361985435 361748238
3251.9 361748238 361324005 360186920 358755836 357859154 357421303 356934204 356038055 355668602 355786514
3260.5 355786514 355553169 355060997 354233398 353658562 353463135 353111115 351938248 350912704 350640450
3269.2 350640450 349810295 349225998 349305038 349247932 348688049 347933273 347458801 347126083 346517639 345442276
3278.9 345442276 345039825 344804420 344030685 343282700 342805710 342803116 342515945 342412605 342716179 342433548
3288.5 342433548 341520767 340860023 340389366 339347916 338751831 338524323 338107185 338090401 338314705 338106308
3298.2 338106308 337640915 337339478 336464386 335727081 335930557 335926247 335210686 334603806 334263153 333689842
3307.8 333689842 333200455 332994423 332886620 332176552 331473236 331138000 330511284 330466003 330451469 329906044
3317.4 329906044 329170303 328835945 328920517 328586769 328364716 328134804 327704048 327166252 326829987 326289711
3327.1 326289711 325122833 324492989 324220161 323901138 323276978 322946281 322855988 322349052 321922455 321191063
3336.7 321191063 320881157 320519333 319496460 318884544 318930511 319046307 318520336 317856236 316782436
3345.4 316782436 316062603 316216450 315932693 315154648 314339714 314077663 313765488 313083153 312437630 312117462
3355.1 312117462 311630268 310790329 310886135 310920010 310406246 309795742 308996620 308156185 307437840 307242432
3364.7 307242432 306929092 306625710 306111393 305128479 304500637 304467316 304432888 303714561 302780399 301725788
3374.3 301725788 301477718 301651630 301082230 300382919 299779434 299876804 299620667 298937645 298774891 298509941
3384 298509941 298201656 297668705 297083263 296777267 297053947 297217865 296617393 295996418 295623512 295565510
3393.6 295565510 295348320 295170288 295089397 294686356 294112511 293641605 293553753 293570709 293831387 294014721
3403.3 294014721 293379059 292363834 291948853 292026958 291980591 291694775 291264954 291339054 291621761 291668148
3412.9 291668148 291418228 291266384 291316643 290989780 291042862 291476059 291889191 291314030 290296841 290639458
3422.6 290639458 291129856 291352615 291244965 290735130 290515118 290841198 291068058 290723171 290658913 290973015
3432.2 290973015 291476631 291580868 291600189 291974964 292299328 292531910 292427921 292874374 293602104 293811951
3441.8 293811951 293441486 293631439 294055939 293622589 293935757 293974934 294301357 295339527 295681763 296130447
3451.5 296130447 296557903 297418270 297952061 298051872 298273373 298345127 298760262 299206142 300116463 300719643
3461.1 300719643 301049881 301390743 301799698 302673130 302957211 303292599 303414040 303803501 305100155
3469.8 305100155 305869999 305758495 305514507 306221123 307275505 308047352 308425350 308610134 309124641
3478.5 309124641 310093880 311111183 311574574 311672535 311691360 312568150 313157539 313675747 315128002 315747166
3488.1 315747166 315848274 316128559 317250500 318452816 319103451 320034218 320719948 321384010 321696434
3496.8 321696434 322258644 323194389 324109383 324739838 325071106 326098671 326272354 326256905 327319489
3505.5 327319489 328236809 328865929 330405846 331575966 331018829 331808586 333062325 334271622 335266800
3514.2 335266800 335530243 336263123 336779785 337675400 338481445 339114647 340128517 341184578 342648697
3522.9 342648697 343746262 344395905 344768677 345511856 345992775 346347160 347278900 348248291 349207573
3531.5 349207573 350137825 351795464 352665253 353560257 354510841 354730034 355880470 356438370 357651901
3540.2 357651901 359274559 360596886 361538353 362065811 363180199 363476067 364794617 365511971 366545639
3548.9 366545639 368408432 369660110 371135368 370937500 372194099 373715591 374923439 376520004
3556.6 376520004 376998024 378805084 380311127 380761261 380957413 383229980 385427513 385626373 388384857
3565.3 388384857 388754082 389031029 389930916 389573631 392701454 394671822 396128616 397885437 399539223
3574 399539223 400350075 401042633 403083420 404195862 406250114 407680016 408785133 411169205 412823067
3582.6 412823067 413677711 414575195 418829842 421359215 419551888 420183144 420262642 423436737 426514091
3591.3 426514091 428875084 430183258 430871315 434203110 433980446 434982834 437636909 438172913 439871216
3600 439871216 440909576 443058548 445711937 447253342 449267387 452639618 455444489 454124908 456514359
3608.7 456514359 456928253 456312294 462164917 463164368 461289711 464976425 465891304 469128304 472793465
3617.4 472793465 472562943 472752419 472464218 474348450 477558250 480077934 482305031 484614410 486531906
3626 486531906 488039207 493161545 494655380 486361389 489248810 492733803 496994972 498929100 497625160
3634.7 497625160 499379768 501709862 503723297 504805336 506132545 507910461 509592552 510433540
3642.4 510433540 511308632 513691711 515909805 519913483 518960609 515894356 521046600 520009499 518486214
3651.1 518486214 519604950 523085060 526144638 529174652 532859993 526978340 528014221 532215843
3658.8 532215843 533402596 534777298 535511131 537500458 538946457 540072289 541211166 541589088 544755630
3667.5 544755630 546854973 546463776 546275101 541360092 543597450 549985161 556242371 557726746 544552727
3676.2 544552727 544365349 550664215 555003281 554282837 554306984 556210175 557617378 558807259 559429855
3684.9 559429855 559491310 562891922 569375038 562220383 557183456 563989105 561109619 560621109 564536438
3693.5 564536438 565462189 567177086 567452965 567591743 569038620 569180717 570257454 571817513 568219261
3702.2 568219261 566415749 570813065 572698059 572377853 572542000 574330254 577944756 572870522 574821510
3710.9 574821510 578426514 568326149 570664520 574126129 574849625 575451660 577313232 578557358
3718.6 578557358 575698853 576686630 582265205 579848175 574544296 577921677 578751755 578044930 576019859
3727.3 576019859 576713371 580170898 580470657 584705658 582660484 576458054 583667564 584555321 577165642
3736 577165642 577252579 579342232 579093208 580478935 583095169 580995979 583833313 592838249 584492111
3744.7 584492111 570635567 578442383 583011017 587900810 585711288 575583153 584119225 581481361
3752.4 581481361 576204758 581717224 585483170 588338127 584424171 584622307 588285103 583016167
3760.1 583016167 581277046 584313469 585835953 586221313 588649864 587089653 582970428 584892464
3767.8 584892464 589530945 590001450 582355690 583565903 586362495 586963348 587552414 587124062 588014832
3776.5 588014832 588665962 590674782 590621300 584573479 586213455 588191261 588869400 590563850 587905121
3785.2 587905121 586576805 587439728 587570000 588388596 589075470 589786644 589759102 589689560 589262886 589788017
3794.8 589788017 592546692 590089340 586669769 587944756 591309853 596390457 589976692 581160965
3802.5 581160965 584961891 587904892 591467552 595557747 589382324 586065598 589464455 590261765
3810.2 590261765 589439621 590072250 591158447 592209930 596705017 596540871 584640541 587973747 592379341
3818.9 592379341 595138664 595438614 582110214 584188461 589120178 590824509 592298470 591826134
3826.6 591826134 589097481 589682007 591307755 593900490 594985809 587941360 589691925 594937363
3834.3 594937363 590214310 589874115 596786346 591757355 586258736 592173843 589841805 588381462
3842.1 588381462 593161201 591340103 588149300 590690002 592087784 592111740 593516998 592575226 594225616
3850.7 594225616 599058304 593789711 593727646 582568054 582846375 591417351 591422691 589994125 591832619
3859.4 591832619 593942108 596353569 592023811 590547638 595701408 593233986 588811340 591113548
3867.1 591113548 594456482 598442955 591271248 583912544 587855988 593607597 597125206 589341888
3874.8 589341888 588975410 592044373 591938705 593029938 595767899 592326164 587394066 592057953 593125496
3883.5 593125496 593464584 596408615 586983566 588109169 591571465 592378922 595843697 594806061 587674141
3892.2 587674141 588552933 591511612 591343651 592350616 592521858 594513512 596584930 588240204 590958519
3900.9 590958519 592007828 587311249 590740471 589130096 588687248 590073471 590878525 592085495 591489754
3909.6 591489754 591158867 591216660 591847458 591985016 591427803 591739769 593372879 591755524 588967590
3918.2 588967590 592807808 593102379 589557533 590983963 591288376 591230507 589833412 587910080 589487038
3926.9 589487038 591363678 592790642 591960449 591411781 592444229 590137596 588817444 590046082 590127144
3935.6 590127144 590158234 591004791 591058617 590726852 590306740 591198196 591895447 588099213 587775116 589513779
3945.2 589513779 589886818 590638924 589659882 590699310 590381737 587558098 589092331 590515327 590451622
3953.9 590451622 590031166 590004730 590639610 589786797 589186745 588917847 589417305 589972916 588930550 589210281
3963.6 589210281 590093575 590085716 590016899 589972343 590162392 589771576 588842392 588700409 588746681 589025574
3973.2 589025574 589532700 589501991 589436798 589541130 589688911 589237671 588566284 588652725 589127121 589164848
3982.8 589164848 588619881 588943748 589475670 589268837 589224892 589365540 589469261 589252014 588595390 587640343
3992.5 587640343 587951698 589051666 588529434 587907524 588163185 588206215 588145447 588342171
4000.2 588342171
##END=$$ End of the data block
