##TITLE=$$ Begin of the data block
##JCAMP-DX=5.00 $$ ACD/SpecManager v 10.08
##SPECTROMETER/DATA SYSTEM=Varian
##DATE=04 Dec 2012 14:00:44
##DATA TYPE=INFRARED SPECTRUM
##DATA CLASS=XYDATA
##ORIGIN=
##OWNER=
##NPOINTS=3735
##FIRSTX=399.26403809
##LASTX=4000.35498047
##MAXX=4000.35498047
##MINX=399.26403809
##MAXY=70.33873749
##MINY=29.28941727
##XFACTOR=1.0000000000
##YFACTOR=0.000000100000000
##FIRSTY=53.93047333
##DELTAX=0.96440572
##XUNITS=1/CM
##YUNITS=TRANSMITTANCE
##XYDATA=(X++(Y..Y))
399.3E39304733J609535J2812157m862404k124519L034973k258949m224320M226418
407E47517624o94046q756981j105080K728768K028541M640618J67160m158593l488082
415.7E38879929J191253R850464p92351j3228798J204186k38953n57480o04400K578125
424.3E38281975m50249K257652L445549l083076l052521j400986N7373j605873j084442
433E33365402n06592m95N4283q54416K749481k364082j344262M206696L104935q85735
442.7E37525215o899299k193490p7056r80988K865753M583168K439690j605301L37791
451.3E35995483J796608K225685l550529n842323k010880l840599R82857O421852K414627
460E34592781k319031r10721M887238L148155q44230m696274m030838m208908m791565
$$ plain form
399.3 539304733 540914268 553726425 548864021 546739502 549774475 547515526 543291206 547517624
407 547517624 546823578 538066597 536961517 539690285 541718826 546359444 546526604 542368011 538879929
415.7 538879929 540071182 549921646 549129295 535900497 537104683 536865730 536308250 535703850 538281975
424.3 538281975 537831726 540089378 543534927 540451851 537399330 535998344 536055717 534449844 533365402
433 533365402 532858810 532858315 532912598 532058182 534807663 532443581 531099319 535306015 538410950 537525215
442.7 537525215 530625916 528432426 528355370 527374382 530240135 534823303 537262993 535657692 535995483
451.3 535995483 537792091 540017776 536467247 530624924 528614044 524773445 525756302 532178154 534592781
460 534592781 532273750 531363029 536250267 539398422 538554192 533857918 529827080 525618172 520826607
468.7E20826607j254196O964492N059243l465882N196572j028099m985695m645539
476.4E22667503p019271R11483K951775J270027j066360j256142K196464N222092M019737
485.1E29897308m210205l610763m645729n158539k32201j412239K004395K608452O08787
493.8E15849266J639748J764908p7134k421417p21016o24580j905365n451012m613991
502.5E03439407K728157J257096M58374N14641L9901k025146j330681k45132l560601
511.1E01276016k496147l43666O54984R30709J37520o06575j523208l68996j483917
519.8D96176720k397766k740632k673606j884270j211929J86119J01165K930947K032814
528.5D90519562n41611Q34541J162835J102561j742820l816910j206093N7945J730767
$$ plain form
468.7 520826607 519572411 526536903 531596146 528130264 533326836 532298737 527313042 522667503
476.4 522667503 515648232 516559715 519511490 520781517 519715157 518459015 520655479 525877571 529897308
485.1 529897308 525687103 522076340 517430611 512272072 512039871 510627632 512632027 515240479 515849266
493.8 515849266 517489014 519253922 519176788 516755371 516034355 515409775 513504410 508053398 503439407
502.5 503439407 506167564 507424660 507883034 508397675 508437576 506412430 505081749 504836617 501276016
511.1 501276016 498779869 498436203 499091187 500021896 500159416 499552841 498029633 497660637 496176720
519.8 496176720 493778954 491038322 488364716 486480446 485268517 485454636 485555801 488486748 490519562
528.5 490519562 489977951 490812492 491975327 493077888 491335068 487518158 486312065 486370010 488100777
537.2D88100777M689941M198761J866760K668953J373902n148316l809509K384376
544.9D96325645J44463j158714J554489J015129k73972O45714L083534J494980m36248
553.6E02395020n27268k264709k874527k807122k111778j01356J198158J378059J150360
562.3D95434837R18465R8839j349259l341560m469299l978691k478333j387100j856232
570.9D77591667j07422J073914O90193P29561L05061J38970r03321j517563r61685
579.6D77039375m53033O13747L017158K769547J940498M081421L976059K670593N59921
588.3D96215286r80987j851158j277581j83868O25305J464539p30019J157990L232307
597D97671814J992798J714020r63517j552276j672669k399521j203651l81012P26280
$$ plain form
537.2 488100777 492790718 496989479 498856239 501525192 502899094 497750778 493941269 496325645
544.9 496325645 496470108 495311394 496865883 497881012 497607040 498252754 501336288 502831268 502395020
553.6 502395020 501867752 499603043 496728516 493921394 491809616 491708260 492906418 494284477 495434837
562.3 495434837 496353302 496452141 495102882 491761322 487292023 483313332 480834999 479447899 477591667
570.9 477591667 477484245 478558159 479248352 479977913 480282974 480421944 479518623 478001060 477039375
579.6 477039375 476586342 477200089 480217247 482986794 484927292 489008713 492984772 495655365 496215286
588.3 496215286 495234299 493383141 492105560 491921692 492546997 494011536 493281517 494439507 497671814
597 497671814 499664612 501378632 500415115 498862839 497190170 494790649 493586998 493205986 493932266
605.6D93932266J569863K626381K658920J571426l18489j642609j674079j260109j051140
614.3D96412430j156349J167564L009300L130913L107681L349533K542420P23724R19190
623E13206406K28653o67916j333999m06647J210174K074089L986817M032326L143119
631.7E25473022O46668l50685K44522j527176j044083N7259M96902J61515Q09364K120857
641.3E27088165J497765K488403J904831O07758N94864n55840k173996l370018j174126
650E26907806J710244J374588K060470M405747K690391o98623r95522j319237k509613
658.7E33626251j913185o18744R3842L77273J372719K252617K153244K687645L161888
667.4E43193550j881218k180786j915779j864662n85785o86035R28230J942825K027359
$$ plain form
605.6 493932266 495502129 498128510 500787430 502358856 502040367 500397758 498723679 497463570 496412430
614.3 496412430 495256081 496423645 499432945 502563858 505671539 509021072 511563492 512287216 513206406
623 513206406 513435059 512767143 511433144 511026497 512236671 514310760 518297577 522329903 525473022
631.7 525473022 526119690 525769005 526013527 524486351 523442268 523499527 523996429 524157944 524967308 527088165
641.3 527088165 528585930 531074333 532979164 533586922 534181786 533625946 531451950 528081932 526907806
650 526907806 528618050 529992638 532053108 536458855 539149246 538450623 537455101 536135864 533626251
658.7 533626251 531713066 531094322 531188164 531565437 532938156 535190773 537344017 540031662 543193550
667.4 543193550 541312332 539131546 537215767 535351105 534765320 534079285 535007515 536950340 538977699
676.1E38977699K098656K102737J733704q70209k678032j870384j154022q90198L30162
684.7E37780113N31883P93076K752686K817688J510429m616j371307j000405r99488
693.4E42810059k814217l143463p83386J190948Q92868J079979K070084N37224j357232
702.1E40482864k033348k663116k421913j692658q72993k77519L33824J335792J854286
710.8E34045219J884766J535187O87980j77269j74446n77545j352310j126595Q37822
719.5E35582809K543946J978035L203048L850594K450295J906776R82742R88198N31005
728.1E54017448J74141N37033R01413K724648L960266L676491K606430J477013j3237
736.8E70061646o20766J81122K70195n57595J66817R93157L82919J657371K518425
$$ plain form
676.1 538977699 541076355 543179092 544912796 544042587 541364555 539494171 538340149 537449951 537780113
684.7 537780113 538311996 539105072 541857758 544675446 546185875 546181259 544809952 543809547 542810059
693.4 542810059 539995842 536852379 536068993 537259941 538152809 539232788 541302872 541840096 540482864
702.1 540482864 538449516 535786400 533364487 531671829 530798836 530521317 530855141 532190933 534045219
710.8 534045219 535929985 537465172 538153152 537975883 537801437 537223892 535871582 534744987 535582809
719.5 535582809 538126755 540104790 543307838 547158432 549608727 551515503 552498245 553486443 554017448
728.1 554017448 554191589 554728622 555630035 558354683 562314949 565991440 568597870 570074883 570061646
736.8 570061646 569440880 569622002 569892197 569334602 569501419 570494576 570877495 572534866 575053291
745.5E75053291J273308q89015q29239p1564k695923k486610j755562j958847k47688
754.2E65392151O17409N49240L24287M1466j866531j669465n2681p74002r91973j066628
763.8E60503273m36821Q53081K026596K248459J655769J718636J936416K243691J131820
772.5E73880920Q56629R10988Q72192J527100K014007K964478K028503K115860K522888
781.2E89693565K324982K061729o8321m23889M62151M03671K12135K000618J715508
789.9E98382149P24411K260055J707764J097679L14598R8572r4910R22356J554146
798.5F06966820o21491J625481K688599J835632J393623O99501J799050Q95233N38292
807.2F17820740J38664P9956J324539R64012N68962J261254J318397M90761J174660
$$ plain form
745.5 575053291 576326599 575437584 574608345 574536781 571840858 569354248 567598686 565639839 565392151
754.2 565392151 566009560 566558800 566883087 566924553 565058022 563388557 563335876 562561874 561569901 560503273
763.8 560503273 560066452 560919533 562946129 565194588 566850357 568568993 570505409 572749100 573880920
772.5 573880920 574737549 575648537 576520729 578047829 580061836 583026314 585054817 587170677 589693565
781.2 589693565 592018547 594080276 594011955 593588066 594050217 594453888 594666023 596666641 598382149
789.9 598382149 599106560 601366615 603074379 604172058 604486656 604585228 604490318 605412674 606966820
798.5 606966820 606345329 607970810 610659409 612495041 613888664 614588165 616387215 617282448 617820740
807.2 617820740 617959404 618039360 619363899 620327911 620896873 622158127 623476524 623967285 625141945
815.9F25141945J71394j212692o91834K22550N18608q73604j100044q64983P3433N29137
825.5F21913910o25649j177368k131729k330475j407966n99366j053314j832695j522560
834.2F09232788r77859p57218j175270j673813j782799j168594q70209r73663j055679
842.9E98797684j136627j164437j555137o81420m46129q15506K02065j15128o06346
851.6E92479019m36516n68390J20087O12984O0348l00483j90621m67644n46836L17573
861.2E91079521R78241J395569J959572J601524J982727K648545K214241K589416K155457
869.9F08604813J757125K210427K267608K019806J647492J936950J025620J084404
877.6F22554245J245003M35524L94859o44722j339111j496048j923790k489548j158485
$$ plain form
815.9 625141945 625313339 624100647 623408813 623631363 624149971 623276367 622176323 621311340 621384773 621913910
825.5 621913910 621288261 620110893 617979164 615648689 614240723 613641357 612588043 610755348 609232788
834.2 609232788 608254929 607497711 606322441 604648628 602865829 601697235 600827026 599853363 598797684
842.9 598797684 597661057 596496620 594941483 594260063 593813934 592998428 593200493 593085365 592479019
851.6 592479019 592042503 591474113 591594200 592207184 592267532 591967049 591776428 591308784 590761948 591079521
861.2 591079521 592057762 593453331 595412903 597014427 598997154 601645699 603859940 606449356 608604813
869.9 608604813 610361938 612572365 614839973 616859779 618507271 620444221 621469841 622554245
877.6 622554245 623799248 624234772 624629631 623984909 622645798 621149750 619225960 616736412 615577927
886.3F15577927m65584j187477q68492j468087j498413j335220j489792k313461k823487
895F02127914k233657k096024j075211q85238l27606M36897l85628r42573j965218
903.7E92653656k989464l451805k869110k398987k502594j503830p16476j217423j995849
912.3E73008118k732926k900696k661666l221512l338127l266526k893142j948471
920E50045052j500054j130562q89702k67219j63879r90525j377792j038628r24377
928.7E41762314j119118l45802R804M97360K001343K056045J156540O59752M05350
937.4E47083588P59544O17676k56005K08397P94068L21502J159287J890297J322327
946.1E53900681P56797M81873J25961k131920l445701k231560k321816l367195l250923
$$ plain form
886.3 615577927 615112343 613924866 613056374 611588287 610089874 608754654 607264862 604951401 602127914
895 602127914 599894257 597798233 596723022 595837784 595510178 595947075 595561447 594618874 592653656
903.7 592653656 589664192 586212387 583343277 580944290 578441696 576937866 576221390 575003967 573008118
912.3 573008118 570275192 567374496 564712830 561491318 558153191 554886665 551993523 550045052
920 550045052 548544998 547414436 546524734 546257515 546093636 545103111 543725319 542686691 541762314
928.7 541762314 540643196 540297394 540307198 540804558 542805901 544861946 546018486 546678238 547083588
937.4 547083588 547843132 548460808 548204803 548413200 549207268 549528770 550688057 552578354 553900681
946.1 553900681 554657478 555139351 555265312 553133392 549687691 547456131 545134315 541767120 538516197
954.8E38516197k871513j951256j807098l020478k948379l276711m369354m666862
962.5E13604546n147248n573539m854737m604759m753838m131546m436302n056991
970.2D75045586o282502o420250o714630p894325p191467o880112o420631o452790
977.9D20788879n751724n779419o433105n740776o206589n940514n520019m527664
985.6C74889069m744034m667359m342079m007339j920777k076530j638908j474610
993.3C50017433q36563j280022j301307k70157j936875m58488L02887K55279K2698
1002C44514885L24287Q47474k4453P58019p62978p45239j482010k162323j186752k080879
1011.7C38000031r47228j121483p93915o13937j84288J55563r91058r85413j119842
$$ plain form
954.8 538516197 535644684 533693428 531886330 528865852 525917473 522640762 518271408 513604546
962.5 513604546 508457298 502883759 498029022 493424263 488670425 484538879 480102577 475045586
970.2 475045586 468763084 462342834 455628204 447733879 440542412 433662300 427241669 420788879
977.9 420788879 415037155 409257736 402824631 397083855 390877266 384936752 379416733 374889069
985.6 374889069 370145035 365477676 361135597 357128258 355207481 353130951 351492043 350017433
993.3 350017433 349180870 347900848 346599541 346329384 344392509 343934021 344236908 344492187 344514885
1002 344514885 344839172 345686646 345662193 346420212 345657234 344911995 343429985 341267662 340080910 338000031
1011.7 338000031 337052803 335931320 335137405 334523468 334339180 334494743 333503685 332518272 331398430
1020.3C31398430o29540j317024j24016L5401L07541J413650N57747J457672K67601
1029C33367462N63126M4822j75399N22003k15721O18362j014786Q011R53141J158714
1038.7C35829735R13544k04697L00674p76062R7542l39317n37338o24428L12118J379929
1048.3C36351700n0736J146431R25141K395057J532250N66597J515846P86743J614914
1057C46783943J120033L154870K564773K713204L773307K821579L773613L114624L828011
1065.7C73647957K202072J736336Q33359p41349p03697k944641j949387k824630l342553
1074.4C65913467l443298k830391j179008k205811r85031j791191n87196j75286P72438
1083C53488693K289429J311798K850761K041016K151184J205788J586571J866684J420822
$$ plain form
1020.3 331398430 330768890 329451866 329327850 329363251 329670792 331084442 331642189 333099861 333367462
1029 333367462 333930588 333975410 333800011 334322014 334106293 334724655 333709869 333717880 334671021 335829735
1038.7 335829735 336743279 336538582 336839256 336063194 336160736 335821419 335284081 334659653 334971771 336351700
1048.3 336351700 336300964 337447395 338372536 340767593 342299843 342866440 344382286 345169029 346783943
1057 346783943 347903976 351058846 353623619 356336823 360110130 362931709 366705322 369819946 373647957
1065.7 373647957 375850029 377586365 378419724 377678375 376974678 374030037 372080650 369256020 365913467
1074.4 365913467 362470169 359639778 358460770 356254959 355269928 353478737 352891541 352716255 353488693
1083 353488693 355778122 357089920 359940681 361981697 364132881 365338669 366925240 368791924 370212746
1091.7C70212746K745323J353378K055550J319389K061386J804123L39127J419258
1099.4C83310280Q31451J355286k22321n47905p34748L9939J802445J057625J595039
1108.1C88487091P76062J962891K330398K131310Q58803r39217Q81653M91905K95830
1116.8C97276726L82652J715736J865883J224633J884727Q83560J211395N16739R60045
1125.5D07922096N53170K72865J468086Q60558J286621J206360K005653J069908J52054
1134.1D16797371j78528j119156j372375k888298j710129j529312j558075j569443
1141.9D04872055k122192j798439k315255r61532k002678j966820k541046l252830
1149.6C87911263j934662k402039r73473j501655m89922J80970J78833R7122p72324
$$ plain form
1091.7 370212746 372958069 374311447 376366997 377686386 379747772 381551895 381891022 383310280
1099.4 383310280 384141731 385497017 385274696 384726791 383992043 384031982 385834427 386892052 388487091
1108.1 388487091 389263153 391226044 393556442 395687752 396546555 395607338 396488991 396980896 397276726
1116.8 397276726 397659378 399375114 401240997 402465630 404350357 405233917 406445312 406962051 407922096
1125.5 407922096 408475266 408748131 410216217 411076775 412363396 413569756 415575409 416645317 416797371
1134.1 416797371 416618843 415499687 414127312 411239014 409528885 407999573 406441498 404872055
1141.9 404872055 402749863 400951424 398636169 397674637 395671959 393705139 391164093 387911263
1149.6 387911263 385976601 383574562 382601089 381099434 380609512 380790482 380969315 381066437 380294113
1158.3C80294113J003533J36184J193810J032142J314469K517280J965142L566169
1166C93022842L494912M827842M356118M246940M411621L564453M751816M287682M368782
1174.6D31333008L945999M634819N023460M983635N421753M223671M619599M133300
1182.4D68319244K914887K757759L185196K774200K022400K714462L034401L198433
1190.1D90920982K627945K224922J602326O67953J044083R81560M70199m0474j89552
1198.8E00309944L55339J133576J097641R14650J523628J204567M45671q2436Q8196
1207.4E06990776p5111j91613P57714P71332Q68110J423950J894303J986503J843682
1216.1E16269646J076049k56767m88167l38859m79317r84611n48020K27089j30691
$$ plain form
1158.3 380294113 381297646 381433830 382627640 383659782 384974251 387491531 389456673 393022842
1166 393022842 396517754 401345596 405701714 409948654 414360275 417924728 422676544 426964226 431333008
1174.6 431333008 435279007 439913826 444937286 449920921 455342674 459566345 464185944 468319244
1182.4 468319244 471234131 473991890 477177086 479951286 481973686 484688148 487722549 490920982
1190.1 490920982 493548927 495773849 497376175 498044128 499088211 500069771 500539970 500499496 500309944
1198.8 500309944 500665283 501798859 502896500 503811150 505334778 506539345 506985016 506902580 506990776
1207.4 506990776 506915665 506724052 507481766 508253098 509121208 510545158 512439461 514425964 516269646
1216.1 516269646 517345695 517088928 516600761 516261902 515782585 514797974 514249954 514477043 514346352
1224.8E14346352J45263R4338m35753r29337j170158j445961k025566j382523r01413
1233.5E06295242p84454p11441j08223N68085k6284j23558L58467K87972n38216l07388
1243.1E04910202O7902j33477m9286J27678J665459K572594K270431J494103J046562
1251.8E13972168J017303M12217p3815k98958O5461M78363J057548J336937J191406
1260.5E19158630J735001J673088J228333P83958M43268k99912p80334j47019K56882
1269.2E24051895J224251J789017J480941J704064J489487Q82873M18015l8491k36473
1277.8E32765579n95398m72297L22685P65381Q09784J132240J659698J305161Q62427
1286.5E38555260N74302l19442o42929o54602l34816o8436o2103K76184O50367Q33283
$$ plain form
1224.8 514346352 514491615 514585953 514150200 513220863 512050705 510604744 508579178 507196655 506295242
1233.5 506295242 505510788 504799347 504691124 505259209 505232925 505109367 505467834 505755806 505217590 504910202
1243.1 504910202 504978104 504844627 504795341 504923019 506588478 509161072 511431503 512925606 513972168
1251.8 513972168 514989471 515401688 515327873 515028915 515094376 515572739 516630287 517967224 519158630
1260.5 519158630 520893631 522566719 523795052 524579010 525022278 524722366 523942032 523795013 524051895
1269.2 524051895 525276146 527065163 528546104 530250168 531739655 532622528 533040543 533002052 532765579
1277.8 532765579 532170181 531697884 532020569 532785950 533595734 534727974 536387672 537692833 538555260
1286.5 538555260 539129562 538810120 538167191 537512589 537177773 537109337 537047234 537323418 537973785 538807068
1296.2E38807068O59752L29780k77023q34503j297913j137771q76885j077423k74277
1304.8E34020805O99273J267166J156883L62205J16692m27475r14497j295014j427994
1313.5E33558044j245842r39750j57242K75574M82025N99823L99856r4413o57807r22775
1323.2E31297493j385155j482658j457520j139869j47820J91727K71873p7820l47480
1331.8E25722771l98674q77457j175346j337700j235466j200562r38797m77905J64413
1340.5E18245277J519890J450653Q54149J13602l56941m07830n50727j179734j466217
1349.2E18222122l46718J52054L00522N76134M65889L22761j82228m04358r13620j353187
1358.8E16839371j169205j440048j186562r93156p42150Q06389Q49266l18641l33138
$$ plain form
1296.2 538807068 539466820 539796600 539519577 538685074 537387161 536249390 535372505 534295082 534020805
1304.8 534020805 534720078 535987244 537144127 537506332 537623024 537195549 536281052 534986038 533558044
1313.5 533558044 532312202 531372452 531215210 531490784 531972809 532572632 532972488 532878075 532220268 531297493
1323.2 531297493 529912338 528429680 526972160 525832291 525684471 525876198 526148071 526070251 525722771
1331.8 525722771 525324097 524446640 523271294 521933594 520698128 519497566 518558769 518080864 518245277
1340.5 518245277 519765167 521215820 522069969 522183571 521826630 521418800 520868073 519688339 518222122
1349.2 518222122 517875404 518027458 518327980 518904114 519370003 519692764 519510536 519106178 518192558 516839371
1358.8 516839371 515670166 514230118 513043556 512050400 511308250 512114639 512963905 512645264 512312126
1367.5E12312126n66292j055755q94814j214332m05045l97377p31583m15039K95487
1376.2E06927376Q57467J74256P83920O73866M8180J9493J08719O49681O93703J339187
1385.8E12275848J773262J846276J853523J989250R34830K42996M98734N1002j521301
1394.5E19944420k378693K94533N96771j35536k47803R43718J197853j69334K5101
1403.2E20071030L0136j531334o58302K58102n91736o63566N25627L40538J3733k38724
1412.8E17555504m34265r05266j221275q75435o82144P0953j977501J113815K445793
1421.5E15090179J213685J027755J84670R26361O05049n34134n1613m33693j430244
1430.2E16598015p38068O99616K23236L91426O25915o24923l271180m39949J698723
$$ plain form
1367.5 512312126 511745834 510690079 509795265 508580933 508175888 507778511 507046928 506631889 506927376
1376.2 506927376 507784843 507959099 508743019 509416885 509465065 509484558 509593277 510242958 510936661 512275848
1385.8 512275848 514049110 515895386 517748909 519738159 520672989 520915985 521414719 521465721 519944420
1394.5 519944420 517565727 517860260 518457031 518321495 518073692 519017410 520215263 520045929 520071030
1403.2 520071030 520101166 518569832 517911530 518169632 517577896 516914330 517439957 517780495 517794228 517555504
1412.8 517555504 517121239 516215973 514994698 514119263 513437119 513508072 511530571 512644386 515090179
1421.5 515090179 516303864 517331619 517516289 518442650 519047699 518513565 518461952 518028259 516598015
1430.2 516598015 515859947 516559563 516782799 517174225 517800140 517175217 513904037 513464088 515162811
1438.9E15162811j80778o11649n44052p77130J92184J26267Q73871J20468o22902j758728
1448.5E11980362m09126k25983j824837j639747k339478p29942j247864o15196j931153
1457.2E01017036l603935L807335O15654J697960J15509M23965J301079j807098J467476
1465.9E05034981J343956M734573N257340O856041P203903N396347O710434M264641
1473.6E46802216P241020M026871L485221M253655M054298M062805K342301K544594
1481.3E78812981J694221K195168J619682J232834J543045K26173J095391R83848k45056
1490E89158287l37181K199707J630783l40385L6392p69425l245697J057167K14730
1498.7E89604378j053696R69315k09351j146927j60179M40445J58577p040291o430168
$$ plain form
1438.9 515162811 514982033 514370384 513826332 513049202 513241386 513367653 514241524 514361992 513739090 511980362
1448.5 511980362 511571236 511345253 509520416 507880669 505541191 504811249 503563385 502948189 501017036
1457.2 501017036 497413101 501220436 501836090 503534050 503649559 504073524 505374603 503567505 505034981
1465.9 505034981 506378937 511113510 516370850 523226891 530430794 535827141 542537575 546802216
1473.6 546802216 554043236 558070107 561555328 565808983 569863281 573926086 576268387 578812981
1481.3 578812981 580507202 582702370 584322052 585554886 587097931 587324104 588419495 589403343 589158287
1490 589158287 588821106 591020813 592651596 592311211 592347603 591578178 588332481 589389648 589604378
1498.7 589604378 588550682 589519997 589310646 588163719 588003540 588443985 588602562 581562271 575132103
1507.3E75132103J541290P62902k79694M54140q77953j899643J86386j100921j610718
1516E72307892k598915k815018K351112J868363o93588k436867o21224K145996J954461
1524.7E71462212j633530j429672r4719k044907l63579P92351j70326j62811k271691
1533.4E64083328k476463K331428J347924N03731R54055k187614o810761J625901k41776
1542.1E59129753o7558K505607J087189k17399J611442J782189J087379k8305m99229
1550.7E66391068J247749J133842O38428l68576K195358M464455K589722l676453k191277
1559.4E72424316K470551N457611K660103J459160K30980J67999J864509K255860K235603
1568.1E91226692L06168j281662K231979J874314J49879K45171R98306r9373l895760
$$ plain form
1507.3 575132103 576673393 577436295 577156601 577610741 576732788 574833145 575019531 573918610 572307892
1516 572307892 569708977 566893959 569245071 571113434 570419846 567982979 567361755 569507751 571462212
1524.7 571462212 569828682 568399010 568304291 566259384 565895805 566688156 566517830 566355019 564083328
1533.4 564083328 561606865 563938293 565286217 565789948 566744003 564556389 557745628 559371529 559129753
1542.1 559129753 559062195 561567802 562654991 562437592 564049034 565831223 566918602 566890297 566391068
1550.7 566391068 567638817 568772659 569411087 569042511 571237869 575702324 578292046 574615593 572424316
1559.4 572424316 574894867 580352478 583012581 584471741 584702721 584870720 586735229 588991089 591226692
1568.1 591226692 591532860 590251198 592483177 594357491 594507370 594752541 595750847 595651474 591755714
1576.8E91755714J316719K178307P22923J022148M60320J61476J8044j095162j520920
1585.5E95019569j874275r61494q93517l60145j69564k10266l17878p62711r05151
1594.1E88564568k239571j789513k055473k115212k274703j865654r89495j263809
1601.9E73971138r96590j807594j378670j678428k797242l669586k887115k948952
1609.6E55806961l554497j926040k619400j548195k215882j643066k412567r102287
1617.3E30785027k6551j999244k938538l512573k096482l454666o845321m67377j389618
1626E08054657j197739m735717l629532j879959l090172k521286l516846q16803j127739
1634.6D85538864n011139l989067j76124q965o84509K43110j964988j066056k345008
$$ plain form
1576.8 591755714 593072433 595250740 595973663 596995811 597456131 597617607 597635651 596540489 595019569
1585.5 595019569 593145294 592183800 591290283 590930138 590760574 590550308 590232430 589469719 588564568
1594.1 588564568 586324997 584535484 582480011 580364799 578090096 576224442 575234947 573971138
1601.9 573971138 572974548 571166954 569788284 568109856 565312614 561643028 558755913 555806961
1609.6 555806961 552252464 550326424 547707024 546158829 543942947 542299881 539887314 530785027
1617.3 530785027 530758476 528759232 525820694 522308121 520211639 516756973 509911652 509444275 508054657
1626 508054657 506856918 502121201 498491669 496611710 493521538 491000252 487483406 486666603 485538864
1634.6 485538864 480527725 476538658 476362534 476353569 475669060 475912170 473947182 472881126 470536118
1643.3D70536118l54729O8054l838959j14q02651K748299R04503K350845K324219o969795
1653D66965790m577179J976929L726654R17167J560211J313706J887817K423973K070961
1661.6D78266029K929039M12140K698441J292648J541824J963006J533165J640548
1669.4D92276840P83348M186058K335816L515625L332443R97353J153335K699890L198815
1678E14479523J529121K178307J644134L374100L970070M6654J011047L712578N306473
1686.7E37252007K755813J648827K472572J566200K688370K613182L285103L852119
1694.4E58134193L581047o1149L779030M986458M330253p34787m567337N882683L771171
1703.1E79101562K482758J373177J218719J441345K175103K566413M92173n11475N91583
$$ plain form
1643.3 470536118 470181389 470249443 466410484 466410370 465607719 468356018 469260521 471611366 473935585 466965790
1653 466965790 462388611 464365540 468092194 469009361 470569572 471883278 473771095 476195068 478266029
1661.6 478266029 481195068 481607208 484305649 485598297 487140121 489103127 490636292 492276840
1669.4 492276840 493060188 497246246 499582062 503097687 506430130 507427483 508580818 511280708 514479523
1678 514479523 516008644 518186951 519831085 523205185 527175255 527221909 528232956 531945534 537252007
1686.7 537252007 540007820 541656647 544129219 545695419 548383789 550996971 554282074 558134193
1694.4 558134193 561715240 561654091 565433121 570419579 574749832 574015045 569447708 575330391 579101562
1703.1 579101562 581584320 582957497 584176216 585617561 587792664 590359077 590851250 590339775 590931358
1711.8E90931358R37729N99442j011696l86315K066079J031952j583329M366074K962685
1720.5E99913979P67440m01001j668548j611633n84984q92945j629867j041832q39043
1729.1E92011566l722534l650856o06384q92220q857536j4279251j171379l049469
1736.9E55781937n414925m074974o870651q539467k407761k300834o021920k381019
1744.6E17770386l77159O00052J529884L359108N993423N584450J0204735R634704
1752.3E54299583J0880623J0961151J0494843J0124817Q473511R786071P248307P062111
1760F29331017O132202M406395N309295N098954N183258L836441L469162K165985J19323
1768.7F65052032K381821K540817K57645k140350R14535L716431K209396O13556K273865
$$ plain form
1711.8 590931358 591869087 592468529 591456833 591070518 593136597 594168549 592585220 596951294 599913979
1720.5 599913979 600681419 600280418 598611870 597000237 596415253 595522308 593892441 592850609 592011566
1729.1 592011566 588289032 584638176 584031792 583139572 574282036 560002785 558831406 555781937
1736.9 555781937 550367012 546292038 539421387 530881920 528474159 526173325 520151405 517770386
1744.6 517770386 517393227 517993279 519523163 522882271 528875694 534460144 544664879 554299583
1752.3 554299583 565180206 576141357 586636200 596761017 605234528 615020599 622268906 629331017
1760 629331017 635463219 639869614 645178909 650277863 655461121 659297562 662766724 664932709 665052032
1768.7 665052032 667433853 669974670 670232315 668091965 669006500 672722931 674932327 675545883 677819748
1777.4F77819748J478424J049805Q05587j444091q7052R33609J360245M64096N29175
1786F82909546J904297Q95920O65741R75036L63388K93579k281112p37000J884308
1794.7F86873703M17099j55945J516419K026443O50787k39486J260681l18832n50080
1803.4F91480789N98602j57241J81198J8234j57165J040039Q80355j94931Q08716J094284
1813F95592880L87879J2436l96500J74179j28326J9989L38668K24762R97010M53720
1822.7F97676697Q91037L51410k628632J53046J676941Q38394j155548k619858J473541
1831.4F96657028J850205M39071O87714P11060J42669m92706m93851L53852K6016o3858
1841F99817200j97144Q85468j89972l449631K153168K039566k09503l78571L67355
$$ plain form
1777.4 677819748 679298172 680347977 681153564 679709473 679622421 680556030 681916275 682380371 682909546
1786 682909546 684813843 685709763 686375504 687350540 687713928 688007507 685726395 684989395 686873703
1794.7 686873703 687290802 687134857 688651276 690677719 691328506 691089020 692349701 692030869 691480789
1803.4 691480789 692079391 691922150 692103348 692121582 691964417 693004456 693884811 693689880 694498596 695592880
1813 695592880 695980759 695993195 695596695 695770874 695642548 695662537 696001205 696225967 697222977 697676697
1822.7 697676697 698567734 698919144 696290512 696443558 698120499 698958893 697803345 695183487 696657028
1831.4 696657028 698507233 698946304 699634018 700345078 700487747 699995041 699501190 699855042 699881058 699817200
1841 699817200 699620056 700505524 700315552 696865921 699019089 701058655 700849152 700470581 700837936
1849.7G00837936N37339n2796j52282m11454J54496L15704J28860K04926k17438M5777
1859.3G01391068r2164q8424k12860J6174K48184J83334M02527j71051Q774r22012
1869G00763550n95322J076965Q69751M70047l75671m23126J0528M01459m2648k69623
1878.6G01885910L35388J28479J83640M0512O6681l04337k54211N57556J40152K03171
1888.3G02982941n21775j109008O27517N81513N0888L82690k17590m34494M64477K18354
1897.9G03025513J60904r16q3465j7395k24991r6817k27204M51813L99933k16065o9274
1908.5G03102036j42289m03595q6136L11127l76434m9744k1286K17743N04074j861191
1918.2G01194305p4768J331177M26865J72195q60824n53589L78036K69242k23694j56403
$$ plain form
1849.7 700837936 701375275 701322479 701170197 700758743 700913239 701228943 701357803 701562729 701345291 701391068
1859.3 701391068 701298904 701210480 700997620 701013794 701261978 701445312 701847839 701676788 701685562 700763550
1869 700763550 700168228 701245193 702114944 702584991 702209320 701786194 701796722 702198181 702155533 701885910
1878.6 701885910 702221298 702349777 702533417 702573929 702640610 702336273 702082062 702639618 702779770 702982941
1888.3 702982941 702461166 701352158 701979675 702561188 702612076 702994766 702777176 702342682 702807159 703025513
1897.9 703025513 703186417 703185501 703102036 703084641 702859650 702762833 702535629 702987442 703387375 703171310 703102036
1908.5 703102036 702959747 702556152 702470016 702781143 702404709 702354965 702333679 702551422 703055496 701194305
1918.2 701194305 701119537 702450714 702877579 703049774 702188950 701635361 702013397 702282639 702058945 701902542
1927.8G01902542M5242M4861J90735J60751K900l44773q621N4855j9531N0049k29645
1938.4G01849365l35464l586Q63266m26254j285019Q55407N99900m71192l04870Q8196
1948.1G01429749j15281k50778j14517J58615K02942Q7051J78681j0376J20697K2888
1957.7G01709671q2169m0359l20358k20566j3199J21841K7695L0365m7684m88739k83813
1968.3G00392685O39572M96750m87289n34516n06058J45111N14298k823m3487J27105
1978G00741348M65241n3330k88543l34015m16718p2021l25089j84936O332K98920J77459
1988.6G00014648J01929L14636n67855p37992L4256K98920N0506p3394k94495k71301
1998.2F98869858K17819p2784P7819O9428j01166l18985l96805k07672o04934j5946
$$ plain form
1927.8 701902542 701947784 701992645 702183380 702344131 702347031 702002258 701993637 702048492 702028961 702079010 701849365
1938.4 701849365 701513901 701510315 702373581 701947327 700662308 701517715 702117615 701646423 701341553 701429749
1948.1 701429749 701314468 701063690 700949173 701107788 701310730 701397781 701576462 701566086 701686783 701709671
1957.7 701709671 701627502 701587143 701266785 701046219 701033020 701154861 701182556 701212921 701165237 700676498 700392685
1968.3 700392685 701032257 701529007 701041718 700507202 700001144 700146255 700660553 700657730 700614243 700741348
1978 700741348 701206589 701153259 700864716 700530701 700113983 700041962 699716873 699531937 699538269 699837189 700014648
1988.6 700014648 700116577 700431213 699863358 699125366 699159622 699458542 699509048 699435654 699141159 698869858
1998.2 698869858 699087677 699014893 699092712 699162140 699060974 698741989 698345184 698137512 697532578 697516632
2007.8F97516632K63748J39923m0970k32467J48086j64337j75171l32260o11725j59454
2017.5F96352005K00882l64380o84738n875O3248O9885l31497m20151J37635k2278
2027.1F94994736l80020n85251l63465k14080J95007J36337L815K2583m04053k04544
2036.8F93201065n13000m82178l42026k67868K8000o1417M0818j15128M04816p2861
2046.4F91820221l59573L22952k19116l91846l25852P9270q2016o3400J12991l54614
2056.1F90539017L58734M03824l8758k55050k59552q2779j04141k17591k62985L32031
2065.7F90412750r1934k7924L55835J75248K26974j85089k55890n30167k50625r1553
2075.4F89737625k49634L22342L73841K80685K2964n9814l49731m32053O3705L93753
$$ plain form
2007.8 697516632 697780380 697920303 697879333 697646866 697794952 697630615 697455444 697123184 696511459 696352005
2017.5 696352005 696552887 696188507 695503769 695497894 695561142 695631027 695299530 694879379 695017014 694994736
2027.1 694994736 694614716 694029465 693666000 693451920 693646927 693783264 693787079 693809662 693405609 693201065
2036.8 693201065 692688065 692205887 691863861 691595993 691623993 691562576 691603394 691488266 691893082 691820221
2046.4 691820221 691460648 691783600 691564484 691172638 690846786 690926056 690844040 690780640 690893631 690539017
2056.1 690539017 690897751 691301575 691262817 691007767 690748215 690665436 690561295 690343704 690080719 690412750
2065.7 690412750 690320816 690292892 690648727 690823975 691050949 690865860 690609970 690079803 689829178 689737625
2075.4 689737625 689487991 689810333 690184174 690464859 690487823 690428009 690078278 689646225 689709930 690103683
2085F90103683M1275p19680l9139M89502M68140K47802n1193j07574k14310N8517n26809
2095.6F89750214n13688k05612L6545M18244J44042L26081J6708J52283J90964J2817
2105.2F90328598k76566q40301o6986L7002L86353L37296l38212m8446j43967J00937
2114.9F89475708J77002J17874k4719m51965m85993P4082K41394k66266K15759K26212
2124.5F89299088K7236J80817p7820l27759n26504l23715r3689L22876J47247L6774
2134.2F88664551P2708r1705J31073k68403q544J54037M0741j17111m68598r4680p6065
2144.8F87938004M14810K92206j71433J96762Q1101k64054n88989j90201K81525J41754
2154.4F88131485m18091k77023L60794L34701M33045J92642o5002k79084j71356p400
$$ plain form
2085 690103683 690144958 689425278 689386139 689875641 690343781 690591583 690540390 690432816 690218506 690277023 689750214
2095.6 689750214 689236526 689030914 689067459 689485703 689629745 689955826 689972534 690124817 690315781 690328598
2105.2 690328598 690052032 689211731 689144745 689181747 689568100 689905396 689567184 689518738 689374771 689475708
2114.9 689475708 689652710 689770584 689745865 689293900 688807907 688881989 689123383 688857117 689072876 689299088
2124.5 689299088 689326324 689507141 689429321 689101562 688575058 688251343 688157654 688480530 688627777 688664551
2134.2 688664551 688737259 688645554 688776627 688508224 688499680 688653717 688694458 688577347 688108749 688014069 687938004
2144.8 687938004 688352814 688645020 688473587 688670349 688751450 688487396 687898407 687708206 687989731 688131485
2154.4 688131485 687713394 687436371 687797165 688131866 688564911 688757553 688692551 688413467 688242111 688234711
2164.1F88234711k71149J7777K21099L04718J12610K64054L24783r4986k0828j53046
2173.7F88939743K2812J18179o5155j75171l5171L02429M16870M06189O7444J76773
2183.4F90174942o7978k81982j62812k27737J69601R5826N1727K39868P54623P55234
2193F91501312N7450j28327k59857m8904k73285l49808j41068O8665L00446J66015
2202.6F90892639M29077N5924J73492M36173l4943j03989k97165n41839n53513M04435
2212.3F90860291O07147Q0795J69525K56119M25720J4877m4326j34735l81012j13373
2221.9F91741028J4801L1280Q0567L57284L34092L19900m19006m78211L61557j89895
2231.6F92153397j52817m3259q0337K00500M6539J34278J90658J25809j41373j84784
$$ plain form
2164.1 688234711 687963562 687981339 688202438 688507156 688619766 688883820 689208603 689113617 689092789 688939743
2173.7 688939743 688962555 689080734 689015579 688840408 688805237 689107666 689524536 689930725 689998169 690174942
2183.4 690174942 690106964 689824982 689662170 689434433 689604034 689699860 689751587 689991455 690746078 691501312
2193 691501312 691558762 691430435 691170578 691121674 690848389 690498581 690357513 690426178 690726624 690892639
2202.6 690892639 691321716 691377640 691551132 691987305 691952362 691848373 691551208 691009369 690455856 690860291
2212.3 690860291 691467438 691548233 691717758 691973877 692399597 692414474 692370148 692235413 691854401 691741028
2221.9 691741028 691755829 691787109 691867676 692224960 692559052 692878952 692459946 691981735 692343292 692153397
2231.6 692153397 692000580 691957321 691876984 692077484 692124023 692258301 692448959 692574768 692433395 692248611
2241.2F92248611k26821k75269l08380j50528K66189Q088J57165N56259M65317k4719
2250.9F92715912k83051k34146l78113j42746m1198j9074j36032N9281L01971K45361
2260.5F92088165L37143J14212J7548l71704l74604l22265n1193J61667l54767K64740
2270.2F91508942J95846K71301N98374J71280L2348l46221l12348l88260J31989k60392
2279.8F91602859m34494K52839m43955K67410N74265K34756k26516n54886K59552q7509
2289.4F91444321k56882l07388J24740K15760L4027N96847m9362k32239q6517J06811
2299.1F91590118k5558R8038J84021n60227J84403L61709M57001L42636m8370o867
2308.7F92576904k50549M89120l07998P3623O64673n22918J09405J57013m6997O8054
$$ plain form
2241.2 692248611 692021790 691746521 691438141 691287613 691553802 691561890 691719055 692275314 692740631 692715912
2250.9 692715912 692432861 692198715 691820602 691677856 691636658 691617584 691481552 691540833 691842804 692088165
2260.5 692088165 692425308 692539520 692557068 692185364 691810760 691488495 691437302 691598969 691244202 691508942
2270.2 691508942 691704788 691976089 692574463 692745743 692778091 692431870 692119522 691731262 691863251 691602859
2279.8 691602859 691168365 691421204 690977249 691244659 691818924 692053680 691827164 691272278 691531830 691444321
2289.4 691444321 691187439 690880051 691004791 691220551 691254578 691851425 691802063 691569824 691483307 691590118
2299.1 691590118 691564560 691662598 691846619 691286392 691470795 691832504 692289505 692632141 692583771 692576904
2308.7 692576904 692326355 692815475 692507477 692581100 693245773 692722855 692832260 692989273 692942276 693010330
2318.4F93010330O25534Q80280J31302p93381j093674O97098N30701J0223L49350L63236
2328F94710999P38983l31345m95300l01209k51388l73001l33252J158828P44782l03116
2337.7F94964981k89001o55747Q7586O46057k93045K3575J98440j126099r56344j084137
2347.3F91516266j065979O18515J434326M03671K747M90875m3869j17721J338577J462784
2356.9F96040192o40641m9209L74908j180877q93326p82929J43509R90677m80957j812439
2366.6F91708908j045456J73264j17188o17294n57861k34299l43247o06689m80194
2375.3F87879944n34287q81195j052398n88608j51062m28467p37915l32489q0261j45111
2384.9F82948151J29623P2556k27204m47616m05350j93634k51541j72348k63291k84347
$$ plain form
2318.4 693010330 693635864 694516144 694647446 693854065 692760391 693457489 693988190 693998413 694347763 694710999
2328 694710999 695449982 695118637 694623337 694322128 694070740 693697739 693364487 694523315 695268097 694964981
2337.7 694964981 694675980 694020233 694107819 694753876 694460831 694484406 694682846 693556747 692600403 691516266
2347.3 691516266 690450287 691068802 692503128 692906799 692909546 693400421 693356552 693238831 694577408 696040192
2356.9 696040192 695399551 695350342 695725250 694544373 693651047 692868118 693011627 694002304 693521347 691708908
2366.6 691708908 690663452 690836716 690719528 690102234 689544373 689310074 688966827 688360138 687879944
2375.3 687879944 687345657 686464462 685412064 684823456 684672394 684243927 683506012 683173523 683093262 682948151
2384.9 682948151 683077774 683150330 682923126 682475510 682070160 681876526 681624985 681452637 681189346 680904999
2394.6F80904999J49994J18713j22528K04315L58429k4719m14124q46252p26700P0114
2404.2F79672241J27793l60413j67007J58157L17764K7771n07507k54669l52936l77960
2413.8F78283234j78070l57132M2648N6839M1656J40915k2201j831m62952n24063k33002
2424.5F76786041l74527j86157j1444m60587l34701J02157j6937n5618j69296j75476
2434.1F75103455l14331l08228l18832n24903k39105n03311k23847M16031K93808l9520
2443.7F73341217l81851k90222m12293k96631l90472n05753K9755P4615j50604l16925
2453.4F70700836o3247j10322r2544r0103m30603j61515k22015q6517k95410m23966
2463F68724594J29318j06887k38114o7673o2561n34439l24783J16806k12097k34223
$$ plain form
2394.6 680904999 681054993 681173706 681051178 681255493 681613922 681589203 681175079 680328827 679602127 679672241
2404.2 679672241 679800034 679439621 679272614 679430771 679748535 679776306 679268799 679014130 678661194 678283234
2413.8 678283234 678105164 677748032 677790680 677847519 677889175 678030090 678007889 678006058 677543106 677019043 676786041
2424.5 676786041 676411514 676225357 676213913 675753326 675418625 675520782 675503845 675448227 675278931 675103455
2434.1 675103455 674789124 674480896 674162064 673637161 673398056 672894745 672670898 673086929 673380737 673341217
2443.7 673341217 672959366 672669144 672256851 671960220 671569748 671063995 671093750 671168365 671017761 670700836
2453.4 670700836 670637589 670527267 670434723 670344620 669914017 669752502 669530487 669443970 669148560 668724594
2463 668724594 668853912 668747025 668508911 668441238 668378677 667844238 667519455 667636261 667424164 667189941
2472.7F67189941o13861l23791K84271p4692l14636q8654J61973r1629l53928l85285
2482.3F65389709l44619l76511k15073M731R079q5755l2959M57688m0818m86755j99738
2492.9F64078979k99682m44489n58242j01777l5476j75629J06278J4419k40936j66550
2502.6F62176895J45950m6691r9793o17599o72989K10342Q164Q7661K35977p8048k93045
2513.2F61056824k55661o6910k04315k73361n57480k97928o943j28784P248J5182k22091
2523.8F59065781n41916k49939r6054J77231J04064m03289o5461k99682k79083P3318
2533.4F57484970Q2626N0660m28696m34570l49350n31235m21600k55890m81644l00446
2543.1F54414825R9030N0812L00750O2867k67029k63291l29589j67084k98996m95987
$$ plain form
2472.7 667189941 666576080 666252289 666536560 666461868 666147232 666058578 666220551 666128922 665774994 665389709
2482.3 665389709 665045090 664668579 664453506 664458237 664467316 664381561 664348602 664806290 664765472 664278717 664078979
2492.9 664078979 663779297 663334808 662776566 662674789 662639313 662463684 662569962 662584381 662343445 662176895
2502.6 662176895 662322845 662276154 662176361 661558762 660885773 661096115 661104279 661191940 661427917 661349869 661056824
2513.2 661056824 660801163 660734253 660529938 660256577 659699097 659401169 659394226 659265442 659272690 659287872 659065781
2523.8 659065781 658523865 658273926 658177872 658355103 658459167 658055878 657990417 657690735 657411652 657484970
2533.4 657484970 657567596 657618256 657189560 656754990 656405640 655874405 655452805 655196915 654715271 654414825
2543.1 654414825 654513855 654564667 654865417 654928284 654661255 654397964 654068375 653901291 653602295 653106308
2552.7F53106308l68347k33231k82211p477K57034J29776k3498l00522m43726l23867
2562.4F51510239l21885o78710m88663j77841M577J67008k79465J27792J77460m58069
2572F49582443l47671m78516o12183k50854K12631j70822n67169k15149J50757J39999
2581.6F47443466k67334k9297L4104l89481m63638k94724j05285l85208n28718o8283
2591.3F44945602L42865R2469k24915m36935l59726N0583k1286j74714m57305m18015
2600.9F43338623j85165k32239l31192j64642L75823k7923m34036o47354o28968q545
2610.6F41054382j23672m27094n55267l7384P2479l03879k67219n07507j92605l55491
2620.2F38356743q08907o13479l21427j76506k61612O5270j14594n18722j22986L77960
$$ plain form
2552.7 653106308 652737961 652504730 652222519 652215042 652472076 652601852 652578354 652277832 651834106 651510239
2562.4 651510239 651188354 650509644 650020981 649843140 649847717 650014725 649735260 649863052 650040512 649582443
2572 649582443 649234772 648756256 648144073 647893219 648105850 647935028 647367859 647152710 647303467 647443466
2581.6 647443466 647176132 647146835 647180939 646791458 646327820 646033096 645927811 645542603 645013885 644945602
2591.3 644945602 645288467 645380936 645156021 644719086 644359360 644409943 644388657 644213943 643756638 643338623
2600.9 643338623 643153458 642921219 642590027 642425385 642801208 642773285 642339249 641691895 641062927 641054382
2610.6 641054382 640930710 640503616 639948349 639910965 639983444 639679565 639412346 638904839 638712234 638356743
2620.2 638356743 637547836 636934357 636612930 636436424 636174812 636240082 636125488 635606766 635483780 635861740
2629.9F35861740l23791j080323k40860j61514p14073n43938o08330n11169M2191O0310
2639.5F31780243l23677o20423o74552j81199j81617m67034o19735n71289l80402l65639
2649.1F27394676J50147P2593j76925m55818o94352k51922k80304k28424n46341n04379
2658.8F24478951k43493m27742k88734o47087m23279j55983k4757o4469o56471n19485
2668.4F21027451k50283l4752l84483n13267k41356l57819l42751k49977L3799k87590
2678.1F18398972k40555O0920l99208m81453l6468j13907o30188m4098j10893o51016
2687.7F15752106k36702K365j44997o38771l59306m14047n53093m0856j86310k41890
2697.4F12938499k40325j86730l70369k39525J01471j11351l55606n74341j99051l11431
$$ plain form
2629.9 635861740 635537949 634457626 634216766 634055252 633341179 632797241 632188911 631677742 631719933 631780243
2639.5 631780243 631456566 630836143 630161591 629980392 629798775 629331741 628712006 628140717 627760315 627394676
2649.1 627394676 627544823 627617416 627440491 626984673 626290321 626038399 625758095 625529671 624983330 624478951
2658.8 624478951 624235458 623807716 623518982 622871895 622448616 622292633 622267876 622203407 621546936 621027451
2668.4 621027451 620777168 620742416 620357933 619844666 619603310 619245491 618902740 618652763 618686562 618398972
2678.1 618398972 618158417 618219337 617820129 617338676 617302208 617188301 616558113 616514015 616403122 615752106
2687.7 615752106 615515404 615517769 615372772 614734001 614374695 613960648 613407555 613366699 613180389 612938499
2697.4 612938499 612698174 612511444 612141075 611901550 612003021 611891670 611536064 610961723 610762672 610451241
2707F10451241m59061l80554o01731l56292r1973M2382n66445m81262l9787l71476
2716.6F07145042k75230m61998n24673n81208l76777Q3465l02810l52364K74773K69622
2726.3F04897842p51762r74770o12449o41136l38059j68342m01192l70560P4501K48413
2735.9F00962486K70119l7689l29361m16718p73620m48647j19285j82038n17540k76947
2745.6E98130760P24526K04582p63512o59294l97911o78291o85921k93007j40419m3411
2755.2E95398102k99492n6076p1030o10809m01955N0583L48930l02696n38940k77214
2764.9E93239403o98509k70958P9803k97241l98750j10436J53236k69622m07410l05214
2774.5E90714302o70814o74820n06668k62414k79083m04091Q4191J678j93939n64842
$$ plain form
2707 610451241 609992180 609611626 609009895 608653603 608561630 608604012 608037567 607556305 607516518 607145042
2716.6 607145042 606869812 606407814 605883141 605301933 604925156 605008621 604705811 604353447 604628220 604897842
2726.3 604897842 604146080 603171310 602558861 601917725 601579666 601411324 601010132 600639572 600714073 600962486
2735.9 600962486 601232605 601194916 600865555 600448837 599675217 599226570 599107285 598925247 598407707 598130760
2745.6 598130760 598855286 599059868 598296356 597637062 597239151 596560860 595874939 595581932 595441513 595398102
2755.2 595398102 595098610 595042534 594971504 594360695 593958740 594009323 594358253 594055557 593516617 593239403
2764.9 593239403 592540894 592269936 592349739 592052498 591653748 591543312 591696548 591426926 591019516 590714302
2774.5 590714302 590043488 589368668 588862000 588599586 588320503 587916412 588000603 588002281 587808342 587243500
2784.2E87243500r75838m02718m21638m95300o50215r86519m71955k50091j59111m6540
2793.8E82383575n2604k19002n07469o36978q78563j105881j231155o78215k81640
2802.5E76792068l83911j27334M272k45247r32045j016006n90439q72498j230163j096916
2812.1E70301781q34809o11190l86162m76799n86968p50465r42192j009751j340484
2820.8E63362961j338921j263618j527367j602631j253700r70344j181984j219445
2828.5E53004951j120338j541328j888085j756973k180443k451706k209587k404098
2836.2E37452393k222481j947518k456932l745613m290313m481316n656509o307602
2843.9E06344109p272263p774239p799835q752670q600807q430062p770805o360283
$$ plain form
2784.2 587243500 586267662 585864944 585443306 584948006 584297791 583311272 582839317 582589226 582430115 582383575
2793.8 582383575 582330971 582111969 581604500 580967522 580088959 578983078 577751923 577073708 576792068
2802.5 576792068 576408157 576280823 576285095 576039848 575107803 574091797 573501358 572628860 571398697 570301781
2812.1 570301781 569466972 568855782 568469620 567992821 567405853 566655388 565713196 564703445 563362961
2820.8 563362961 562024040 560760422 559233055 557630424 556376724 555406380 554224396 553004951
2828.5 553004951 551884613 550343285 548455200 546698227 544517784 542066078 539856491 537452393
2836.2 537452393 535229912 533282394 530825462 527079849 522789536 518308220 512651711 506344109
2843.9 506344109 499071846 491297607 483497772 474745102 466144295 457714233 449943428 443583145
2851.7D43583145n624657m108810j927223L20930J625824K911454M007606M672089
2859.4D45460358N495605N163002M807968M023896L472557L040008J795120J277924
2867.1D74536438L92570j15509k93159r65614l51296N71289Q82111R48105M25377l1128
2876.7D75999184K00691J22909l05442o70586r90181p77817o95228j056214j359634
2885.4D70467682j356697j082840j271286k111092k355842j732903j790237j900406
2893.1D56866379j654663k153893k257461j634217j691894k279968k295113k282600
2900.8D40616570k588349k760658k983856l052483l146515l248825l459816l622665
2908.6D15753403l594590m148216m839020n468711n825119o026764o466866o749802
$$ plain form
2851.7 443583145 437958488 433849678 431922455 432243385 433869209 436780663 440788269 445460358
2859.4 445460358 450955963 456118965 460926933 464950829 468423386 471463394 473258514 474536438
2867.1 474536438 474929008 474813499 474520340 473554726 473203430 473774719 474656830 475604935 476030312 475999184
2876.7 475999184 476199875 476322784 476017342 475346756 474356575 473578758 472883530 471827316 470467682
2885.4 470467682 469110985 468028145 466756859 464645767 462289925 460557022 458766785 456866379
2893.1 456866379 455211716 453057823 450800362 449166145 447474251 445194283 442899170 440616570
2900.8 440616570 438028221 435267563 432283707 429231224 426084709 422835884 419376068 415753403
2908.6 415753403 412158813 408010597 403171577 397702866 391877747 385850983 379384117 372634315
2916.3C72634315p126388o702805n893859n819932n358810m400482l793373k993775
2924C30544891j759491m04548N24597Q26187J639786K678642L604279M075699M199905
2932.7C45929947M628220N014572N486755O137733O336594N487366N392608N703812
2940.4C90117607N361176N268287M791756M221191M062958L848877K973404K423248
2948.1D23068504K021141R62258P15751J105271J057854M06417M84276Q43010J043472
2956.8D31707954J591149J637459K241821K609062K769127L334961L768082M161033
2964.5D53820648L717308L701782L785820M166451M555283L519935L475266L932838
2972.2D84675331L090973K510986K719040K565766K611351K637176K364731K554283
$$ plain form
2916.3 372634315 365507927 358805122 352911263 347091331 341732521 337332039 333538666 330544891
2924 330544891 328785400 328380852 328905449 329731636 331371422 334050064 337654343 341730042 345929947
2932.7 345929947 350558167 355572739 361059494 367197227 373533821 379021187 384413795 390117607
2940.4 390117607 395478783 400747070 405538826 409760017 413822975 417671852 420645256 423068504
2948.1 423068504 425089645 426051903 426767654 427872925 428930779 429337196 429821472 430664482 431707954
2956.8 431707954 433299103 434936562 437178383 439787445 442556572 445891533 449659615 453820648
2964.5 453820648 457537956 461239738 465025558 469192009 473747292 477267227 480742493 484675331
2972.2 484675331 487766304 490277290 492996330 495562096 498173447 500810623 503175354 505729637
2979.9E05729637K331619J714173J219635J548958J810264J297264J394539J526528
2987.6E18572617J108856N52864Q93707J173973N08690K92664J00784K07863L13568
2996.3E23725586k67029q74672j402702j089745j015854j429748r06372r66568j463738
3005E14309158j463585j280555k59667K71225M7875J28708J30729M49257J086311J412774
3014.6E14832230J147346J326828J553612J240616J401825Q00972M99229N05257j25237
3023.3E23182678j5411K29988L93715j58386l07885M00200O2943n97306m76455J42898
3033E22856979n19943j224785n45730l10402m47731m63372k03475n6572m67110p02705
3042.6E17915154o97327o73294n97458r05342j168556n91088j76773m91714p74079
$$ plain form
2979.9 505729637 508061256 509775429 510995064 512544022 514354286 515651550 517046089 518572617
2987.6 518572617 519681473 520234337 521128044 522302017 522810707 523103371 523204155 523412018 523725586
2996.3 523725586 523458557 522583885 521181183 520091438 519075584 517645836 516739464 515772896 514309158
3005 514309158 512845573 511565018 511305351 511576576 511624451 511753159 511883888 512333145 513419456 514832230
3014.6 514832230 515979576 517306404 518860016 520100632 521502457 522303429 522802658 523307915 523182678
3023.3 523182678 523167267 523397255 523790970 523632584 523324699 523724899 523787842 523190536 522714081 522856979
3033 522856979 522337036 521112251 520566521 520256119 519808388 519345016 519141541 519084969 518617859 517915154
3042.6 517915154 517217827 516544533 515947075 515041733 513873177 513282089 513105316 512613602 511839523
3051.3E11839523p23152o40678l08342l61061j390152j289902o42700j008339r91745
3060E04483452l95241j42403k15835n97191r67178m47960n34096q35457o74324j290321
3069.6D98383446q99582m37851q64182m72030k07939m88396k58179n3596p01027j057167
3079.2D92943497q95691q02384r33036o81725m30336p10068j07727m20151j119346
3087.9D86843033m74434q9836m06571j321067j054688m91333n73959o69251j157646
3096.6D80604248o81267k88048m44831n26696p64961r26285q09135p35359r95140l63694
3106.2D74068832k92739r67522o38275m68521o21682n65605q59070j212616l58619
3114.9D68084183k39945j338157j359597r89799m85344k90756n17731p77473j091195
$$ plain form
3051.3 511839523 511116371 510475693 510167351 509806290 508416138 507126236 506483536 505475197 504483452
3060 504483452 504088211 503945808 503729973 503132782 502165604 501717644 501183548 500348091 499673767 498383446
3069.6 498383446 497483864 497046013 496181831 495709801 495501862 495013466 494755287 494701691 494000664 492943497
3079.2 492943497 492047806 491245422 490312386 489630661 489200325 488490257 488382530 487962379 486843033
3087.9 486843033 486368599 486278763 485872192 484551125 483496437 483005104 482431145 481761894 480604248
3096.6 480604248 479922981 479634933 479190102 478663406 477898445 476972160 476163025 475427666 474432526 474068832
3106.2 474068832 473776093 472808571 472170296 471701775 471080093 470514488 469655418 468442802 468084183
3114.9 468084183 467844238 466506081 465146484 464156685 463671341 463380585 462862854 462085381 460994186
3123.6D60994186r44213n58968p91550j415214q69522k03972n75752r08928m92859
3132.3D54233208n94788j162376o55175m92324p43256j176300j004868n80597j438255
3141D46385269j253815n48667j61438l01018r90143j075974r65766m52996o80275r16710
3150.6D39038467q89740j043396p27615r26285m28695l19596j141166q60367l17574
3159.3D32384033o41174j368218j440773j081771r44825j113205n43899k90947q34274
3168D24124947l42827l62320r56879j028595r23843q56552q60443o32477n67971p58209
3177.6D16834831r86290p97462o76727p71904r14002q62007p80792j334648q69751
3186.3D08841248n20707r77363q67577o87637o17600o22367l28713o38809o47278m74129
$$ plain form
3123.6 460994186 460049973 459491005 458699455 457284241 456414719 456210747 455634995 454726067 454233208
3132.3 454233208 453638420 452476044 451820869 451328545 450585289 449408989 448404121 447823524 446385269
3141 446385269 445131454 444582787 444421349 444120331 443130188 442054214 441088448 440635452 439955177 439038467
3150.6 439038467 438148727 437105331 436377716 435451431 435022736 434703140 433561974 432701607 432384033
3159.3 432384033 431742859 430374641 428933868 427852097 426907272 425794067 425250168 424959221 424124947
3168 424124947 423782120 423419800 422462921 421434326 420510483 419653931 418793488 418161011 417593040 416834831
3177.6 416834831 415848541 415051079 414374352 413602448 412688446 411826439 411045647 409710999 408841248
3186.3 408841248 408320541 407343178 406475601 405787964 405170364 404547997 404219284 403580475 402933197 402459068
3195.9D02459068j169700r50890r69658r91859j80207j82304p56302n07850m78898
3204.6C96271400j188850o62613k46200r21936j471177j175956m91753m78592o40106
3213.3C88994217n96733l51792o49108m30947R2468n28793j190834j189308p21512
3222C83427658r89685o96678k52190p56187l48892l43018n83000m87786n20896m67949
3231.6C77981377n89409q13103r55353q37135j127968o50673Q0795l68919q62007o26526
3241.3C71231079j71204m99038m08249o50978j086388n64384q08258p67975j68076
3249.9C66106529o07681j282654n23033j55220q65288r56001p87697l64456l27988
3258.6C60236511l47824m36210m50516m05045r27658o19621k93465k74696q72193j066017
$$ plain form
3195.9 402459068 401289368 400338478 399368820 398376961 398196754 398014450 397258148 396750298 396271400
3204.6 396271400 395082550 394419937 394173737 393251801 391780624 390604668 390112915 389634323 388994217
3213.3 388994217 388397484 388045692 387396584 386965637 387058105 386529312 385338478 384149170 383427658
3222 383427658 382437973 381741295 381489105 380732918 380384026 380041008 379458008 378970222 378449326 377981377
3231.6 377981377 377391968 376578865 375623512 374786377 373658409 373007736 373088531 372719612 371857605 371231079
3241.3 371231079 371059875 370560837 370152588 369501610 368415222 367850838 367042580 366274605 366106529
3249.9 366106529 365498848 364216194 363693161 363537941 362672653 361716652 360928955 360564499 360236511
3258.6 360236511 359888687 359452477 359001961 358596916 357669258 357049637 356756172 356481476 355609283 354543266
3268.3C54543266l62205n76477m05808m36744o84853o62689m17786o7787m99764m16755
3277.9C50012398m41361p31315n75524k57377o07987r40590J20049J69983n79567l82805
3287.5C45785904j40762r32427j156998j93214j50032n74570o71615j13297o2256m97894
3297.2C41292839j31416j02234l93448q37479o60247o6605k09274n36156m39415k64092
3306.8C37652473k36816o1951l44734m71763n58625m34913l11241p28951o04134r01146
3316.5C32998199q23745m29573o3248J41754n30777l36761o371l23334r81407n58815
3326.1C29085922j14784n40848l93791q63190n59005n16053n19676j83067n70107R7504
3335.8C24922905l97415o85311l31649m85802n43671q40149o5689l96576p98111l53012
$$ plain form
3268.3 354543266 354181061 353604584 353198776 352762032 352077179 351414490 350996704 350928917 350429153 350012398
3277.9 350012398 349571037 348839722 348264198 348006821 347398834 346458244 346578293 346748276 346168709 345785904
3287.5 345785904 345645142 344712715 343555717 343362503 343212471 342637901 341966286 341852989 341790733 341292839
3297.2 341292839 341161423 341059189 340665741 339828262 339168015 339101410 338892136 338355980 337916565 337652473
3306.8 337652473 337415657 337353706 337008972 336537209 335978584 335543671 335232430 334503479 333899345 332998199
3316.5 332998199 332174454 331744881 331681633 331823387 331292610 330955849 330949478 330626144 329644737 329085922
3326.1 329085922 328971138 328430290 328036499 327173309 326614304 326098251 325578575 325395508 324825401 324922905
3335.8 324922905 324525490 323840179 323508530 323022728 322479057 321638908 321573219 321176643 320378532 320025520
3345.4C20025520n76515n14889n53951n95131o79588n17464l97510k24610l853n52501
3355.1C15409508j260739j054248J52435J33800m65316n04284o31924p23972n24502
3363.7C10530758o24123j076717k45190k53830m51240j17665r13086q62503n95665
3372.4C05390739j62372k35596m40674J56250n35431r08088m85153j58768k60506k24552
3382.1C02135849m0894p93094o62365l09105m79012k38227k27795l45974l47405k18029
3391.7B98473949l9329j18790j95389k77042o75526o22615l47290j67752J80893M3221
3401.3B96254330j51520j73740m52462o46343q5468J77307k51866q9092k2964l46413
3411B94211769j42784O3400l81984j26515J86768j46027j04561j71051o4316k03552
$$ plain form
3345.4 320025520 319449005 318934116 318380165 317785034 317105446 316587982 316190472 315965862 315962009 315409508
3355.1 315409508 314148769 313094521 313246956 313380756 312915440 312411156 311779232 311055260 310530758
3363.7 310530758 309906635 308829918 308584728 308330898 307879658 307761993 306848907 305986404 305390739
3372.4 305390739 305228367 304992771 304552097 304708347 304172916 303264828 302779675 302620907 302360401 302135849
3382.1 302135849 302094955 301301861 300639496 300330391 299851379 299613152 299385357 299039383 298691978 298473949
3391.7 298473949 298434620 298315830 298120441 297843399 297167873 296545258 296197968 296030216 296211109 296254330
3401.3 296254330 296102810 295929070 295476608 294830265 294744797 294922104 294670238 294581146 294558182 294211769
3411 294211769 294068985 294132385 293750401 293623886 293810654 293664627 293560066 293389015 293324699 293121147
3420.6B93121147J3352K33802Q7986K93332m86527k35805P45735K91862p16572m54139
3430.3B92894173K89116j56937M68197O42147J30215L00369J09653J64147J74026K66514
3439.9B95281620K95010N20877J56136j24855P0724J70632N60951o43482M35829J520138
3449.6B98243580L68442J72387J47686L85265r9163N01613R36451j71527L90453Q68683
3459.2C01743870O33602L16906Q33130K65884k64625J184616R69791M27055K29359
3467.9C06339588L03288O52084K30827J90392O14891N83343K96536O34460P68185J111279
3477.5C11724873R40685L80249K49023J0834L13912M88834J118679O14204N97535J360263
3487.2C17799091L03612P57122R05342M21829N00947N80139O99882O97899J407127
$$ plain form
3420.6 293121147 293134499 293368301 293456287 293749619 293263092 293027287 293773022 294064884 293348312 292894173
3430.3 292894173 293183289 293026352 293494549 294136696 294266911 294567280 294676933 294841080 295015106 295281620
3439.9 295281620 295576630 296097507 296253643 296128788 296199512 296370144 296931095 296287613 296723442 298243580
3449.6 298243580 298612022 298784409 298932095 299317360 299218197 299719810 300656261 300484734 300875187 301743870
3459.2 301743870 302377472 302694378 303527508 303793392 303528767 304713383 305683174 306110229 306339588
3467.9 306339588 306642876 307294960 307525787 307716179 308331070 308914413 309210949 309845409 310613594 311724873
3477.5 311724873 312665558 313045807 313294830 313305664 313619576 314108410 315227089 315841293 316438828 317799091
3487.2 317799091 318102703 318859825 319765167 320186996 320687943 321268082 321967964 322665863 324072990
3495.8C24072990P97005L70407L66402L97949J301346J367721Q13180j06011L24783
3504.5C29705772P46651O74934R14231R79576O12411R8420J151390J159324Q72078
3513.2C36914787J020623Q25119J045837Q04939P89147O53915N84908Q32977J580162
3521.9C45052414J244087l2463J026955J085586M04549K36778O60057J039086J160507
3530.6C51877556J179504J004296J277122N16129J082916N55458k3117J704407J005249
3539.2C60179520J093063J008987J022568J317063J104354J341477P74879J286469
3547C69128380o0082J143418J975212Q77609J468391M72031J430359J207924R41162
3555.6C78584404J473961Q75435J501693J136780J292382P64007J900482J903115P98988
$$ plain form
3495.8 324072990 324869995 325240402 325606804 326004753 327306099 328673820 329487000 329380989 329705772
3504.5 329705772 330452423 331127357 332041588 333021164 333633575 333731995 334883385 336042709 336914787
3513.2 336914787 337935410 338760529 339806366 340611305 341400452 342054367 342639275 343472252 345052414
3521.9 345052414 346296501 346264038 347290993 348376579 348781128 349017906 349677963 350717049 351877556
3530.6 351877556 353057060 354061356 355338478 355854607 356937523 357492981 357469864 359174271 360179520
3539.2 360179520 361272583 362281570 363304138 364621201 365725555 367067032 367841911 369128380
3547 369128380 369068298 370211716 372186928 373064537 374532928 375004959 376435318 377643242 378584404
3555.6 378584404 380058365 380933800 382435493 383572273 384864655 385628662 387529144 389432259 390231247
3564.3C90231247L085213L98445p59506j12801P75337L423195J859970J181832J363449
3573D01446381K222137J557808R54094J606789N66825J764298J476860J727066K428551
3581.7D15750809J435585J058616R23424L847809K570991p41882J793022k03933J905975
3590.4D28340416K765236K909050K147446M68139K130013n76172J524544L293533Q46710
3599D43848915J826515M85611J237870L071632K219772K298470L277969K091293j610145
3607.7D58747902K841720N95246n87692O380615J824035k175369L216934Q57087K667160
3616.4D74367638L259964J67617N44091M55703K183609L384171K129669J304703K132492
3625.1D89929657J942673K047081N330810j40304q038407L603897M141732M185943
$$ plain form
3564.3 390231247 393316460 393714905 392955399 392842598 393617935 397041130 398901100 400082932 401446381
3573 401446381 403668518 405226326 406180420 407787209 408354034 410118332 411595192 413322258 415750809
3581.7 415750809 417186394 418245010 419168434 423016243 425587234 424845352 426638374 426434441 428340416
3590.4 428340416 431105652 434014702 436162148 436630287 438760300 438184128 439708672 443002205 443848915
3599 443848915 445675430 446161041 447398911 450470543 452690315 454988785 458266754 460358047 458747902
3607.7 458747902 461589622 462184868 461597176 467977791 469801826 467626457 470843391 471700478 474367638
3616.4 474367638 477627602 477795219 478339310 478795013 480978622 484362793 486492462 487797165 489929657
3625.1 489929657 491872330 493919411 499250221 499109917 491071510 494675407 498817139 503003082
3632.8E03003082J089745p87468K370644K512397K175827Q50754J118240J739006J767807
3641.5E15840034Q21343L69568K455101L017540M263267j257019k695503M870720q84361
3650.1E26800690j014481N6305L454552L036842K942047M872627n802459J98745M311448
3658.8E38856316J606979J296234L19481K349014J671486Q55904Q65440L50952L499184
3667.5E51670990K245369r9297J15433m907226K015686O425132O941758J156272j3844184
3676.2E51719933M33769O028442L549996j559449L36800K384033J509094J315308O68068
3684.9E66385994K37236L201408N510483o673508m492950N684853l737793k41051M748650
3693.5E70623322J694641J529998L33214K06833O70052P6446K334404K941284l256187
$$ plain form
3632.8 503003082 504092827 503305359 505676003 508188400 510364227 511214981 512333221 514072227 515840034
3641.5 515840034 516661377 517030945 519486046 522503586 526766853 525509834 522814331 527685051 526800690
3650.1 526800690 525786209 525842514 529297066 532333908 535275955 540148582 534346123 534544868 538856316
3658.8 538856316 540463295 541759529 542079010 544428024 546099510 546955414 547820854 548171806 551670990
3667.5 551670990 553916359 553817062 553932495 549025269 551040955 557466087 564407845 565564117 551719933
3676.2 551719933 552153702 558182144 561732140 560172691 560509491 562893524 564402618 565717926 566385994
3684.9 566385994 566623230 569824638 575335121 568661613 564168663 569853516 566115723 565874672 570623322
3693.5 570623322 572317963 573847961 574181175 574388008 575058060 575134506 577468910 580410194 577154007
3702.2E77154007k982216L292542J531868N0773O13098K197571L877716n532379J732445
3710.9E81935425K553139j1085892L781853M192771M79088L76702J688614Q98666k812271
3719.6E82008095R06257M820061j930008l975830L646698J402245j66893k527352r3727
3728.3E84089546L348007L48320M001313k273560o105232O469078j542397p363243
3736E80971832K221108K948608M86260K085228J963272l438988K525940R289932o628380
3744.7E92424812j4909591P939453N625152N489960j344757r775047R084854l033867
3752.4E91500969p301178M104919K858353K652283m392090R46808N134582n485611
3760.1E90019035k300224L631630J921539K64359K316017k057228l554115K397155
$$ plain form
3702.2 577154007 574171791 577464333 578996201 579046974 579660072 581857643 585735359 580202980 581935425
3710.9 581935425 584488564 573402672 577184525 581377296 581856384 582233086 583921700 584820366 582008095
3719.6 582008095 582914352 587734413 585804405 581828575 585475273 586877518 586710625 584183273 584089546
3728.3 584089546 587437553 587785873 591787186 589513626 583408394 589877472 588335075 580971832
3736 580971832 583192940 586141548 586627808 588713036 590676308 587237320 589763260 599053192 592424812
3744.7 592424812 577515221 585454674 591079826 596569786 595225029 585449982 594534836 591500969
3752.4 591500969 584199791 588304710 591163063 593815346 589423256 590370064 595504646 590019035
3760.1 590019035 587718811 591350441 593271980 593536339 595852356 593795128 590241013 592638168
3767.8E92638168M187966O06956p138443J032486K361336J40533K94876j39961J045952
3776.5E95029869O5689J978188O67648n109444J282769J756057J105767J265068k567635
3785.2E95473976j150398Q06846L18223K13508L29743L79715k86141N33791j23596
3793.8E96495667N47485L026695k388992l149796J700478K683182L647880o088295
3801.5E96474304p508011L742638K838860L142967L685264o850052l600845M185181
3809.3E96110306J691131m9438K89955L16811J461982M090729p42416j1058235L056602
3817.9E95167427M110184K650680J634636j2771721J262894M259377J177558K427941
3825.7E99918976J59378l459015M47845J555214K082177J452865o657791J418381O392326
$$ plain form
3767.8 592638168 596826134 597433090 590294647 591327133 593688469 593829002 594123878 593983917 595029869
3776.5 595029869 595095558 597073746 597741394 592631950 593914719 595670776 596776543 598041611 595473976
3785.2 595473976 594323578 595130424 595448647 595662155 595991898 596371613 596085472 596619263 596495667
3793.8 596495667 597043152 600069847 597680855 594531059 596231537 598914719 602562599 596474304
3801.5 596474304 588966293 592708931 595547791 598690758 602376022 595525970 591925125 596110306
3809.3 596110306 597801437 597751999 598041954 598358765 599820747 603911476 603169060 592110825 595167427
3817.9 595167427 599277611 601928291 603562927 590791206 592054100 596313477 597491035 599918976
3825.7 599918976 600078354 596619339 597067184 598622398 600704575 602157440 595499649 596918030 603310356
3834.3F03310356m837227j267776P042465p082596m830208O429520k495537l16582
3842.1E95952415M952546j262589l093986J762199J189461j44730J377831j070595
3849.8E99662552J234054M428215n255546K958298j0503502j941986Q081207o07300
3857.5E98055992j399269K186584K281533K654152m200898j463394M503441m080314
3865.2E98537827m143219L077964L475876M557915n001221p194633K789077N080987
3872.9F01180573M329566p784080j427422L070145j59378P90138K936440l129502o174202
3881.6E93632278M520989J808891J048660M642487j0246658m16909L572999J177062
3889.3E99739799M136773q65250p409859R64012K835236o84090J074410N28297J509400
$$ plain form
3834.3 603310356 598473129 597205353 604247818 597165222 592335014 598764534 596268997 595952415
3842.1 595952415 600904961 599642372 596548386 598310585 599500046 599355316 600733147 599662552
3849.8 599662552 600896606 605324821 600069275 603027573 592524071 590582085 598663292 598055992
3857.5 598055992 596656723 598843307 601124840 603778992 599578094 598114700 602618141 598537827
3865.2 598537827 594394608 597472572 600948448 605506363 600505142 593310509 596099586 601180573
3872.9 601180573 605510139 597726059 596298637 599368782 599209404 599999542 602935982 599806480 593632278
3881.6 593632278 598153267 599962158 601010818 605653305 595406647 594989738 598562737 599739799
3889.3 599739799 603876572 603011322 595601463 596565475 599400711 598716621 599791031 600319328 601828728
3898F01828728K809677p626152K305832J540642n264664L173981j651574r29298R01604
3906.7E97088776P67669J418610o45447M13666J70975j03608K5216m78821P23076J573944
3916.3F00954056j705017k775193L581887J069526l597946Q52509N72624J71890j349182
3925E97775154j360702J854362N03426N3711n60227K37580J130256k945862r50508
3933.7E95737190R58138n29862M76303N08042K64053Q86803N9662J139068J088753
3942.3F00588150l520317r66911R72824M15725R14269j812592M32778Q03833j759415
3951E96068344J254883O00433l90205J10931J64337L58048p35664l26195o96602j85776
3960.7E96222534L36189p61375N93109N71633R4642P67861J07193n88684j359711o69136
$$ plain form
3898 601828728 604638405 597012253 599318085 600858727 595594063 598768044 597116470 596187172 597088776
3906.7 597088776 597856445 599275055 598629608 599043274 599214249 599110641 599135857 598657036 599380112 600954056
3916.3 600954056 599249039 596473846 600055733 601125259 597527313 598379822 598952446 599124336 597775154
3925 597775154 596414452 598268814 598772240 598825951 598265724 598503304 599633560 596687698 595737190
3933.7 595737190 596695328 596165466 596641769 597149811 597413864 598300667 598360329 599499397 600588150
3942.3 600588150 597067833 596100922 597073746 597489471 598403740 596591148 597023926 597827759 596068344
3951 596068344 597323227 597923660 597533455 597644386 597808723 598166771 597431107 597104912 596408310 596222534
3960.7 596222534 596558723 595797348 596390457 596962090 597056732 597824593 597931786 597343102 595983391 595314255
3970.3E95314255P33604l5820K03972M74548l22342L75863L01132M0054l12347q11501
3980E95961418l9596O4735j76620j27640N8059J72997N10025M13742m3068N1537p80220
3990.6E96065369o60744m34761k78702Q06084L15933J02043p0305k34146r7885m34303
4000.2E95078583
$$ plain form
3970.3 595314255 596047859 596012039 596216011 596690559 596368217 596744080 597045212 597085266 596772919 595961418
3980 595961418 595921822 595986557 595809937 595682297 595740356 595913353 596423378 596837120 596794052 596845589 596065369
3990.6 596065369 595404625 594969864 594691162 595497246 595813179 595915222 595844917 595610771 595512886 595078583
4000.2 595078583
##END=$$ End of the data block
