##TITLE=$$ Begin of the data block
##JCAMP-DX=5.00 $$ ACD/SpecManager v 10.08
##SPECTROMETER/DATA SYSTEM=Varian
##DATE=04 Dec 2012 14:00:34
##DATA TYPE=INFRARED SPECTRUM
##DATA CLASS=XYDATA
##ORIGIN=
##OWNER=
##NPOINTS=3735
##FIRSTX=399.26403809
##LASTX=4000.35498047
##MAXX=4000.35498047
##MINX=399.26403809
##MAXY=71.00424957
##MINY=29.67397881
##XFACTOR=1.0000000000
##YFACTOR=0.000000100000000
##FIRSTY=53.28598022
##DELTAX=0.96440572
##XUNITS=1/CM
##YUNITS=TRANSMITTANCE
##XYDATA=(X++(Y..Y))
$$ plain form
399.3 532859802 531147766 552115059 560721207 555032654 545093117 538828697 535540695 540489159
407 540489159 546398163 539865341 529095879 527763786 536185799 539997864 539791451 537154579 537230072
415.7 537230072 542867622 544791107 549135818 544400139 537078819 535505295 534215698 533901863 531958199
424.3 531958199 537068939 541864586 541880646 540586395 541310158 544037514 536812363 532128143 530221100
433 530221100 527800903 534062881 537666054 535287132 532327843 531755371 534098396 536879692 535000114
441.7 535000114 531666718 533007164 528400879 525696716 529826393 535015144 537183571 538532333
449.4 538532333 541121178 539024811 535185242 533089333 532379951 533212852 534034920 535121956 534158173
458.1 534158173 535623665 535848541 534908829 534783249 534089165 536547127 536587143 532746964 530225945
$$ packed form
399.3E32859802j712036K0967293Q606148n688553r939537o264420l288002M948464
407E40489159N909004o532822j0769462j332093Q422013L812065k06413k636872P5493
415.7E37230072N637550J923485M344711m735679p321320j573524j289597l13835j943664
424.3E31958199N110740M795647J6060j294251P23763K727356p225151m684220j907043
433E30221100k420197O261978L603173k378922k959289n72472K343025K781296j879578
441.7E35000114l333396J340446m606285k704163M129677N188751K168427J348762
449.4E38532333K588845k096367l839569k095909p09382Q32901Q22068J087036r63783
458.1E34158173J465492K24876r39712j25580o94084K457962M0016l840179k521019
$$ plain form
466.8 530225945 531048164 531320381 528682213 530399742 528702202 522573395 528806343 533513794 532309532
475.5 532309532 527334976 520062065 517920570 518923569 517515068 518775101 520694847 519528618
483.2 519528618 520906639 525582123 525806046 520991096 513997612 510234680 513229828 516256218 518660316
491.8 518660316 516883430 513833885 515848808 517944450 519128494 516413460 512529755 511076241
499.6 511076241 509159851 508961983 508145485 507452507 508978310 509339981 508033600 509103775 508930550
508.2 508930550 506851540 506915092 503662300 498892479 496814957 495433731 495972443 498473892 500514679
516.9 500514679 499605522 497841110 495315399 493576775 491364670 488921585 487741432 485622444 486367683
525.6 486367683 490440712 492712593 491448708 490488586 491867981 491995583 491037636 489399910 488615646
$$ packed form
466.8E30225945Q22219K72217k638168J717529j697540o128807O232948M707451j204262
475.5E32309532m974556p272911k141495J002999j408501J260033J919746j166229
483.2E19528618J378021M675484K23923m814950o993484l762932K995148L026390K404098
491.8E18660316j776886l049545K014923K095642J184044k715034l883705j453514
499.6E11076241j916390j97868q16498o92978J525803L61671j306381J070175j73225
508.2E08930550k079010O3552l252792m769821k077522j381226N38712K501449K040787
516.9E00514679r09157j764412k525711j738624k212105k443085j180153k118988P45239
525.6D86367683M073029K271881j263885r60122J379395J27602r57947j637726p84264
$$ plain form
534.3 488615646 487287750 487424049 490233345 492471504 495140915 497438660 500865974 498796654 491364670
543 491364670 494097786 502428932 504248123 501624336 500800095 503294640 502892036 499359474 501192207
551.6 501192207 504555511 503684731 502132683 501196785 499295120 495227890 492498627 493385582 494705849
560.3 494705849 495723076 495720978 496310577 497386436 496248436 493499527 490232735 486101265 481884842
569 481884842 480334625 477491837 475171127 478003464 481459084 482330513 480751610 479662552 479632568
577.7 479632568 479153290 478334732 478541107 479721336 480615120 482410965 485954018 491065636 494529915
586.4 494529915 496585350 497136269 495667992 494607658 493913536 492836723 492915497 494217072 494812546
595 494812546 496768112 500142899 502795296 504092216 502215996 499824677 497471924 495712395 495761871
$$ packed form
534.3D88615646j327896J36299K809296K238159K669411K297745L427314k069320p431984
543D91364670K733116Q331146J819191k623787q24241K494545m02604l532562J832733
551.6E01192207L363304q70780j552048r35898j901665m067230k729263Q86955J320267
560.3D94705849J017227k098N89599J075859j138000k748909l266792m131470m216423
569D81884842j550217k842788k320710K832337L455620Q71429j578903j089058k9984
577.7D79632568m79278q18558K06375J180229Q93784J795845L543053N111618L464279
586.4D94529915K055435N50919j468277j060334o94122j076813P8774J301575N95474
595D94812546J955566L374787K652397J296920j876220k391319k352753j759529M9476
$$ plain form
603.7 495761871 494530754 493863754 496390953 499829407 501274414 502348747 503065567 502678185 501420364
612.4 501420364 499458809 498764496 498216286 499254532 501973457 505084877 509360962 512437553 513360405
621.1 513360405 514175568 516282501 515745811 513988914 513946648 513587761 514617729 516606140 519227295
629.8 519227295 522993965 526537514 528596420 529747200 529699097 527678223 526779861 525296478 523734169
638.4 523734169 524355583 525986099 529842644 532792854 534502258 536012650 535622368 534668770 534173508
647.1 534173508 533506584 531412430 530346107 531195564 532396126 535212440 538218155 539845772 540293236
655.8 540293236 539860382 539026108 537371864 535400734 533907394 534140015 534692993 534603920 536754570
664.5 536754570 540679893 543987808 546675301 544941368 541575165 538255196 536701393 537502098 536558151
$$ packed form
603.7D95761871j231117o67000K527199L438454J445007J074333P16820l87382j257821
612.4E01420364j961555o94313n48210J038246K718925L111420M276085L076591R22852
621.1E13360405Q15163K106933n36690j756897m2266l58887J029968J988411K621155
629.8E19227295L766670L543549K058906J150780m8103k020874q98362j483383j562309
638.4E23734169O21414J630516L856545K950210J709404J510392l90282r53598m95262
647.1E34173508o66924k094154j066323Q49457J200562K816314L005715J627617M47464
655.8E40293236m32854q34274j654244j971130j493340K32621N52978q9073K150650
664.5E36754570L925323L307915K687493j733933l366203l319969j553803Q00705r43947
$$ plain form
673.2 536558151 536560097 538390846 540889206 543771667 545500298 546681709 546831017 545705376 544230080
681.8 544230080 542423973 540976105 540843658 541807327 543085861 545381050 547728691 548498917 548643951
690.5 548643951 548014259 546674919 545365181 542952347 541198158 541631775 541953926 542204590 542855148
699.2 542855148 543812561 545187340 544333687 541804886 540170517 538171234 535451660 533755722 533849716
707.9 533849716 535126648 536923752 538297005 538974457 539938011 540791321 541089706 540938263 539962120
716.6 539962120 538443260 536957130 537363625 540109978 543458672 546925888 549427185 551507912 554109993
725.2 554109993 556154633 557268829 556425819 555901184 557383003 559508934 562119942 564987221 568023834
733.9 568023834 570613556 572224197 572776222 573171577 573308029 572128220 570787926 572038879 574367409
$$ packed form
673.2E36558151J946J830749K498360K882461J728631J181411J49308j125641j475296
681.8E44230080j806107j447868j32447R63669J278534K295189K347641P70226J45034
690.5E48643951o29692j339340j309738k412834j754189M33617L22151K50664O50558
699.2E42855148R57413J374779q53653k528801j634369j999283k719574j695938R3994
707.9E33849716J276932J797104J373253O77452R63554Q53310K98385j51443r76143
716.6E39962120j518860j486130M06495K746353L348694L467216K501297K080727K602081
725.2E54109993K044640J114196q43010n24635J481819K125931K611008K867279L036613
733.9E68023834K589722J610641N52025L95355J36452j179809j340294J250953K328530
$$ plain form
742.6 574367409 574832268 576414948 578027878 578464699 579367638 579094086 578353424 576030159 573058815
751.3 573058815 571122856 568796043 567918816 568410568 569118080 570295296 570373268 569034843 567307701
760 567307701 565657196 565055161 564580040 563550110 563726997 564582138 565551262 566956444 569041939
768.6 569041939 571496239 573660202 576050529 577009201 577335701 578412170 580123405 582150421 583079147
777.3 583079147 585161972 588799019 592100639 594090309 595501556 596988373 597437973 597410927 596688232
786 596688232 596338043 597809029 600136223 601119652 601867561 604403534 606143265 606829109 607401848
794.7 607401848 608318825 608956795 609458961 610453911 611011429 612906456 615017471 616224976 617660141
803.4 617660141 619400940 620280876 620228233 621077652 621355286 621677361 622224770 622556877 623604546 624349976
$$ packed form
742.6E74367409M64859J582680J612930M36821R02939k73552p40662k323265k971344
751.3E73058815j935959k326813q77227M91752P07512J177216P7972j338425j727142
760E67307701j650505o02035m75121j029930J76887Q55141R69124J405182K085495
768.6E69041939K454300K163963K390327R58672L26500J076469J711235K027016R28726
777.3E83079147K082825L637047L301620J989670J411247J486817M49600k7046p22695
786E96688232l50189J470986K327194R83429P47909K535973J739731O85844N72739
794.7F07401848R16977O37970N02166R94950N57518J895027K111015J207505J435165
803.4F17660141J740799Q79936n2643Q49419K77634L22075N47409L32107J047669P45430
$$ plain form
813 624349976 625548058 626719513 627085037 626571236 625609245 625628548 625996666 625939980 626198273 625846863
822.6 625846863 624360352 623998146 624079666 623242226 621650200 620234222 619280243 617796135 616283875
831.3 616283875 614449654 612670784 611063805 610204811 610393906 609721832 608189125 605716400 603477554
840 603477554 602333260 601660156 601295662 600257111 598788872 597364159 596350288 595484123 595219574
848.7 595219574 595884743 595560074 594689751 594039421 593975105 594243889 593583908 593200912 593419609 593455505
858.3 593455505 593175468 592708893 593135185 594315109 595495415 596962357 598634453 600843697 603662224
867 603662224 606346207 609310226 611791573 613452339 614621315 615342293 617074318 619488449 621807671
875.7 621807671 623785324 625622368 627277870 627802010 627392120 627137604 626154480 623641243 621231461
$$ packed form
813F24349976J198082J171455L65524n13801r61991J9303L68118n6686K58293l51410
822.6F25846863j486511l62206Q1520q37440j592026j415978r53979j484108j512260
831.3F16283875j834221j778870j606979q58994J89095o72074j532707k472725k238846
840F03477554j144294o73104l64494j038551j468239j424713j013871q66165k64549
848.7E95219574O65169l24669q70323o50330o4316K68784o59981l82996K18697L5896
858.3E93455505k80037m66575M26292J179924J180306J466942J672096K209244K818527
867F03662224K683983K964019K481347J660766J168976P20978J732025K414131K319222
875.7F21807671J977653J837044J655502N24140m09890k54516r83124k513237k409782
$$ plain form
884.4 621231461 618954811 617788506 616979752 616369362 616028061 613747826 611827545 610096169 608195038
893 608195038 606297226 603412971 601283875 599431572 598095856 597686806 597750778 597729149 596359024
901.7 596359024 594538612 592618027 590430527 587933540 585078011 582292709 579698982 577957611
909.4 577957611 576623726 574188309 572161369 571186447 569310646 566382980 562747803 559128151 555954056
918.1 555954056 552975922 550555191 549016037 548175507 547822533 547731018 547198486 546578217 545799980
926.8 545799980 544273758 542882309 541910591 541449814 541754799 542185287 543334618 545109329 546401215
935.5 546401215 548049850 549615974 550345535 550134811 549485512 549816895 550345840 550786057 552021523
944.2 552021523 553280830 554309082 555607834 556208458 555605927 554074364 551226006 548109818 545382881
$$ packed form
884.4F21231461k276650j166305q08754o10390l41301k280235j920281j731376j901131
893F08195038j897812k884255k129096j852303j335716m09050O3972k1629j370125
901.7E96359024j820412j920585k187500k496987k855529k785302k593727j741371
909.4E77957611j333885k435417k026940r74922j875801k927666l635177l619652l174095
918.1E55954056k978134k420731j539154q40530l52974r1515n32532o20269p78237
926.8E45799980j526222j391449r71718m60777L04985M30488J149331J774711J291886
935.5E46401215J648635J566124P29561k10724o49299L31383N28945M40217J235466
944.2E52021523J259307J028252J298752O00624o02531j531563k848358l116188k726937
$$ plain form
952.8 545382881 542249336 539189034 536776772 535155411 532697296 529557953 527212486 523712311
960.6 523712311 518908653 513719711 507942238 501893158 497138138 493495369 489070969 484646378
968.3 484646378 480400505 475778885 469972878 463244247 456385803 449247055 441342888 433689232
976 433689232 427477684 420962830 415143280 409004631 403275146 398378868 392052727 386265411 380362473
984.7 380362473 374980545 369566345 364956894 361384239 358226509 356274719 353703499 352824364 351984444
993.3 351984444 351190758 349913940 348050690 347389145 346065102 345753479 345032158 344930534 344414177
1002 344414177 344583321 346803703 347065353 347256088 346935387 346454391 344301224 341957779 340877571
1010.7 340877571 339538383 339005470 336713181 335603790 335348816 335563736 335576439 334306297 333721504
$$ packed form
952.8E45382881l133545l060302k412262j621361k458115l139343k345467l500175
960.6E23712311m803658n188942n777473o049080m755020l642769m424400m424591
968.3D84646378m245873m621620n806007o728631o858444p138748p904167p653656
976D33689232o211548o514854n819550o138649n729485m896278o326141n787316n902938
984.7C80362473n381928n414200m609451l572655l157730j951790k571220q79135q39920
993.3C51984444p93686j276818j863250o61545j324043l11623p21321j01624n16357
1002C44414177J69144K220382K61650J90735l20701m80996k153167k343445j080208
1010.7C40877571j339188n32913k292289j109391k54974K14920J2703j270142n84793
$$ plain form
1019.4 333721504 332275925 331682014 330579338 330475044 330466957 330491142 331908073 332351570 334179611
1028.1 334179611 334820976 335565033 335852928 335907364 336442566 335530472 335661430 335014076 335654869 335583878
1037.7 335583878 335432053 336773643 337676201 338326111 336931038 337197685 336582489 335769920 335464897
1046.4 335464897 335500946 337509308 338062744 339478607 340417099 342622719 344123573 343784599 344379768
1055.1 344379768 345409927 348199272 349442749 351861267 354178658 357511330 362291794 365514565
1062.8 365514565 369492607 371763611 375007401 377058144 377682915 377909355 376914635 376848183 374421196
1071.5 374421196 371838799 369079018 366563187 364202576 361611824 359210701 356329460 355946388
1079.2 355946388 354450073 353521271 353252831 354314346 357016411 358992386 361763268 363055649 365348473
$$ packed form
1019.4C33721504j445579n93911j102676j04294q087K4185J416931M43497J828041
1028.1C34179611O41365P44057K87895N4436N35202r12094J30958o47354O40793p0991
1037.7C35583878j51825J341590R02558O49910j395073K66647o15196q12569l05023
1046.4C35464897L6049K008362N53436J415863R38492K205620J500854l38974N95169
1055.1C44379768J030159K789345J243477K418518K317391L332672M780464L222771
1062.8C65514565L978042K271004L243790K050743O24771K26440r94720o6452k426987
1071.5C74421196k582397k759781k515831k360611k590752k401123k881241l83072
1079.2C55946388j496315r28802k68440J061515K702065J975975K770882J292381K292824
$$ plain form
1087.9 365348473 367131310 369541283 371283722 371823196 374091797 374434586 376674728 378603401 380320015
1096.5 380320015 382432938 383272438 384768639 385533142 386846809 386727028 386451073 385595474 385715370
1105.2 385715370 387850990 388995857 390981064 391767006 393376198 394823341 396452522 397871513
1112.9 397871513 397348213 398065071 397704659 398334885 399387207 400626526 402157898 403568077 405545616
1121.6 405545616 405853271 407234497 408231583 409621315 410472107 409910774 410592422 411497154 413980865
1130.3 413980865 415631218 417308578 418788223 418991051 418495941 417007256 416154022 413929253 411872597
1139 411872597 409809494 408150711 406651993 404186783 402771873 400641479 399018478 396618423 394568672
1147.6 394568672 392874565 390450897 388548927 386100044 385181465 383611221 383032188 382863579 382601852
$$ packed form
1087.9C65348473J782837K409973J742439N39474K268601L42789K240142J928673J716614
1096.5C80320015K112923Q39500J496201P64503J313667j19781k75955q55599J19896
1105.2C85715370K135620J144867J985207P85942J609192J447143J629181J418991
1112.9C97871513n23300P16858l60412O30226J052322J239319J531372J410179J977539
1121.6D05545616L07655J381226R97086J389732Q50792n61333O81648R04732K483711
1130.3D13980865J650353J677360J479645K02828m95110j488685q53234k224769k056656
1139D11872597k063103j658783j498718k465210j414910k130394j623001k400055k049751
1147.6C94568672j694107k423668j901970k448883r18579j570244n79033j68609k61727
$$ plain form
1156.3 382601852 382998810 382052231 382881889 383505745 384518700 385420761 386822319 389271660 391643906
1165 391643906 395373955 398339462 403248558 408193932 412737198 417331390 420637856 424558907 428126144
1173.7 428126144 432620583 436935196 441786842 447046509 451830559 456944542 461188736 466060715
1181.4 466060715 470438690 473714828 476290703 478909340 481806412 483975029 486930809 489650230
1189.1 489650230 492184906 495051765 497237396 498936958 500202065 501292877 501865120 501860046 501741676
1197.8 501741676 502092056 502672043 503141289 503835449 504705849 506188889 507516556 507983360 508094368
1206.5 508094368 508365135 508548393 508890800 509563332 510083656 511223488 512801285 515116310 517358856
1215.1 517358856 518314285 518903618 519038773 518753471 518118744 517230721 516462898 516258812 516258545 515650749
$$ packed form
1156.3C82601852L96958r46579Q29658O23856J012955R02061J401558K449341K372246
1165C91643906L730049K965507M909096M945374M543266M594192L306466L921051L567237
1173.7D28126144M494439M314613M851646N259667M784050N113983M244194M871979
1181.4D66060715M377975L276138K575875K618637K897072K168617K955780K719421
1189.1D89650230K534676K866859K185631J699562J265107J090812N72243n074j18370
1197.8E01741676L50380N79987M69246O94160Q70400J483040J327667M66804J11008
1206.5E08094368K70767J83258L42407O72532N20324J139832J577797K315025K242546
1215.1E17358856R55429N89333J35155k85302o34727q88023p67823k04086k67o07796
$$ plain form
1224.8 515650749 515828323 516232986 515765114 514810219 513711014 512504921 510675354 509095459 507830353
1233.5 507830353 506889687 506507034 506376343 506424065 506649551 507187347 507727928 508161736 507462425 506690178
1243.1 506690178 506477890 506122169 506727219 507645073 509135628 511239243 512796440 514160767 515590401
1251.8 515590401 516417313 516802826 517248840 517312775 517200890 517296944 518036537 519364624 520787964 522565498
1261.4 522565498 524418373 525652428 526244202 526990395 527193871 526584969 526428833 526764641 527412109
1270.1 527412109 528856583 530723495 532189140 533679733 534666710 534909821 535070076 535051689 534598694
1278.8 534598694 533748016 533767052 534555206 535216217 536298027 538015862 540008507 541058044 540935783
1287.5 540935783 540593071 540337982 539862022 539333916 539124222 539149323 539382362 539956322 540771942 541399841
$$ packed form
1224.8E15650749J77574M04663m67872r54895j099205j206093j829567j579895j265106
1233.5E07830353r40666l82653j30691M7722K25486N37796N40581M33808o99311p72247
1243.1E06690178k12288l55721O05050R17854J490555K103615J557197J364327J429634
1251.8E15590401Q26912L85513M46014O3935j11885R6054P39593J328087J423340J777534
1261.4E22565498J852875J234055N91774P46193K03476o08902j56136L35808O47468
1270.1E27412109J444474J866912J465645J490593R86977K43111J60255j8387m52995
1278.8E34598694q50678J9036P88154O61011J081810J717835J992645J049537j22261
1287.5E40935783l42712k55089m75960n28106k09694K5101K33039N73960Q15620O27899
$$ plain form
1297.1 541399841 541546059 541180267 540505829 539386940 538093567 537444115 537012138 536601639 537192039
1305.8 537192039 538465309 539426918 540161705 540369987 539517097 538536758 537384186 535757751 534462662
1314.5 534462662 533795280 533526726 533615036 534146347 534554672 534908295 535300484 534807243 533490295 531940155
1324.1 531940155 530648308 529590950 528811226 528341103 528019562 528374100 528553963 528556175 528244667 526941910
1333.8 526941910 525722809 524525337 523282700 522021523 520901222 520369644 520334587 521815300 523425102
1342.4 523425102 524146347 524333878 524345589 523587418 522675743 522086449 521027298 520695610 520968742 521046486
1352.1 521046486 521298332 521799622 522201118 522091484 521767197 520748138 519349289 517947655 516170006
1360.8 516170006 515198174 514792709 514417267 514771385 515364609 515252686 515021973 514447556 513369713
$$ packed form
1297.1E41399841J46218l65792o74438j118889j293373o49452m31977m10499N90400
1305.8E37192039J273270R61609P34787K08282q52890r80339j152572j626435j295089
1314.5E34462662o67382k68554Q8310N31311M08325L53623L92189m93241j316948j550140
1324.1E31940155j291847j057358p79724m70123l21541L54538J79863K212l11508j302757
1333.8E26941910j219101j197472j242637j261177j120301n31578l5057J480713J609802
1342.4E23425102P21245J87531J1711p58171r11675n89294j059151l31688K73132P7744
1352.1E21046486K51846N01290M01496j09634l24287j019059j398849j401634j777649
1360.8E16170006r71832m05465l75442L54118N93224j11923k30713n74417j077843
$$ plain form
1369.4 513369713 512728539 511691360 511002045 510221062 509276009 509020615 509377289 510146294 510454483
1378.1 510454483 511374702 512091560 512331848 512324219 512191315 512683792 513461189 515038681 516364746 517758293
1387.8 517758293 520126915 522160645 523086243 523548126 523720474 523268776 521819534 519782143 520177574
1396.4 520177574 520933838 520886917 520278625 520952911 522138481 522128410 522392731 522019615 520648003 520512428
1406.1 520512428 520276260 519957275 519855385 520323639 520224495 519472733 519146461 519053574 518657036 517686195
1415.7 517686195 516609344 516045570 515823135 513498726 515341873 517889977 518999596 520053902 520042076
1424.4 520042076 521038017 521811447 521122055 521021652 520671196 519656448 519102936 519417114 519261322
1433.1 519261322 519626732 520493584 519815826 516707497 516551437 518065186 517916260 517296066 516606445
$$ packed form
1369.4E13369713o41174j037179o89315p80983r45053k55394L56674P69005L08189
1378.1E10454483R20219P16858K40288p629j32904M92477P77397J577492J326065J393547
1387.8E17758293K368622K033730R25598M61883J72348m51698j449242k037391L95431
1396.4E20177574P56264m6921o08292O74286J185570j0071K64321l73116j371612j35575
1406.1E20512428k36168l18985j01890M68254r9144p51762l26272r2887l96538r70841
1415.7E17686195j076851n63774k22435k324409J843147K548104J109619J054306j1826
1424.4E20042076R95941P73430o89392j00403l50456j014748n53512L14178j55792
1433.1E19261322L65410Q66852o77758l108329j56060J513749j48926o20194o89621
$$ plain form
1441.8 516606445 515814476 516073761 516086349 516751518 517036247 516644669 514760971 514146652 513753433 511762390
1451.4 511762390 510372620 508633652 508008804 506753120 505829086 502138481 499929047 504961700 505254097
1460.1 505254097 506748466 506948509 507706947 509502945 507679291 508413582 509711037 514289894 519014740
1468.8 519014740 525980301 533436966 538829689 546289673 550361481 557326012 561304855 564526711
1476.5 564526711 568885803 572812538 576831779 579462471 582157173 583963432 586025009 587465668
1484.2 587465668 588852081 590271149 590171509 591101913 591812210 592005005 592343712 594150620 595405693
1492.9 595405693 595109673 595225983 594224091 591321678 592663879 592691650 590869331 591817894 592373047
1501.6 592373047 591549339 591306000 591276131 590320129 584067841 578850365 579762993 580628052 580486336
$$ packed form
1441.8E16606445p91969K59285J2588O65169K84729l91578j883698o14319l93219j991043
1451.4E11762390j389770j738968o24848j255684r24034l690605k209434N032653K92397
1460.1E05254097J494369K00043P58438J795998j823654P34291J297455M578857M724846
1468.8E19014740O965561P456665N392723P459984M071808O964531L978843L221856
1476.5E64526711M359092L926735M019241K630692K694702J806259K061577J440659
1484.2E87465668J386413J419068r9640R30404P10297J92795L38707J806908J255073
1492.9E95405693k96020J16310j001892k902413J342201K7771j822319R48563N55153
1501.6E92373047q23708k43339k9869r56002o252288n217476R12628Q65059j41716
$$ plain form
1510.2 580486336 580882950 579967003 577625999 577375259 576418495 574788818 571259804 568972054 571955032
1518.9 571955032 573444481 571040916 568934250 570385284 572876167 574104080 572234955 571279068
1526.6 571279068 571511192 570115585 569641304 570259781 570198174 570000801 567800789 565487099 567441406
1535.3 567441406 568672791 569380531 569799042 566069107 560047951 562557983 563243370 563070946 564941063
1544 564941063 565196381 565904312 568479919 570248146 571267700 570718880 569553070 571440582 573106766
1552.7 573106766 573358574 572904739 575916367 580171661 582405663 579686317 577298965 579878464 585055237
1561.4 585055237 587310944 588720627 589267731 589151192 590420456 592691460 595000343 595053902 593716545
1570 593716545 596329689 598658905 599190063 599347191 599784546 598610535 595030060 597151451 599764214
$$ packed form
1510.2E80486336L96614r15947k341004k50740r56764j629677l529014k287750K982978
1518.9E71955032J489449k403565k106666J451034K490883J227913j869125r55887
1526.6E71279068K32124j395607m74281O18477o1607j97373k200012k313690J954307
1535.3E67441406J231385P07740M18511l729935o021156K510032O85387j72424J870117
1544E64941063K55318P07931K575607J768227J019554n48820j165810J887512J666184
1552.7E73106766K51808m53835L011628M255294K234002k719346k387352K579499N176773
1561.4E85055237K255707J409683N47104j16539J269264K271004K308883N3559j337357
1570E93716545K613144K329216N31158J57128M37355j174011l580475K121391K612763
$$ plain form
1578.7 599764214 600807037 601858406 602380371 601929283 601260872 600495758 599516563 597856941 596649666
1587.4 596649666 595736580 595406494 594774246 594472694 594141273 593294640 592432823 590259705 588559875
1596.1 588559875 586489830 584418182 582230606 580392761 579191093 577792130 576813774 575227013
1603.8 575227013 574354897 572413254 569290771 565861244 562803116 559671440 556072197 554304695
1611.5 554304695 551919403 550334969 548078308 546482544 544581223 535255814 534690895 532816849
1619.2 532816849 529902306 526139030 523871727 520605011 514315567 513904572 512412949 511237679
1626.9 511237679 506879044 503150864 500738449 497425804 495092926 491457558 490029640 487911530
1634.6 487911530 482282982 479962807 480559044 480290031 479654846 480064201 477481842 476479340 474454651
$$ packed form
1578.7E99764214J042823J051369N21965m51088o68411p65114r79195j659622j207275
1587.4E96649666r13086l30086o32248l01552l31421q46633q61817k173118j699830
1596.1E88559875k070045k071648k187576j837845j201668j398963r78356j586761
1603.8E75227013q72116j941643l122483l429527l058128l131676l599243j767502
1611.5E54304695k385292j584434k256661j595764j901321r325409n64919j874046
1619.2E32816849k914543l763276k267303l266716o289444m10995j491623j175270
1626.9E11237679m358635l728180k412415l312645k332878l635368j427918k118110
1634.6D87911530n628548k320175N96237k69013o35185M09355k582359j002502k024689
$$ plain form
1643.3 474454651 473839111 474037247 470662117 470852051 469802475 472482834 473237419 474948959 477032433
1652 477032433 473608856 469422569 469143906 472359772 473176956 474516945 475853691 478122025 480652924
1660.7 480652924 482214699 484859772 485282822 487946243 489555054 491191330 493064156 494428749
1668.4 494428749 496367378 497599373 501554146 503800621 507211075 510552444 511710396 512820854
1676.1 512820854 515225868 517977982 519551773 521775169 523109093 526294937 529784470 529361000
1683.8 529361000 531838036 535792999 541119995 543956261 545089149 547116470 549037514 551929703
1691.5 551929703 554387283 557431641 561085777 564233513 564207878 568625298 573667336 577838097 577582207
1700.2 577582207 573715477 579098740 582455292 584604149 585880013 586964111 588210907 590655136
$$ packed form
1643.3D74454651o15540J98136l375130J89934j049576K680359P54585J711540K083474
1652D77032433l423577m186287k78663L215866Q17184J339989J336746K268334K530899
1660.7D80652924J561775K645073M23050K663421J608811J636276J872826J364593
1668.4D94428749J938629J231995L954773K246475L410454L341369J157952J110458
1676.1E12820854K405014K752114J573791K223396J333924L185844L489533m23470
1683.8E29361000K477036L954963N326996K836266J132888K027321J921044K892189
1691.5E51929703K457580L044358L654136L147736k5635M417420N042038M170761k55890
1700.2E77582207l866730N383263L356552K148857J275864J084098J246796K444229
$$ plain form
1707.9 590655136 593466187 594035759 593762016 594441605 595014992 595227814 594303703 594362755 596820946
1716.6 596820946 598432922 595835037 599398956 602853050 604324150 604255409 602784805 600880814 600020599
1725.3 600020599 599212189 597534447 596538391 595980492 592598190 589284325 588686028 587195587 578104134
1734 578104134 565157356 564167938 561370468 556084938 551834526 544724731 536417732 534394798 532510300
1742.7 532510300 526929398 524458084 523886223 524571266 526337051 529307175 534874878 540578613 550699921
1751.3 550699921 560603905 571642952 582266960 592234497 602560768 611244049 620280914 627624474
1759 627624474 634886894 640716782 644963608 650555954 655845871 660900726 664796448 668426590 670668640
1767.7 670668640 670708694 672854309 675344086 675460739 673473053 674691391 678526688 680979080 681641846
$$ packed form
1707.9E90655136K811051N69572k73743O79589N73387K12822r24111N9052K458191
1716.6E96820946J611976k597885L563919L454094J471100o8741j470604j903991q60215
1725.3F00020599q08410j677742r96056n57899l382302l313865n98297j490441r091453
1734E78104134j2946778r89418k797470n285530m250412p109795q306999k022934j884498
1742.7E32510300n580902k471314n71861O85043J765785K970124N567703N703735J0121308
1751.3E50699921R903984J1039047J0624008R967537J0326271Q683281R036865P343560
1759F27624474P262420N829888M246826N592346N289917N054855L895722L630142K242050
1767.7F70668640M0054K145615K489777J16653j987686J218338L835297K452392O62766
$$ plain form
1776.4 681641846 683918762 685381317 686198883 686790466 685600128 685874176 686771011 687610550 687592392
1785.1 687592392 688304596 690390549 691383209 692210693 693271484 693614273 693735199 691428223 691098175
1793.8 691098175 693110275 693499908 693336182 694579926 696438980 696995163 696615982 697858276 697582703
1802.4 697582703 697439117 698327866 698254395 698233414 698045197 698005829 699085999 700141754 699897842 700519180
1812.1 700519180 701574478 701972504 702202835 701874695 702126694 701866608 701628494 702087708 702372894
1820.8 702372894 703273163 703722839 704494781 704444885 701985855 702659073 704494781 705180740 703630753
1829.4 703630753 701203156 702749329 704437332 704699783 705335693 706087723 706137619 705704880 705473709
1838.1 705473709 705975418 705765076 705752258 705815659 706394348 706277695 703515091 705725861 707539139
$$ packed form
1776.4F81641846K276916J462555Q17566N91583j190338K74048Q96835Q39539j8158
1785.1F87592392P12204K085953R92660Q27484J060791L42789J20926k306976l30048
1793.8F91098175K012100L89633j63726J243744J859054N56183l79181J242294k75573
1802.4F97582703j43586Q88749p3471k0981j88217l9368J080170J055755k43912O21338
1812.1G00519180J055298L98026K30331l28140K51999k60086k38114M59214K85186
1820.8G02372894R00269M49676P71942m9896k459030O73218J835708O85959j549987
1829.4G03630753k427597J546173J688003K62451O35910P52030M9896m32739k31171
1838.1G05473709N01709k10342j2818O3401N78689j16653k762604K210770J813278
$$ plain form
1846.8 707539139 707036896 706752777 707306290 707738266 707169266 706735840 706506729 706894531 707234573 707328949
1856.4 707328949 707919617 708055038 708064117 708074265 708024673 707458115 707332611 707707825 707855530 708078232
1866.1 708078232 707848740 707921982 706687317 706267014 707696304 708383102 708606949 708372498 708512192
1874.8 708512192 708474731 708293457 708153915 708088379 708537979 708520889 708648911 708829498 709086685 709066849
1884.4 709066849 708695908 708763733 708928680 709369431 708629990 707483826 708310242 709100266 709037018 709265213
1894.1 709265213 709252243 708536377 708929138 709288254 709577866 709781952 709347534 709175262 709122467 709113541
1903.7 709113541 708990860 709496384 709716644 709091721 709087982 709241638 709004059 709096909 709518967 708969803
1913.3 708969803 708679810 708884735 709275436 710042496 708480988 707735062 708738251 709311905 709422836
$$ packed form
1846.8G07539139n02243k84119N53513M31976n69000m33426k29111L87802L40042R4376
1856.4G07328949N90668J35421R079J0148m9592n66558j25504L75214J47705K22702
1866.1G08078232k29492P3242j234665m20303J429290O86798K23847k34451J39694
1874.8G08512192l7461j81274j39542o5536M49600j7090J28022J80587K57187j9836
1884.4G09066849l70941O7825J64947M40751p39441j146164Q26416P90024o3248K28195
1894.1G09265213j2970p15866L92761L59116K89612K04086m34418j72272n2795q926
1903.7G09113541j22681N05524K20260o24923l739J53656k37579R2850M22058n49164
1913.3G08969803k89993K04925L90701P67060j561508p45926J003189N73654J10931
$$ plain form
1922 709422836 708407288 707865143 708340988 708672867 708512115 708630676 708803635 708708496 708964539 709288712
1931.7 709288712 709259262 709011078 709107895 708637695 708226929 708197632 707869720 708004608 708112106 708497620
1941.3 708497620 707903442 706740494 707570953 708149872 708055954 707919617 707742157 707452850 707409821 707466354
1951 707466354 707640457 708131485 708162231 708204880 708113022 708108749 708548508 708357544 707788925 707496643 707301941
1961.6 707301941 707299194 707570496 707654266 707893906 708150787 708008118 707960510 708031158 707860718 707569733
1971.2 707569733 707620926 707169113 706932983 707461929 707506943 707355347 707263107 707333069 707250137 707176361 707087784
1981.8 707087784 706831284 706842728 706605453 706530075 706583328 706811752 706941681 706746597 707095566 706925964
1991.5 706925964 706147842 705887451 705954666 705997543 705932083 705882950 705948410 706135101 706083374 706119690 706009064
$$ packed form
1922G09422836j015548n42145M75845L31879j60752J18561J72959r5139K56043L24173
1931.7G09288712k9450k48184R6817m70200m10766k9297l27912J34888J07498L85514
1941.3G08497620n94178j162948Q30459N78919r3918j36337j77460k89307m3029N6533
1951G07466354J74103M91028L0746M2649r1858m273M39759j90964n68619k92282j94702
1961.6G07301941k747K71302Q3770K39640K56881j42669m7608P0648j70440k90985
1971.2G07569733N1193m51813k36130N28946M5014j51596r2240O9962q2932p3776q8577
1981.8G07087784k56500J1444k37275p5378N3253K28424J29929j95084L48969j69602
1991.5G06925964p78122k60391O7215M2877o5460m9133O5460J86691n1727L6316j10626
$$ plain form
2002.1 706009064 705758133 705543671 705186157 704687729 703872147 703834381 704422989 704623871 704500732 704391479
2011.7 704391479 704573288 704804077 704707108 704120026 703566666 703070526 702862701 702715759 702354660 702215195
2021.3 702215195 702190475 702433777 702274475 702003784 701904831 701624451 701349182 700991898 700966034 700654831
2031 700654831 700592880 700818634 700635605 700495148 700123215 700026169 699969559 699751968 699246140 698604813
2040.6 698604813 698528061 698743362 699057465 699111786 699384384 699158936 698474426 698580551 698541107 698039322
2050.3 698039322 697686081 697812347 697852554 697748718 697312012 697093887 697743607 697983780 698036957 697835846
2059.9 697835846 697588882 697684479 697621841 697250900 696816711 696930389 696790161 697117462 697840652 698097229
2069.6 698097229 698217392 697904434 697676392 697265244 696886902 696788712 696891861 697224503 697418823 697671967
$$ packed form
2002.1G06009064k50931k14462l57514m98428q15582l7766N88608K00882j23139j09253
2011.7G04391479J81809K30789r6969n87082n53360m96140k07825j46942l61099j39465
2021.3G02215195k4720K43302j59302k70691r8953k80380k75269l57284k5864l11203
2031G00654831o1951K25754j83029j40457l71933r7046n6610k17591n05828o41327
2040.6F98604813p6752K15301L14103N4321K72598k25448o84510J06125l9444n01785
2050.3F98039322l53241J26266M0207j03836m36706k18125O49720K40173N3177k01111
2059.9F97835846k46964R5597o2638l70941m34189J13678j40228L27301P23190K56577
2069.6F98097229J20163l12958k28042m11148l78342r8190J03149L32642J94320K53144
$$ plain form
2079.2 697671967 697515488 697289810 697071457 696869812 696922684 697032166 696846848 696385727 696796112 697207260
2088.9 697207260 697400055 697704086 697638245 697364197 697008514 697002869 696575928 696132736 696210709 696597672
2098.5 696597672 697090149 697194214 697449112 697503357 697473602 697660980 697859573 697337418 696331482 696236496
2108.1 696236496 696317825 696463470 696737823 696986084 697121735 696883850 696701965 696706085 696814880 696602707
2117.8 696602707 696482315 696249161 696029510 696144943 696330109 696838989 696820908 696650391 696596909 696656876
2127.4 696656876 696768417 696515503 696039658 695426712 695657425 695870743 696136780 696519928 696286316 696214905
2137.1 696214905 695984421 696059113 695877304 695541458 695548859 695441284 695663681 695675812 695815430 695942764
2146.7 695942764 696020279 696242142 696330338 696353531 696015091 695800171 695627747 695426254 695056152 694935684
$$ packed form
2079.2F97671967j56479k25678k18353k01645N2872J09482j85318m61121M10385M11148
2088.9F97207260J92795L04031o5841k74048l55683n645m26941m43192P7973L86963
2098.5F96597672M92477J04065K54898N4245k9755J87378J98593n22155j005936r4986
2108.1F96236496Q1329J45645K74353K48261J35651k37885j81885M120J08795k12173
2117.8F96602707j20392k33154k19651J15433J85166N08880j8081j70517n3482N9967
2127.4F96656876J11541k52914m75845o12946K30713K13318K66037L83148k33612p1411
2137.1F96214905k30484P4692j81809l35846P401j07575K22397J2131J39618J27334
2146.7F95942764P7515K21863Q8196K3193l38440k14920j72424k01493l70102j20468
$$ plain form
2156.4 694935684 695118332 695429764 696176834 696181412 696075821 696060028 695836411 695575104 695228806 695553055
2166 695553055 695832825 696217194 696661301 696689835 696767349 697002716 697130051 696959152 697028427 696746826
2175.6 696746826 696133194 695895844 696145782 696652603 697335587 697938995 697873001 697966690 697791901 697558975
2185.3 697558975 697564392 697322006 697440567 697367859 697455978 697813721 698353653 698773041 698892059 699051056
2194.9 699051056 698547211 698150558 697840424 697810059 698098297 698104935 698396606 698680649 698794250 698882217
2204.6 698882217 699634018 700061417 699819183 699785309 699345779 699150848 699053802 698987122 699283218 699752426
2214.2 699752426 700100632 700182877 700282516 700070343 700196457 700163879 699639740 699277649 699258575 699649277
2223.9 699649277 699746017 700065994 700577469 700700836 700336380 700026550 700188446 700140152 699951935 699609756
$$ packed form
2156.4F94935684J82648L11432P47070M578j05591j5793k23617k61307l46298L24249
2166F95553055K79770L84369M44107K8534P7514K35367J27335j70899O9275k81601
2175.6F96746826o13632k37350K49938N06821O82984O03408o5994R3689j74789k32926
2185.3F97558975N417k42386J18561p2708Q8119L57743N39932M19388J19018J58997
2194.9F99051056n03845l96653l10134l0365K88238O638K91671K84043J13601Q7967
2204.6F98882217P51801M27399k42234l3874m39530j94931r7046o6680K96096M69208
2214.2F99752426L48206Q2245R9639k12173J26114l2578n24139l62091j9074L90702
2223.9F99649277R6740L19977N11475J23367l64456l09830J61896m8294j88217l42179
$$ plain form
2233.5 699609756 699516449 699649887 700015869 700225372 700038681 700620956 700843201 700333405 699993896 699825821
2243.2 699825821 699557571 699255295 699475479 699777069 699868469 700114136 700571976 700392838 700119247 700046997
2252.8 700046997 699630280 699590454 699452820 699146805 699141464 699891434 700318375 700081177 700568314 700805511
2262.4 700805511 700751266 700390625 699973373 699747162 699770203 699936295 699242401 699355240 699835510 700232544
2272.1 700232544 700802841 700886078 700862503 700153961 699570694 699141922 699151840 699374313 699403229 699724960
2281.7 699724960 699571228 699955750 700330963 700321884 699909210 699242935 699453888 699552231 699523697 699080353
2291.4 699080353 699020309 699181442 699273911 700085373 700121460 700161591 700076599 699663467 699599380 699607925 699623337
2302 699623337 699315948 699540024 699648209 699811630 700246506 700485458 700557251 700461273 701062393 700745850
$$ packed form
2233.5F99609756r3307J33438L65982K09503j86691N82275K22245n09796l39509j68075
2243.2F99825821k68250l02276K20184L01590R1400K45667M57840j79138k73591p2250
2252.8G00046997m16717l9826j37634l06015n341P49970M26941k37198M87137K37197
2262.4G00805511n4245l60641m17252k26211K3041J66092o93894J12839M80270L97034
2272.1G00232544N70297Q3237k3575p08542n83267m28772R918K22473K8916L21731
2281.7F99724960j53732L84522L75213r079m12674o66275K10953R8343k8534m43344
2291.4F99080353o0044J61133R2469Q11462L6087M0131q4992m13132o4087Q545J5412
2302F99623337l07389K24076J08185J63421M34876K38952P1793r5978O01120l16543
$$ plain form
2311.6 700745850 700455704 700696640 700380402 700636673 700660858 701034775 701406174 701656036 702174683 701534882
2321.3 701534882 700949631 701206741 701378708 700820923 701112061 702082901 702502518 702977829 702513046 701619644
2330.9 701619644 701386642 701766663 701442871 700862885 702101593 702251663 701407547 702481537 703086548
2339.6 703086548 702827225 703247299 703183899 702202835 701551514 700572662 699752502 699323883 698201218 698921814
2349.2 698921814 700825424 701006393 701399612 702159195 702434692 702422333 702697754 703187790 702308426 702755814
2358.9 702755814 702884750 703318787 703152542 701311035 701220627 701607513 702157059 700444794 699231033
2367.6 699231033 699972229 699392242 697977600 696507950 696264191 695660248 695186081 695385208 695080261
2376.2 695080261 694972839 694610672 694041061 693291016 692513809 691949768 691632309 691515350 691473618 691416626
$$ packed form
2311.6G00745850k90146K40936l16238K56271K4185L73917L71399K49862N18647o39801
2321.3G01534882n85251K57110J71967n57785K91138R70840M19617M75311m64783q93402
2330.9G01619644k33002L80021l23792n79986J238708J50070q44116J073990O05011
2339.6G03086548k59323M20074o3400r81064o51321r78852q20160m28619j122665P20596
2349.2F98921814J903610J80969L93219P59583K75497j2359K75421M90036q79364M47388
2358.9G02755814J28936M34037j66245j841507r0408L86886N49546j712265j213761
2367.6F99231033P41196n79987j414642j469650k43759o03943m74167J99127l04947
2376.2F95080261j07422l62167n69611p50045p77207n64041l17459j16959m1732n6992
$$ plain form
2385.9 691416626 690989914 690875778 690651474 690313721 690215454 689894180 689804077 689747696 689903564 689857712
2395.5 689857712 689753036 689951248 689848785 689641953 689058151 688774414 688591995 688437271 688713608 688461685
2405.2 688461685 688262558 688289566 688361969 688417587 688219604 687896042 687152863 686699677 686741333 686211777
2414.8 686211777 685856476 686355133 686336365 686090240 686153870 686049118 685943451 685732117 685524597 685086517
2424.5 685086517 684555740 684226151 683945236 683715057 683794403 684403000 684492798 684013672 683525467 683174973
2434.1 683174973 682992783 682756195 682600327 682318649 681813583 681148529 681049728 681162109 681254501 681616058
2443.7 681616058 681213837 680763931 680430679 680083923 679652405 679070969 679118500 679020996 679265518 679665604
2453.4 679665604 679371796 679063492 679041672 679096756 678441544 677604904 677493057 677638321 677140732 676852951
$$ packed form
2385.9F91416626m26712j14136k24304l37753r8267l21274r0103n6381J55868m5852
2395.5F89857712j04676J98212j02463k06832n83802k83737j82419j54724K76337k51923
2405.2F88461685j99127K7008P2403N5618j97983l23562p43179m53186M1656n29556
2414.8F86211777l55301M98657j8768k46125O3630j04752j05667k11334k07520m38080
2424.5F85086517n30777l29589k80915k30179P9346O08597Q9798m79126m88205l50494
2434.1F83174973j82190k36588j55868k81678n05066o65054r8801J12381R2392L61557
2443.7F81616058m02221m49906l33252l46756m31518n81436M7531r7504K44522M00086
2453.4F79665604k93808l08304k1820N5084o55212q36640j11847J45264m97589k87781
$$ plain form
2463 676852951 677183075 677136307 677087936 676853333 676422653 675844650 675408478 675310440 675085144 675065994 674781723
2473.6 674781723 674785767 675068970 674852066 674695129 674775467 674943771 674736252 674295120 673666382 673193665
2483.3 673193665 672938919 672477493 672393875 672729874 673116379 673159637 673050003 672636185 672231598 672265091
2492.9 672265091 672028427 671762466 671353912 671043243 670865860 670765305 671094360 671317673 671384125 671038055
2502.6 671038055 670714340 670407181 669973907 669885406 669561768 669204941 669187317 669543762 669864655 669922485
2512.2 669922485 669759140 669382172 669207077 668864899 668382797 667885742 667697144 667809067 667616882 667572403
2521.9 667572403 667631073 667554550 667315826 667252655 667551498 667427521 666992569 666682510 666256638 665810852
2531.5 665810852 665493240 665296249 665442200 665467377 665375290 665503922 665297928 664707108 664034576 663653183
$$ packed form
2463F76852951L30124m6768m8371k34603m30680n78003m36172r8038k25296j9150k84271
2473.6F74781723M044K83203k16904j56937Q0338J68304k07519m41132o28738m72717
2483.3F73193665k54746m61426q3618L35999L86505M3258j09634m13818m04587L3493
2492.9F72265091k36664k65961m08554l10669j77383j00555L29055K23313O6452l46070
2502.6F71038055l23715l07159m33274q8501l23638l56827j7624L56445L20893N7830
2512.2F69922485j63345l76968j75095l42178m82102m97055j88598J11923j92185m4479
2521.9F67572403N8670p6523k38724o3171K98843j23977m34952l10059m25872m45786
2531.5F65810852l17612j96991J45951K5177r2087J28632k05994n90820o72532l81393
$$ plain form
2541.1 663653183 663487930 663293152 663077087 662934494 663077087 663175201 663003845 662731552 662696228 662499390
2550.8 662499390 661994858 661510010 661130905 661144409 660882034 660700836 661075821 661328812 661191101 660658417
2560.4 660658417 660295410 660074539 659802933 659259720 658688812 658523560 658464584 658423004 658232880 658516541
2570.1 658516541 658850632 658431015 657691116 657013931 656981506 657102585 656898804 656568375 656261978 655998611
2579.7 655998611 655841980 655724335 655518723 655781860 655745163 655144119 654682693 654163742 653863678 653816833
2589.4 653816833 653686066 653616714 653702698 653645477 653645859 653452148 652985764 652756958 652510147 652537079 652334137
2600 652334137 651710434 651467819 651499252 651251068 650732727 650848083 650974121 650604401 650146179 649818268
2609.6 649818268 649700546 649146118 648411255 648061142 648291016 648446121 648204422 647840881 647276154 646992798
$$ packed form
2541.1F63653183j65253j94778k16065j42593J42593R8114j71356k72293l5324j96838
2550.8F62499390n04532m84848l79105J3504k62375j81198L74985K52991j37711n32684
2560.4F60658417l63007k20871k71606n43213n70908j65252n8976m1580j90124K83661
2570.1F58516541L34091m19617p39899o77185l2425J21079k03781l30429l06397k63367
2579.7F55998611j56631j17645k05612K63137l6697o01044m61426n18951l00064m6845
2589.4F53816833j30767o9352Q5984n7221L82j93711m66384k28806k46811K6932k02942
2600F52334137o23703k42615L1433k48184n18341J15356J26038l69720m58222l27911
2609.6F49818268j17722n54428p34863l50113K29874J55105k41699l63541n64727k83356
$$ plain form
2619.3 646992798 646853027 646702042 646191711 645602341 645385056 645041428 644701004 644476624 644495316 644143524
2628.9 644143524 643815765 643685913 642984924 642515335 642079773 641782150 641595459 641039963 640570679 640150604
2638.5 640150604 639935570 639775810 639254837 638735352 638870163 638789940 638028946 637472420 637211761 636985817
2648.2 636985817 636482811 636329308 636278419 635779419 635486755 635146103 634490356 634024963 633938065 633350677
2657.8 633350677 632761269 632639771 632189140 631761475 631477737 631223869 630942154 630920258 630728912 630213890
2667.5 630213890 630151215 629870987 629414291 628946037 628460159 628153648 627869072 627750015 627560883 627336311
2677.1 627336311 627041092 626561737 626133804 625961304 625499649 625238991 625554695 625121956 624900475 625018730
2686.8 625018730 624747314 624490814 624154549 623990898 623525200 623349342 623481674 622817078 622147636 621922874
$$ packed form
2619.3F46992798j39771j50985n10331n89370k17285l43628l40424k24380J8692l51792
2628.9F44143524l27759j29852p00989m69589m35562k97623j86691n55496m69284m20075
2638.5F40150604k15034j59760n20973n19485J34811q0223p60994n56526k60659k25944
2648.2F36985817n03006j53503n0889m99000k92664l40652o55747m65393q6898n87388
2657.8F33350677n89408j21498m50631m27665k83738k53868k81715k1896j91346n15022
2667.5F30213890o2675k80228m56696m68254m85878l06511k84576j19057j89132k24572
2677.1F27336311k95219m79355m27933j72500m61655k60658L15704m32739k21481J18255
2686.8F25018730k71416k56500l36265j63651m65698j75858J32332o64596o69442k24762
$$ plain form
2696.4 621922874 621654358 621593666 621574326 620700531 620127945 620183220 620162888 620143089 619594650 619059830
2706 619059830 618699799 618422203 617938423 617254295 617103081 617120399 617129517 616679916 616242256 615876122
2715.7 615876122 615282898 615241547 615102921 614639702 614042358 613584900 613322258 613207893 613477020 613409081
2725.3 613409081 613085632 612625732 612076073 611469460 610726547 610400925 610183601 609809380 609479408 609309807
2735 609309807 609396896 609530945 609412346 609292526 609159470 608470535 607723351 607537880 607481117 606766014
2744.6 606766014 606390686 607139130 607428436 606990166 606599426 606167259 605405273 604697800 604361916 604038773
2754.3 604038773 603866806 603729897 603435478 603213501 603221359 603336220 603300095 603055763 602567329 602100029
2763.9 602100029 601609268 600935440 600433121 600417824 600515213 600169182 599935684 600182686 600294991 599946213
$$ packed form
2696.4F21922874k68516o0692j9340q73795n72586N5275k0332j9799n48439n34820
2706F19059830l60031k77596m83780o84128j51214J7318R118m49601m37660l66134
2715.7F15876122n93224m1351j38626m63219n97344m57458k62642j14365K69127o7939
2725.3F13409081l23449m59900n49659o06613p42913l25622k17324l74221l29972j69601
2735F09309807Q7089J34049j18599j19820j33056o88935p47184j85471n6763p15103
2744.6F06766014l75328P48444K89306m38270l90740m32167p61986p07473l35884l23143
2754.3F04038773j71967j36909k94419k21977P858J14861l6125k44332m88434m67300
2763.9F02100029m90761o73828n02319j5297R7389l46031k33498K47002J12305l48778
$$ plain form
2773.5 599946213 599243774 598388214 597678909 597272568 597215157 596956673 596391525 596451187 596454430 596150818
2783.2 596150818 596000862 595339203 594690857 594083290 593232384 592602615 592044029 591778603 591556053 590949516
2792.8 590949516 590727806 591045189 590985031 590300255 589450035 588808632 588093987 586992416 585934029
2801.5 585934029 585365105 585327454 585114403 584750862 584469604 583638916 582736053 581983414 580963097 579768333
2811.2 579768333 578451729 577388878 576988678 576657028 575941620 575356903 574696045 573870659 573068924
2819.8 573068924 572019272 570946503 569634705 567947922 566482391 565343285 564071770 562507477
2827.6 562507477 560942535 559730492 558616867 556885529 554737053 552660789 550730400 548594856
2835.3 548594856 545941734 543171806 540743179 538379517 534931107 530600586 525784760 519812012
$$ packed form
2773.5E99946213p02439q55560p09305m06341n7411k58484n65148N9662L243l03612
2783.2E96150818j49956o61659o48346o07567q50906o29769n58586k65426k22550o06537
2792.8E90949516k21710L17383o0158o84776q50220o41403p14645j101571j058387
2801.5E85934029n68924l7651k13051l63541k81258q30688r02863p52639j020317j194764
2811.2E79768333j316604j062851m00200l31650p15408n84717o60858q25386q01735
2819.8E73068924j049652j072769j311798j686783j465531j139106j271515j564293
2827.6E62507477j564942j212043j113625j731338k148476k076264j930389k135544
2835.3E48594856k653122k769928k428627k363662l448410m330521m815826n972748
$$ plain form
2843 519812012 513231583 506288948 498641090 490305901 481485901 472870979 464560966 456957932 450525894
2851.7 450525894 444774323 440371895 438457832 438795090 440642281 443811035 447831993 452572365
2859.4 452572365 457781219 462882309 467715645 471653862 475100899 478134956 480249443 481412315
2867.1 481412315 481600266 481746407 481448402 480225258 479792175 480421295 481028481 481685944 482463188
2875.8 482463188 482746582 482776184 482645378 482145996 481870728 481362839 480439835 479454308 478081398 476847687
2885.4 476847687 475565453 474250717 473023834 471089554 469298744 467690849 465508080 463195648
2893.1 463195648 461258125 459655457 457805634 455955849 454053726 451703796 449165382 446536560
2900.8 446536560 443807030 441168556 438637390 435401688 432028465 428801460 425050125 421701698
$$ packed form
2843E19812012o580429o942635p647858q335189q820000q614922q310013p603034o432038
2851.7D50525894n751571m402428j914063L37258J847191L168754M020958M740372
2859.4D52572365N208854N101090M833336L938217L447037L034057K114487J162872
2867.1D81412315J87951J46141k98005j223144m33083O29120O07186O57463P77244
2875.8D82463188K83394K9602j30806m99382k75268n07889r23004r85527j372910j233711
2885.4D76847687j282234j314736j226883j934280j790810j607895k182769k312432
2893.1D63195648j937523j602668j849823j849785j902123k349930k538414k628822
2900.8D46536560k729530k638474k531166l235702l373223l227005l751335l348427
$$ plain form
2908.6 421701698 418187065 413799019 408912239 403570213 397756195 391332855 385084267 378646469
2916.3 378646469 371768456 365060616 358590240 352764931 347259941 342536812 338653030 335825348
2924 335825348 334281464 333618698 334410820 335143166 336381645 339469757 342926064 346642342 351050148
2932.7 351050148 355851631 361108360 366885338 372603760 378582726 384546356 390081825 395695610
2940.4 395695610 400939293 406114006 411248970 415622597 419784088 423750534 426916046 429489098
2948.1 429489098 431273537 432388344 433493767 434621468 435533524 436014633 436463013 437106590 438214188
2956.8 438214188 439952316 441965446 444186630 446607208 449600296 452938957 456560097 460225296
2964.5 460225296 463702965 467658386 471593437 475750542 480037880 483698349 487223129 491221352
$$ packed form
2908.6D21701698l514633m388046m886780n342026n814018o423340o248588o437798
2916.3C78646469o878013o707840o470376n825309n504990m723129l883782k827682
2924C35825348j543884o62766P92122P32346J238479L088112L456307L716278M407806
2932.7C51050148M801483N256729N776978N718422N978966N963630N535469N613785
2940.4C95695610N243683N174713N134964M373627M161491L966446L165512K573052
2948.1D29489098J784439J114807J105423J127701R12056M81109M48380O43577J107598
2956.8D38214188J738128K013130K221184K420578K993088L338661L621140L665199
2964.5D60225296L477669L955421L935051M157105M287338L660469L524780L998223
$$ plain form
2972.2 491221352 495134888 497794876 500083046 502722549 505479736 507976799 510266685 512907410
2979.9 512907410 515089836 517096100 519371643 521255455 522855186 524122887 525170441 526650238
2987.6 526650238 527931595 528545380 529535751 530727692 531496277 531824265 531962395 532089043 531774445
2996.3 531774445 531156349 530435028 529662437 528673477 527370529 526103401 525191956 524360580 523025169
3005 523025169 521725655 520791817 520473366 520691490 520555496 520245857 520392685 521137276 522080536 523413429
3014.6 523413429 525113487 526756592 528228149 529326477 530519905 531626587 532428932 532383842 531916924
3023.3 531916924 532366524 532835999 532905464 532747345 532580147 532603378 532646790 532439766 532029800 532197762
3033 532197762 532007790 531178131 530369873 529586983 529055824 528450317 527987595 527890282 527986336 527888184
$$ packed form
2972.2D91221352L913536K659988K288170K639503K757187K497063K289886K640725
2979.9E12907410K182426K006264K275543J883812J599731J267701J047554J479797
2987.6E26650238J281357O13785R90371J191941P68585L27988J38130J26648l14598
2996.3E31774445o18096p21321p72591r88960j302948j267128r11445q31376j335411
3005E23025169j299514r33838l18451K18124j35994l09639J46828P44591R43260J332893
3014.6E23413429J700058J643105J471557J098328J193428J106682Q02345m5090m66918
3023.3E31916924M49600M69475O9465j58119j67198K3231M3412k07024m09966J67962
3033E32197762j89972q29659q08258p82890n31159o05507m62722r7313R6054r8152
$$ plain form
3042.6 527888184 527104950 526146393 525294800 524357033 523750191 523294296 522412033 521781502 521289330 520469627
3052.2 520469627 519927826 519641724 518945999 517767868 516759186 515881500 514963150 514511337 514509468 513957443
3061.9 513957443 513157425 512803879 512032242 511161919 510242157 509494400 509021797 507846031 506900520
3070.6 506900520 506149483 505273590 504868889 504897118 505098915 505091972 504616280 503484039 502305946 501072502
3080.2 501072502 499927444 499173508 499051399 499224701 498516922 497830315 497056961 496464081 496237068
3088.9 496237068 495475883 494848061 493772430 492785034 491817322 490668755 490232773 489670715 489183350
3097.6 489183350 488839836 488667908 488248062 487378082 486671867 485533867 484327621 483805122 483480148
3106.2 483480148 482255173 481066971 480756149 480499840 480164757 479766159 479238358 478206062 477353363
$$ packed form
3042.6E27888184p83234r58557q51593r37767o06842m55895q82263o30531m92172q19703
3052.2E20469627n41801k86102o95725j178131j008682q77686r18350m51813j869n52025
3061.9E13957443q00018l53546p71637q70323r19762p47757m72603j175766r45511
3070.6E06900520p51037q75893m04701K8229K01797o943m75692j132241j178093j233444
3080.2E01072502j145058p53936j22109J73302p07779o86607p73354n92880k27013
3088.9D96237068p61185o27822j075631r87396r67712j148567m35982n62058m87365
3097.6D89183350l43514j71928m19846q69980p06215j138000j206246n22499l24974
3106.2D83480148j224975j188202l10822k56309l35083l98598n27801j032296q52699
$$ plain form
3114.9 477353363 476393242 475116730 474253845 473200150 472854538 472843208 472277222 471547928 470466309
3123.6 470466309 469419594 468582001 467531662 466315918 465547752 464745789 463893089 463301201 462941055
3132.3 462941055 462702675 461953812 461131973 459913139 459033585 458146782 456427917 455792046 455336113
3141 455336113 454651871 454050064 453095512 452493973 452036476 451411552 450467796 449547844 448327141 447030640
3150.6 447030640 446273193 445597534 444867439 443741989 443020210 442772751 442314949 441578712 440733070
3159.3 440733070 440148010 438823013 437462997 436974678 436094475 434697800 433407860 432689514 432502289
3168 432502289 432017479 431205826 430536957 429954758 429279785 428003693 426577950 425729561 425311012 424868202
3177.6 424868202 423812332 422973099 422502899 421930161 421189232 419996262 418869820 417912216 417160301
$$ packed form
3114.9D77353363r60121j276512q62885j053695l45612j1330n65986p29294j081619
3123.6D70466309j046715q37593j050339j215744p68166q01963q52700n91888l60146
3132.3D62941055k38380p48863q21839j218834q79554q86803j718865o35871m55933
3141D55336113o84242o01807r54552o01539m57497o24924r43756r19952j220703j296501
3150.6D47030640p57447o75659p30095j125450p21779k47459m57802p36237q45642
3159.3D40733070n85060j324997j360016m88319q80203j396675j289940p18346j87225
3168D32502289m84810q11653o68869n82199o74973j276092j425743q48389m18549m42810
3177.6D24868202j055870q39233m70200n72738p40929j192970j126442r57604p51915
$$ plain form
3186.3 417160301 416572685 415736771 414531403 413763275 413597488 412873077 412150917 411746254 411053658
3195 411053658 409937668 408638344 407448540 406782684 406633644 405816269 404803314 404044991 403792152
3203.6 403792152 403570328 402676125 402370758 401496124 400378304 399840126 398835678 398046951 397437286
3212.3 397437286 396708412 395573463 394839058 394529839 394069901 393973885 393448029 392480545 391439857
3221 391439857 390825195 390056419 388607674 387990417 387900047 387758598 387442665 386721954 386040115 385533943
3230.7 385533943 384936295 384130058 383230171 382315407 381556587 380916634 380422630 379953995 379736671 379202309
3240.3 379202309 378053246 377474861 376975288 376312485 375343132 374364128 374085388 373530464 372836189
3249 372836189 372314796 371608810 371004715 370845032 370266151 369559135 369056358 367756386 367039146 366641426
$$ packed form
3186.3D17160301n87616q35914j205368p68128j65787p24411p22160m04663o92596
3195D11053658j115990j299324j189804o65856j49040q17375j012955p58323k52839
3203.6D03792152k21824q94203l05367q74634j117820n38178j004448p88727o09665
3212.3C97437286p28874j134949p34405l09219m59938r6016n25856r67484j040688
3221C91439857o14662p68776j448745o17257r0370j41449l15933p20711o81839n06172
3230.7C85533943n97648q06237q99887r14764p58820o39953m94004m68635k17324n34362
3240.3C79202309j149063n78385m99573o62803r69353r79004k78740n54924o94275
3249C72836189n21393p05986o04095j59683n78881p07016n02777j299972p17240l97720
$$ plain form
3258.6 366641426 365846214 365157585 364428635 363965607 363279610 362984848 363034859 362761040 362016373 361219330
3268.3 361219330 361131439 360414810 359440842 359118919 359114761 358835907 357910576 356928787 355965576 355706215
3277.9 355706215 355299149 354517479 354515724 354551163 354097900 353247643 352694283 352098961 351284981 351037598
3287.5 351037598 350891151 350811119 350687904 350165710 349342880 348607864 348403015 348116608 347485542 347117958
3297.2 347117958 346547813 345657921 345531235 345522766 345094414 345341988 345379982 344151688 343209000 342921906
3306.8 342921906 342474899 342251587 342148743 341758118 341278152 340695724 339859161 339440727 339144783 338494606
3316.5 338494606 338247261 337710571 337103233 336763496 336255875 336210937 336253166 336102943 335721664 335297737
3326.1 335297737 334405441 333165359 332726250 332427940 332055931 331431351 330946617 330798607 330487213
$$ packed form
3258.6C66641426p95212o88629p28950m63028o85997k94762N0011k73819p44667p97043
3268.3C61219330q7891p16629r73968l21923m158k78854r25331r81789r63211k59361
3277.9C55706215m07066p81670j755L5439m53263q50257n53360n95322q13980k47383
3287.5C51037598j46447q0032j23215n22194q22830p35016k04849k86407o31066l67584
3297.2C47117958n70145q89892j26686q469m28352K47574L7994j228294r42688k87094
3306.8C42921906m47007k23312j02844l90625m79966n82428q36563m18434k95944o50177
3316.5C38494606k47345n36690o07338l39737n07621m4938M2229j50223l81279m23927
3326.1C35297737q92296j240082m39109k98310l72009o24580m84734j48010l11394
$$ plain form
3334.8 330487213 330261459 329355812 328465347 328128891 327687531 327164497 326835289 326653595 325996704 325493774
3344.4 325493774 325152512 324670258 324007111 323167801 322683105 321950455 321142921 320710945 320359192 320032425
3354.1 320032425 319651718 318945637 318317909 318268394 317780628 316820030 316417446 316397572 315658436 314752369
3363.7 314752369 314491081 313974533 313448315 312992001 312428741 311939297 311507092 311125050 310373497 309729996
3373.4 309729996 309309025 308818455 308459473 308156471 307679768 307436867 307159882 306452770 306027889 305116634
3383 305116634 304412270 304579353 304299316 303696938 303235664 303288651 303235245 303065796 302594051 302182941
3392.7 302182941 302545910 302262173 302129517 301723919 300807056 300581455 300303993 300208950 300073872 300015469
3402.3 300015469 300052204 299665508 299493790 299751682 299911003 299534359 298747959 298046150 298374901 298840828
$$ packed form
3334.8C30487213k25754r05647q90465l36456m41360n23034l29208j81694o56891n02930
3344.4C25493774l41262m82254o63147q39310m84696p32650q07534m31976l51753l26767
3354.1C20032425l80707p06081o27728m9515m87766r60598m02584j9874p39136r06067
3363.7C14752369k61288n16548n26218m56314n63260m89444m32205l82042p51553o43501
3373.4C09729996m20971m90570l58982l03002m76703k42901k76985p07112m24881r11255
3383C05116634p04364J67083k80037o02378m61274N2987n3406j69449m71745m11110
3392.7C02182941L62969k83737j32656m05598r16863k25601k77462r5043j35078n8403
3402.3C00015469L6735l86696j71718K57892J59321l76644p86400p01809L28751M65927
$$ plain form
3412 298840828 298345089 297861462 297965565 297977276 297398777 297102604 297138062 297342033 297482204 297132168
3421.6 297132168 297004681 297079716 296953259 296739788 296987572 297165890 297274494 297354755 297309208 298068981
3431.2 298068981 298243046 298034153 298317070 298563137 299193993 299795189 300119915 299867859 299282303 299422951
3440.9 299422951 299904709 299688301 299772511 300365047 300775681 301194916 300674305 301118565 302243938 302447834
3450.5 302447834 302912312 303081818 303415947 304282246 304749336 304627018 304485016 304748440 305223961 306200428
3460.2 306200428 307003765 307726479 308170357 308713169 309908104 310550098 310602627 310255623 310597782 311470490
3469.8 311470490 312260246 312912045 312809563 313116608 314138088 315070267 315370140 315747566 316275063
3478.5 316275063 316565228 317441578 318639450 319496288 319577389 320340958 321352081 321734505 322772751
$$ packed form
3412B98840828m95739m83627J04103J1711n78499k96173L5458K03971J40171l50036
3421.6B97132168j27487P5035j26457k13471K47784J78318J08604Q0261m5547P59773
3431.2B98068981J74065k08893K82917K46067O30856O01196L24726k52056n85556J40648
3440.9B99422951M81758k16408Q4210N92536M10634M19235n20611M44260J125373K03896
3450.5C02447834M64478J69506L34129Q66299M67090j22318j42002K63424M75521R76467
3460.2C06200428Q03337P22714M43878N42812J194935O41994N2529l47004L42159Q72708
3469.8C11470490P89756O51799j02482L07045J021480R32179K99873L77426N27497
3478.5C16275063K90165Q76350J197872Q56838Q1101P63569J011123L82424J038246
$$ plain form
3487.2 322772751 323491745 323750343 324005470 324626236 325763206 326203117 326352654 327363968 328630028
3495.8 328630028 329018097 329683571 330836258 331764526 332523880 333473473 334306908 334141006 334264755
3504.5 334264755 335155525 336378517 337454910 338871384 339522247 338996124 340326309 341450996 342418671
3513.2 342418671 343809929 344275246 344879875 345240822 345727501 346775780 348263779 349397850 349958267
3521.9 349958267 350640488 351405411 352828026 354136658 355087090 355442734 356108284 357338219 358495293
3530.6 358495293 359779320 360273590 361032791 361892815 362897682 363748016 364297791 365597229 366439171
3539.2 366439171 367306061 367928505 369314919 370772972 371714516 373220901 373696594 375119362 375349312
3547.9 375349312 376372414 378816528 380130768 381870575 381942368 382735291 384113350 385635414 387755737
$$ packed form
3487.2C22772751P18994K58598K55127O20766J136970M39911J49537J011314J266060
3495.8C28630028L88069O65474J152687R28268P59354R49593Q33435j65902J23749
3504.5C34264755Q90770J222992J076393J416474O50863n26123J330185J124687R67675
3513.2C42418671J391258M65317O04629L60947M86679J048279J487999J134071N60417
3521.9C49958267O82221P64923J422615J308632R50432L55644O65550J229935J157074
3530.6C58495293J284027M94270P59201Q60024J004867Q50334N49775J299438Q41942
3539.2C66439171Q66890O22444J386414J458053R41544J506385M75693J422768K29950
3547.9C75349312J023102K444114J314240J739807P1793P92923J378059J522064K120323
$$ plain form
3556.6 387755737 388322983 389600372 390642509 391265259 392240562 394868889 396690331 396174469 399178581
3565.3 399178581 400587807 400508804 401231194 401364021 404943924 406813622 407777901 409757385 411707573
3574 411707573 412620735 413394356 415570869 416816444 419043884 420613556 421289253 423562241 425638313
3582.6 425638313 426992989 427536430 430693398 432361565 431372757 434031830 434259109 436677475 439479599
3591.3 439479599 442182198 444342308 444661865 447564240 447267265 448402710 451645470 452516022 454782257
3600 454782257 456034813 457576370 460097198 462181435 464319305 466963539 468934441 467770653 471297188
3608.7 471297188 472161179 471184273 477065506 478716736 476880112 479917603 480953331 484128380 487486992
3617.4 487486992 487474823 488662415 488492508 489765472 493685226 496191330 497941933 500423584 502277603
$$ packed form
3556.6C87755737N67246J277389J042137O22750R75303K628327J821442n15862L004112
3565.3C99178581J409226p9003P22390J32827L579903J869698R64279J979484J950188
3574D11707573R13162P73621K176513J245575K227440J569672O75697K272988K076072
3582.6D25638313J354676N43441L156968J668167r88808K659073K27279K418366K802124
3591.3D39479599K702599K160110L19557K902375k96975J135445L242760Q70552K266235
3600D54782257J252556J541557K520828K084237K137870K644234J970902j163788L526535
3608.7D71297188Q63991r76906N881233J651230j836624L037491J035728L175049L358612
3617.4D87486992j2169J187592j69907J272964L919754K506104J750603K481651J854019
$$ plain form
3626 502277603 503936539 509200287 509770508 500867844 504548988 508767166 513478508 515299644 513809776
3634.7 513809776 515853577 518092270 519926605 520686417 522401848 524999924 526509743 527294159 528207092
3643.4 528207092 530360489 532286873 536216240 536040077 532898064 537502670 536717644 535464134 536644783
3652.1 536644783 541096573 544613113 547130814 551016922 545456390 546250801 550019150 550923042 552099495
3660.8 552099495 552796097 555213699 556184654 557208176 558868942 559735222 563341370 564649963 563460007
3669.4 563460007 563556709 559843292 562744942 569227142 575560760 576371574 562949905 562490463 568695831
3678.1 568695831 572898750 571556740 571557426 573922882 575943260 577359009 578172188 578245010 580972366
3686.8 580972366 587100487 580886765 575670090 581224136 577834778 578564110 583650055 584970703
$$ packed form
3626E02277603J658936N263748N70221q902664L681144M218178M711342J821136j489868
3634.7E13809776K043801K238693J834335P59812J715431K598076J509819P84416R12933
3643.4E28207092K153397J926384L929367j76163l142013M604606p85026j253510J180649
3652.1E36644783M451790L516540K517701L886108n560532P94411L768349R03892J176453
3660.8E52099495O96602K417602R70955J023522J660766Q66280L606148J308593j189956
3669.4E63460007R6702l713417K901650O482200O333618Q10814j3421669m59442O205368
3678.1E68695831M202919j342010O86K365456K020378J415749Q13179P2822K727356
3686.8E80972366O128121o213722n216675N554046l389358P29332N085945J320648
$$ plain form
3694.5 584970703 586399765 586156883 585888824 587143211 587364464 589435654 591426926 587564850 585857315
3703.2 585857315 589560394 591041031 590750351 590834312 592561226 596285286 591447182 593319778 597374229
3711.9 597374229 587039375 589707413 593123817 592622108 593321342 595927315 597389069 594759827
3719.6 594759827 595815849 601081543 598356667 593570518 597254944 598126640 598052216 596371880 595779762
3728.3 595779762 598280258 598466110 602712746 601580353 596116142 603342857 604122696 595539742 595052261
3736.9 595052261 596991158 597430687 599489403 602441902 600819130 603064957 610954247 602373619
3744.7 602373619 590299263 598777351 603024750 607977219 606545410 594541168 602784462 601253471
3752.4 601253471 596082039 600991325 604204102 606543922 601719933 603071251 608592224 602646179
$$ packed form
3694.5E84970703J429062k42882k68059J254387K21253K071190J991272l862076j707535
3703.2E85857315L703079J480637k90680Q3961J726914L724060m838104J872596M054451
3711.9E97374229j0334854K668038L416404n01709O99234K605973J461754k629242
3719.6E94759827J056022N265694k724876m786149L684426Q71696p4424j680336n92118
3728.3E95779762K500496J85852M246636j132393n464211P226715P79839q582954m87481
3736.9E95052261J938897M39529K058716K952499j622772K245827P889290q580628
3744.7F02373619j2074356Q478088M247399M952469j431809j2004242Q243294j530991
3752.4F01253471n171432M909286L212777K339820m823989J351318N520973n946045
$$ plain form
3760.1 602646179 600303459 603837585 605467834 605753098 607863426 605127182 601764069 604627838
3767.8 604627838 608725967 609402885 601883736 602948799 605914841 605845413 606013451 605973396 607521477
3776.5 607521477 608239670 609861641 609809761 604232941 606437149 608220749 607999649 609236565 607043571
3785.2 607043571 606309662 607527428 607811203 608127480 608400154 608989677 608660393 609178505 609542236
3793.8 609542236 609675522 611566391 608291359 605713348 607929916 610737724 615334015 610240669
3801.5 610240669 602302132 605316963 607939034 611883011 615506058 607545319 603800735 608035583
3809.3 608035583 610318909 610553322 611236687 611545486 611874924 615568619 615046654 603966408 607058258
3817.9 607058258 611215591 614036598 615021400 601423378 603418312 608542480 610398521 612683868
$$ packed form
3760.1F02646179k342720L534126J630249K85264K110328k736244l363113K863769
3767.8F04627838M098129O76918p519149J065063K966042o9428J68038m0055J548081
3776.5F07521477P18193J621971n1880n576820K204208J783600k21100J236916k192994
3785.2F07043571p33909J217766K83775L16277K72674N89523l29284N18112L63731
3793.8F09542236J33286J890869l275032k578011K216568K807808M596291n093346
3801.5F10240669p938537L014831K622071L943977L623047p960739l744584M234848
3809.3F08035583K283326K34413O83365L08799L29438L693695n21965j1080246L091850
3817.9F07058258M157333K821007R84802j3598022J994934N124168J856041K285347
$$ plain form
3825.7 612683868 612517548 609658318 610071869 611557274 614250908 615140724 607663193 609104652 615119553
3834.3 615119553 610853233 610087852 617360229 611134567 606406212 613129311 609756584 607673035
3842.1 607673035 611553841 610191269 608374290 611319885 612481461 611378670 612775078 612638321
3849.8 612638321 614246712 619700279 615925446 614818878 601626511 602775192 611499443 611018486
3857.5 611018486 609448090 611080055 613699684 617079010 612419281 610358124 615299950 611961823
3865.2 611961823 606974945 609658661 613343506 617688789 611758270 604261017 607955284 613878975
3872.9 613878975 617768440 610059319 609673424 612583351 611667824 612679558 615878448 612285995 607105637
3881.6 607105637 611568069 612062531 612525368 617125969 608056717 608975143 612636185 612685547 615600090
$$ packed form
3825.7F12683868j66320k859230M13551J485405K693634Q89816p477531J441459O014901
3834.3F15119553m266320p65381P272377o225662m728355O723099l372727k083549
3842.1F07673035L880806j362572j816979K945595J161576j102791J396408j36757
3849.8F12638321J608391N453567l774833j106568j3192367J148681Q724251m80957
3857.5F11018486j570396J631965K619629L379326m659729k061157M941826l338127
3865.2F11961823m986878K683716L684845M345283n930519p497253L694267N923691
3872.9F13878975L889465p709121l85895K909927r15527J011734L198890l592453n180358
3881.6F07105637M462432M94462M62837M600601r069252R18426L661042M9362K914543
$$ plain form
3890.3 615600090 614261703 607428703 608441353 611710167 612234802 613437309 614061012 615911560 617619057
3898.9 617619057 609097672 611669388 613306007 608518219 612112389 610887604 610325394 611049347 611218872
3907.6 611218872 612760277 612162552 611592216 611537094 612084770 612175751 611413956 612160034 613673477 611290398
3917.3 611290398 608752327 612517891 612896538 609515991 610612984 611251030 611943779 610414734 608063469
3926 608063469 609516678 610834579 612086830 611681862 611216621 612480850 610011292 608875198 610630951
3934.6 610630951 610701141 610821533 610674095 609999924 610594826 610561752 611714668 613134918 610211258
3943.3 610211258 609521790 610060692 610506210 611481056 609755707 610497131 610558968 608120193 609711075
3952 609711075 610851555 610339127 610430527 610748100 610739670 610269661 610132599 609512672 609786797 609693336
$$ packed form
3890.3F15600090j338387o833000J012650L268814N24635J202507O23703J850548J707497
3898.9F17619057q521385K571716J636619m787788L594170j224785n62210P23953J69525
3907.6F11218872J541405n97725n70336n5122N47676R0981p61795P46078J513443k383079
3917.3F11290398k538071L765564L78647l380547J096993O38046O92749j529045k351265
3926F08063469J453209J317901J252251m04968m65241J264229k469558j136094J755753
3934.6F10630951P0190J20392j47438o74171N94902l3074J152916J420250k923660
3943.3F10211258o89468N38902M45518R74846j725349P41424O1837k438775J590882
3952F09711075J140480n12428R1400L17573q430m70009j37062o19927K74125r3461
$$ plain form
3961.6 609693336 608619766 609503021 610498352 611000023 610960655 610199814 610189209 610312614 609883308 609071960
3971.3 609071960 608662872 609305305 610039978 610407753 610296745 610001755 609663544 609654198 610199890 609553185
3980.9 609553185 608683777 608397026 607950134 608493309 608686981 608873558 609946861 610134583 609713058
3989.6 609713058 609476089 609721909 609414291 608665886 608755875 609039726 609033623 608983498 609156837 609214134
3999.2 609214134 609295807
4000.2 609295807
$$ packed form
3961.6F09693336j073570Q83255R95331N01671l9368p60841j0605J23405m29306q11348
3971.3F09071960m09088O42433P34673L67775j11008k94990l38211r346N45692o46705
3980.9F09553185q69408k86751m46892N43175J93672J86577J073303J87722m21525
3989.6F09713058k36969K45820l07618p48405Q9989K83851o103n0125J73339N7297
3999.2F09214134Q1673
4000.2F09295807
##END=$$ End of the data block
