##TITLE=$$ Begin of the data block
##JCAMP-DX=5.00 $$ ACD/SpecManager v 10.08
##SPECTROMETER/DATA SYSTEM=Varian
##DATE=04 Dec 2012 13:51:48
##DATA TYPE=INFRARED SPECTRUM
##DATA CLASS=XYDATA
##ORIGIN=
##OWNER=
##NPOINTS=3735
##FIRSTX=399.26403809
##LASTX=4000.35498047
##MAXX=4000.35498047
##MINX=399.26403809
##MAXY=74.91736603
##MINY=33.80606461
##XFACTOR=1.0000000000
##YFACTOR=0.000000100000000
##FIRSTY=63.54766464
##DELTAX=0.96440572
##XUNITS=1/CM
##YUNITS=TRANSMITTANCE
##XYDATA=(X++(Y..Y))
399.3F35476646P457009q931313k355270L98292J040345j337777k874031p593155q120880
407.9F13159866L123131P623558P024155K68211m565239j072922j626968j809540m57382
416.6F21666870N42603M841957J0310249j1463394o833458M164238j915321m290734
424.3F17023010j708526r12171L108483J752777P23953k491455m279747m81682J284752
433F14019394r12094l119164K019425L003807j113396L013687M800453j907196n585327
441.7F14219589l747673q40263L411369P68051j882629L679924M751320j592064l274155
450.4F15493469K475281K197762L310737J480217l664436j048393k315255j337204
458.1F16592178J039658l063202n34973K652359K690010N32455j302528k28271q02727
$$ y = [635476646, 642933655, 634002342, 631647072, 632045364, 633085709, 631747932, 628873901, 621280746, 613159866, 616282997, 623906555, 630930710, 631198921, 626633682, 625560760, 623933792, 622124252, 621666870, 622209473, 627051430, 637361679, 625898285, 619064827, 623229065, 621313744, 617023010, 615314484, 614402313, 617510796, 619263573, 619987526, 617496071, 613216324, 612734642, 614019394, 613107300, 609988136, 612007561, 615011368, 613897972, 616911659, 621712112, 619804916, 614219589, 610471916, 609631653, 613043022, 613811073, 611928444, 615608368, 620359688, 618767624, 615493469, 617968750, 620166512, 623477249, 624957466, 621293030, 620244637, 617929382, 616592178, 617631836, 614568634, 614033661, 616686020, 619376030, 619908485, 618605957, 618377686, 617574959]
466.8F17574959l482933k733574M92439K686234J945228l353271j050682k083969m566880
475.5F05427551K434235L09563l991356Q28247L204880j203118m417992r47761k80685
484.1F01363564J173591O19049k876816j801948N69115M508209J332855k74048J401940
492.8F06015511m242325k799149L27912j070443o85310j818581k983513j070671l15857
501.5E91357574j71318K720757K204437L97873k237282n166206k015610J168900N74264
510.2E88833389j216240j307335l498992l984147J988106L109436j675987k691193
517.9E79557037k916336m017219j8273K97699k64129R13505l45154K50359j608505
526.6E71848984l509064k088547J927414L741303k80876r29909J091232R73091j037445
$$ y = [617574959, 614092026, 611358452, 611850891, 614537125, 616482353, 613129082, 612078400, 609994431, 605427551, 607861786, 608171349, 604179993, 605008240, 608213120, 607010002, 602592010, 601644249, 601363564, 602537155, 603156204, 600279388, 598477440, 599046555, 603554764, 604887619, 604613571, 606015511, 601773186, 598974037, 599301949, 598231506, 597546196, 595727615, 592744102, 591673431, 591357574, 591186256, 593907013, 596111450, 596509323, 594272041, 589105835, 587090225, 588259125, 588833389, 587617149, 586309814, 582810822, 578826675, 580814781, 583924217, 582248230, 579557037, 576640701, 572623482, 572605209, 572902908, 572638779, 573552284, 573207130, 573457489, 571848984, 568339920, 566251373, 568178787, 571920090, 571639214, 570709305, 571800537, 572773628, 571736183]
535.2E71736183J06583L824272J614876m88320R38797J943627J900367M3717R12971
543.9E82533073J457558j221924J02425J232681j129761k001915O86341J627922k2202
552.6E83264198l52668k447854k134056J04142p95060o31637J030464K076874j437950
561.3E78676453m486809k907753j292648k36626j758995j099358L62129j954193k615661
570E62686539j874657K22816P7134m09279p82852k531624n72739R78089J965293O41289
579.6E60400009m88663R64394J192360J620636J173592K333221K667961J157646P91245
588.3E71812401Q52699K07062J39999M16336J061287K565384l32870j154442J211586
597E76779442l16696m60472M20837N29022M29650j4992r82781j829452q22602J560555
$$ y = [571736183, 571842766, 575667038, 577281914, 576793594, 577732391, 579676018, 581576385, 581620102, 582533073, 583990631, 582768707, 582871132, 584103813, 582974052, 580972137, 581658478, 583286400, 583264198, 582911530, 580463676, 578329620, 578433762, 577638702, 577007065, 578037529, 580114403, 578676453, 574189644, 571281891, 569989243, 569752617, 567993622, 566894264, 567256393, 565302200, 562686539, 560811882, 561034698, 561111832, 560702553, 559919701, 557388077, 556815338, 557793427, 559758720, 560400009, 559911346, 560875740, 562068100, 563688736, 564862328, 567195549, 569863510, 571021156, 571812401, 572665100, 572872162, 573012161, 573428497, 574489784, 577055168, 576722298, 575567856, 576779442, 576462746, 576002274, 576423111, 576952133, 577381783, 577366791, 576384010, 574554558, 573731956, 575292511]
606.6E75292511K300644l29666l76930p325r34753J047096J878014O06842N60798J378594
616.3E81415825O32934Q00705O90461Q98475K361489P12776K37388J937714L449860
624.9E93137627K296905J089020J977882J05439q79288O50368K211113J402168L51372
633.6F02342606J029434O17142Q36677M05197j32561L4104M51164K005615J257553
642.3F08846931m97551j53961N05410M37622Q64868P55386K90146P39059P56188p9994
651.9F12464104q83332J34163J080132O49452Q1978o37093k51541N29175L50227J69487
661.6F13686752L08304R71375J573066N48668O59523M93851r832115J718750L975944
670.3F14104118J683312J520767M79546k59400L60489P63779K86789j64261j82266
$$ y = [575292511, 577593155, 577263489, 576886559, 576879234, 575944481, 576991577, 578869591, 579476433, 580037231, 581415825, 582048759, 582849464, 583539925, 584438400, 586799889, 587512665, 587750053, 589687767, 593137627, 595434532, 596523552, 598501434, 598606873, 597727585, 598377953, 600589066, 601991234, 602342606, 603372040, 603989182, 604825859, 605231056, 605098495, 605132599, 605583763, 607589378, 608846931, 608349380, 608195419, 608700829, 609138451, 610003319, 610758705, 611048851, 611787910, 612544098, 612464104, 611580772, 611714935, 612795067, 613444519, 613526497, 612889404, 612637863, 613167038, 613517265, 613686752, 613995056, 614966431, 616539497, 617088165, 617747688, 618241539, 608409424, 610128174, 614104118, 615787430, 617308197, 617787743, 617528343, 617888832, 618652611, 618939400, 618775139, 618592873]
678.9F18592873N95703J322517P26967J241760M05846o32401L23067k07786n74913
687.6F21793633K60696J23596r39560O3744J733017J549606N98335n27267m68521j503868
697.3F22683411k523651q60100j53923r5139k77252j009941n82810j23329q50677j276131
706.9F14930458J56899R31167J10207O77452J094856N51605J265984P61261j63498
715.6F20316391L46909J67465M02031R17930Q78754J371651J409301J475678K541847
724.3F29827957K315979R04999J39580Q58879K736587K384491J312256P66144J357269
733F42604141K387543N12009J48925J222458J572342J710129Q84857M80347Q91189
741.6F52413940J374p25403J667251L93448j696624n43137q14743n23605j73951R31321
$$ y = [618592873, 619188576, 620511093, 621238060, 622479820, 622885666, 622253265, 622576332, 622368546, 621793633, 622054329, 622177925, 621238365, 621302109, 623035126, 624584732, 625183067, 624655800, 624187279, 622683411, 620159760, 619299660, 619145737, 619050598, 618773346, 617763405, 617180595, 617057266, 616206589, 614930458, 615087357, 616018524, 616128731, 616806183, 617901039, 618452644, 619718628, 620479889, 620316391, 620663300, 620830765, 621232796, 622150726, 623029480, 624401131, 625810432, 627286110, 629827957, 632143936, 633048935, 633188515, 634047394, 636783981, 639168472, 640480728, 641246872, 642604141, 644991684, 645503693, 645652618, 646875076, 648447418, 650157547, 651042404, 651522751, 652413940, 652415314, 651689911, 653357162, 653750610, 652053986, 651510849, 650696106, 650172501, 649998550, 650929871]
751.3F50929871n67170k503509j117859j769638j441422j261444P79114K462082j667099
760F43842926j998749L968L83071l509l06015J011047R49173O83823R60922J839066
769.6F47365723K619323J925278R69315N18646R80377J234741J442871J935120J874161
778.3F60865555J469574J377105J767045J784744J204452J529084J174926j58920R89075
787F72002640J908493J131134O43387Q65097J525497Q50601k51999L64838J264191
795.6F80303879O37054M24652P63321J462479J614914J425552J776810J45645L38516
804.3F88892822P47910n1193J092453J190185O13861K34070J301193R98612o07453
813F94412460l18679o1265L90244J4496M55170P06634L0441J87836n7373m61273j229935
$$ y = [650929871, 650362701, 647859192, 646741333, 644971695, 643530273, 642268829, 643047943, 645510025, 643842926, 641844177, 641848145, 642231216, 642227707, 641921692, 642932739, 643881912, 644565735, 645526657, 647365723, 649985046, 651910324, 652879639, 653398285, 654378662, 655613403, 657056274, 658991394, 660865555, 662335129, 663712234, 665479279, 667264023, 668468475, 669997559, 671172485, 671013565, 672002640, 673911133, 675042267, 675685654, 676550751, 678076248, 678926849, 678674850, 679039688, 680303879, 680940933, 681365585, 682128906, 683591385, 685206299, 686631851, 688408661, 688554306, 688892822, 689640732, 689589539, 690681992, 691872177, 692486038, 692720108, 694021301, 695019913, 694412460, 694093781, 694032516, 694422760, 694437256, 694892426, 695599060, 695629501, 695817337, 695759964, 695298691, 694068756]
823.6F94068756m65469M19693m56314j286393l77044J82419r17359q52432j398315
832.3F88917542j688691j327591j928177j862869k39105N5084j330032m98657p03278
841F79394226j349258j616288k204055q35648l74832K11563j92566j118469l96347
849.6F71518326q30307j247788o41021k41166j047668m4556J050263R4833M43955M78286
859.3F69533157j33209o43387L50113J502686J637726J683960Q49685J978684K095565
868F78854980J363068K268372J879120J502533J841430J770630R32388J512833J937714
876.7F93863068Q28323K75955m18320m21981P84073K77786j695175j359558j227723
885.3F90906448j443100j123352k044372j827317j229705j438828j223984j016616
$$ y = [694068756, 693603287, 694022980, 693566666, 692280273, 691903229, 692085648, 691168289, 690315857, 688917542, 687228851, 685901260, 683973083, 682110214, 681871109, 681926193, 680596161, 680097504, 679394226, 678044968, 676428680, 674224625, 673388977, 673014145, 673225708, 673033142, 671914673, 671518326, 670688019, 669440231, 668799210, 668558044, 667510376, 667465820, 668516083, 668610916, 669054871, 669533157, 669399948, 668756561, 669106674, 670609360, 672247086, 673931046, 674780731, 676759415, 678854980, 680218048, 682486420, 684365540, 685868073, 687709503, 689480133, 690412521, 691925354, 693863068, 694691391, 694967346, 694549026, 694127045, 694911118, 695188904, 693493729, 692134171, 690906448, 689463348, 688339996, 686295624, 684468307, 683238602, 681799774, 680575790, 679559174]
893F79559174k113266k151413j219330j034394J2742o78635j909027j644592j110993
901.7F67710266o48956j389694r01871n82810j948394j813050j592102k252731k082214
910.4F54498444j773377k001190k295303k259293k350693k572937j907882j936493
918.1F37401276k482224k289772k085647j541977r21479j125335j181832l1967J9608
926.8F25760651r04274j087380j354103q10394K04925N85747O57501J98059M53682
935.5F23704414J034279L32451M16107J302300J007614K02293O38886J758232J053619
944.2F31450195J70212R29527M31786j344833j308365q78449j924171k269440j881561
952.8F23374901k240906k258415k263031k451286l219071l746681l073654l537064
$$ y = [679559174, 677445908, 675294495, 674075165, 673040771, 673053513, 672374878, 670465851, 668821259, 667710266, 667061310, 665671616, 664769745, 664186935, 662238541, 660425491, 658833389, 656580658, 654498444, 652725067, 650723877, 648428574, 646169281, 643818588, 641245651, 639337769, 637401276, 634919052, 632629280, 630543633, 629001656, 628080177, 626954842, 625773010, 625741043, 625760651, 624856377, 623768997, 622414894, 621604500, 621809425, 622395172, 623052673, 623250732, 623704414, 624738693, 625071144, 625487251, 626789551, 627797165, 627999458, 628638344, 630396576, 631450195, 631620407, 632549934, 632981720, 631636887, 630328522, 629450073, 627525902, 625256462, 623374901, 621133995, 618875580, 616612549, 614161263, 610942192, 607195511, 604121857, 600584793]
960.6F00584793m040337l956222l938713m162636l984222l316727m420624n940246
968.3E66825066n543137m500351n762100o709862o611061o955986o505280o266098
976E17971191o490135p280540o850319p106629o949386o491814p239265o145363n677643
984.7D57740097m551239m930000m875756m178886l977165k177544k695236k083855
992.4D28270416k622680k765885j293297n98716q03261j575241P4386m95186j61094
1001.1D18029442Q1367k97355l77655q99353j71166j522865r44100j673851r28688
1009.7D11295776l16772k517014j395874k368431j961097j545563q12073m04510r14231
1018.4C99060211j25885j405105p04155j329651m9286N74455j98402J056976J055107
$$ y = [600584793, 596544456, 592588234, 588649521, 584486885, 580502663, 577185936, 572765312, 566825066, 561281929, 556781578, 551019478, 544309616, 537698555, 530742569, 524237289, 517971191, 511481056, 504200516, 497350197, 490243568, 483294182, 476802368, 469563103, 463417740, 457740097, 453188858, 448258858, 443383102, 439204216, 435227051, 433049507, 430354271, 428270416, 425647736, 422881851, 421588554, 420989838, 420186577, 418611336, 418685722, 418190536, 418029442, 418110809, 417813454, 417435799, 416536446, 416365280, 414842415, 413898315, 412224464, 411295776, 410979004, 408461990, 407066116, 404697685, 402736588, 401191025, 400378952, 399974442, 399060211, 398934326, 397529221, 396825066, 395495415, 395446129, 396020584, 395822182, 396879158, 397934265]
1027.1C97934265J732865P6370P63626N16548N51147J192780J24092J027069p43904
1035.8D03174858O88629O88439L71513Q17757l63350O44684n01900N71861M07219N00412
1045.4D07000122K25144L22875J251984r94453J269264J307983J421929J876602J484299
1054.1D15165749J850090J539077L179627J884308K911758K819443K915001M142036
1061.8D36407089L552017L752518K004204L552360L014527K401581J821289r01032
1069.5D55604553j257210l061218l216858l724441l521538m455948m062576j335602
1077.2D30969162k704849j513100r45854L8643K71454P20901J223679R69391K895813
1085.9D31925240J677475K108955J867485K898674L089485J591988J963920Q56057
$$ y = [397934265, 399667130, 399743500, 400507126, 401023674, 401574821, 402767601, 402891693, 403918762, 403174858, 403863487, 404551926, 404923439, 405741196, 405377846, 406022530, 405520630, 406092491, 406499710, 407000122, 407225266, 407548141, 408800125, 407805672, 409074936, 410382919, 411804848, 413681450, 415165749, 417015839, 418554916, 421734543, 423618851, 426530609, 429350052, 432265053, 436407089, 439959106, 443711624, 445715828, 449268188, 452282715, 454684296, 456505585, 455604553, 454347343, 451286125, 448069267, 444344826, 440823288, 436367340, 432304764, 430969162, 428264313, 426751213, 425805359, 425844002, 426115456, 426836357, 428060036, 429029427, 431925240, 433602715, 435711670, 437579155, 440477829, 443567314, 445159302, 447123222, 447979279]
1093.6D47979279L017959K286301J676025J911965O34346J028862M26292O26717J14936
1102.3D59702682J239167O77109M60739J400756O13938J860008J205750J096229J119995
1111D69376373K179985K079239O28548P18384J61400K157363J521492M20571K63061
1119.7D79506416J341706K607154L49885Q16116J304092K243233J739578P12471J222382
1128.4D91843033Q00285J869202J587982J307030P3280J80779P20443o32477o29768
1137D97119789j643257j719322k529068k095833j625443k710533k261734k611046k254867
1145.7D77668686l153839k404824k179870k180328j375161k605056j147919j355744
1153.4D61265945j266479j331749p95479m88205o94351J901131O87637J348915J837769
$$ y = [447979279, 450997238, 453283539, 454959564, 456871529, 457505875, 458534737, 458961029, 459587746, 459702682, 460941849, 461618958, 462079697, 463480453, 464094391, 465954399, 467160149, 468256378, 469376373, 471556358, 473635597, 474264145, 474982529, 475143929, 477301292, 478822784, 479243355, 479506416, 480848122, 483455276, 483805161, 484621277, 485925369, 488168602, 489908180, 490620651, 491843033, 492643318, 494512520, 496100502, 497407532, 497480812, 497661591, 498382034, 497749557, 497119789, 495476532, 493757210, 491228142, 489132309, 487506866, 484796333, 482534599, 479923553, 477668686, 474514847, 472110023, 469930153, 467749825, 466374664, 463769608, 462621689, 461265945, 459999466, 458667717, 457872238, 457384033, 456689682, 458590813, 459278450, 460627365, 462465134]
1162.1D62465134K215805K894592K554207M093437K642365L150100M110298M796486
1169.8D88922424N045739M577636N288086M879914M640197L753510M478416M674988
1177.5E26260910M559555M512024L724518M386864L874549L741570L361969L426361
1185.3E57848320L381310K106094K476654K375755J685257J721955K038078J277351
1193E74910774P76787J022720O38199P39060N51605K58407J63727N69077O61163L58772
1202.6E80650291O35186J08032K96783P00226P05147P78427J122894J407395L88145
1211.3E86792526M11721R71374R21364Q36182J001014R42726K97928J14594k29569
1220E92059860k23808j82037k83814l50265p09305m54216p93648j097031j011276p23762
$$ y = [462465134, 464680939, 467575531, 470129738, 474223175, 476865540, 480015640, 484125938, 488922424, 493968163, 498545799, 503833885, 508713799, 513353996, 517107506, 521585922, 526260910, 530820465, 535332489, 539057007, 543443871, 547318420, 551059990, 554421959, 557848320, 561229630, 563335724, 565812378, 568188133, 569873390, 571595345, 573633423, 574910774, 575687561, 576710281, 577348480, 578087540, 578639145, 578897552, 579061279, 579630356, 580291519, 580650291, 581285477, 581393509, 581690292, 582390518, 583095665, 583874092, 584996986, 586404381, 586792526, 587204247, 588175621, 589096985, 589933167, 590934181, 591876907, 592174835, 592289429, 592059860, 591836052, 591654015, 591370201, 591019936, 590310631, 589856415, 589062767, 587965736, 586954460, 586230698]
1229.6E86230698m15726r04541j157684j337967o57273K9335m8294o86187r88236l44276
1239.3E79719849n57557k57606J91650M48151N18188L48931M04548M29039J102791
1247.9E82347984P56188N62706N97610O38695J097984Q35686J085434R70421R34143
1256.6E89826851P29675J40190M46587P00188O29310M49524Q29201O39343O03371R92050
1266.3E95986290N21622R23996R28764M52995R86214J061783N45425N08576P57789
1274.9F02673454N24979J71432L83377O47927N63087M08554M68941M70772L41263N02739
1284.6F07156525N46913O84738P25632j374n5389L69644L91731O7482l22990m8027
1294.2F09514885P2937k41890j21689k02026k82784j31988m54064l90014j7090J23138
$$ y = [586230698, 585814972, 584910431, 583752747, 582414780, 581757507, 581786842, 581738548, 581052361, 580064125, 579719849, 579162292, 578904686, 579096336, 579544487, 580062675, 580411606, 580816154, 581245193, 582347984, 583104172, 583666878, 584264488, 584903183, 586001167, 586836853, 587922287, 588892708, 589826851, 590556526, 590696716, 591143303, 591843491, 592472801, 592922325, 593751526, 594390869, 594994240, 595986290, 596507912, 597431908, 598360672, 598813667, 599799881, 600861664, 601407089, 601915665, 602673454, 603198433, 603369865, 603753242, 604401169, 604964256, 605372810, 605841751, 606312523, 606653786, 607156525, 607703438, 608388176, 609113808, 609112434, 609057045, 609426689, 609818420, 609885902, 609562912, 609514885, 609587822, 609345932, 609224243, 609022217, 608739433, 608607445, 608153381, 607763367, 607746277, 607869415]
1303.9F07869415P8125M5052J60293k12440j89285j61553o35452k24991K10877l2502
1313.5F06907539n23224o62918n44128k98347o829q73527j199417k33498J44577j17111
1323.2F02593117o32630o48841o46592n01709j18827r21441j177253n51300m79851
1331.8E96914673m58069m92706m15993o00929p87964l27721K88277k61688j086235
1340.5E92771645J48620L59230j56898J01471L79905N8480j51329R6702n7411m40140
1350.2E93110275l78265k68326n02205j18637n7831j106147o90575k00958m56810j25389
1359.8E89205132m97208o84204j92909j663018j068420j23596r14879j53313j27640
1368.5E83779945q68950K46583P9689K93655L48473n84946j148796r88770j75361k89307
$$ y = [607869415, 607947540, 607992592, 608152885, 607940445, 607751160, 607589607, 606954155, 606729164, 606940041, 606907539, 606384315, 605721397, 605177269, 604878922, 604872093, 603998566, 602799149, 602565651, 602710228, 602593117, 601960487, 601311646, 600665054, 600163345, 600044518, 599123077, 597945824, 597394524, 596914673, 596456604, 595963898, 595547905, 594946976, 594159012, 593831291, 594119568, 593857880, 592771645, 592920265, 593279495, 593122597, 593224068, 593603973, 593662453, 593511124, 593607826, 593550415, 593110275, 592732010, 592463684, 591961479, 591842842, 591785011, 590678864, 589988289, 589787331, 589330521, 589205132, 588707924, 588023720, 587830811, 586167793, 585099373, 584975777, 584060898, 583907585, 583779945, 582910995, 583157578, 583237267, 583530922, 583879395, 583294449, 582145653, 581156883, 580981522, 580692215]
1378.1E80692215L57361Q81920R14955O47087k4567L21350O83022J711273K069397
1386.8E88254013L12462O39458J686821J349487O69670K96478R28612k15111k292022
1395.5E91629868l701L68119O35032p77168j218796N42870J27983K23083L11432o16455
1405.1E91222267n46570L9444k3155J33324J68686n91164p65648j358108o65436K95410
1414.8E87909050M49295M6883k77901J123505k337990M5700K151070R28306M61235
1423.4E90499153j064148Q23021Q97293k84462K52114R4337n30128q88825L82500j55754
1433.1E90025101k13471J014099Q70285k885131k021828J591072K37007O6757J57547
1441.8E88841438p27577l37677r67674K77328O49872L52860j469345j072808l1929
$$ y = [580692215, 581049576, 581931496, 582846451, 583493538, 583468971, 583790321, 584473343, 586184616, 588254013, 588566475, 589205933, 590892754, 592242241, 592911911, 593208389, 594137001, 593921890, 591629868, 591626167, 591994286, 592629318, 591852150, 590633354, 591176224, 591304207, 591527290, 591838722, 591222267, 590675697, 590715141, 590691986, 590825310, 590993996, 590402832, 589637184, 588279076, 587613640, 587909050, 588358345, 588405228, 588127327, 589250832, 586912842, 586958542, 589109612, 590037918, 590499153, 589435005, 590258026, 591155319, 590870857, 591122971, 591217308, 590687180, 589798355, 590180855, 590025101, 589811630, 590825729, 591696014, 588810883, 586789055, 588380127, 588617134, 588683891, 588841438, 588113861, 587776184, 586808510, 587085838, 587735710, 588088570, 586619225, 585546417, 585514488]
1450.5E85514488j242103j251755j773071k68708k88047l95318k496223k306213L221664
1459.1E78714714o99654J363984O17218R00688K354202j475525l5629J141853M037667
1467.8E86919518L942565N583764P520484O499787O959801K706489M934540M540329
1475.5F29607277K886658K429237L579483L172836K477341K911530J166992J697082
1483.2F49928436J448212J289520J998062R09958O82450J590576P93304k666778N77163
1491.9F56550903J644364K88925P65915P52029l146515Q76236P55158k413330N25589
1500.6F56599274l17688j161270r7962J170807K869873m795914q184509R97696J001587
1509.3F48081894j122513m04816j317367l080063O76270k24686l66440n15137m504547
$$ y = [585514488, 584272385, 583020630, 581247559, 580978851, 580690804, 580295486, 577799263, 575493050, 578714714, 578015060, 579379044, 579996262, 580896950, 583251152, 581775627, 581739998, 582881851, 586919518, 590862083, 596445847, 603966331, 610466118, 617425919, 620132408, 625066948, 629607277, 632493935, 634923172, 638502655, 641675491, 644152832, 647064362, 648231354, 649928436, 651376648, 652666168, 654664230, 655574188, 656256638, 657847214, 658640518, 655973740, 656550903, 658195267, 658484192, 659250107, 660002136, 656855621, 657731857, 658487015, 656073685, 656599274, 656281586, 655120316, 655022354, 656193161, 659063034, 654267120, 646082611, 647080307, 648081894, 646959381, 646554565, 645237198, 642157135, 642833405, 642608719, 642242279, 641727142, 637222595]
1518F37222595K982788L190079r88159j637421j879539O92024J347580j175766r3651
1526.6F39660530R70650j668968j018448P73277N42831J114045j095772m877587J165658
1535.3F35566216J208267N92842K019310L75900p361488L310051J554565k322235J716194
1544F36659622Q89130j668129J285210J363563J830254J303405j877899R90525J832962
1552.7F42608643J519546n59463N75637M363099L854827j710357l826676r49020M835052
1561.4F50711288K642975J908036J897125j4877k93656J377487K187195K153549l278427
1570F59290695n80444K123871O76880Q16955K056580J234741o329727J87988J898575
1578.7F61376114N1117Q8348o57806m43192p64618j099090o56510r96780o20346j059189
$$ y = [637222595, 640205383, 643395462, 642407303, 640769882, 638890343, 639582367, 640929947, 639754181, 639660530, 640631180, 638962212, 637943764, 638717041, 639259872, 640373917, 639278145, 634400558, 635566216, 636774483, 637367325, 639386635, 639762535, 632401047, 635711098, 637265663, 634943428, 636659622, 637548752, 635880623, 637165833, 638529396, 640359650, 641663055, 639785156, 640775681, 642608643, 644128189, 643568726, 644144363, 648507462, 652362289, 650651932, 646825256, 645876236, 650711288, 653354263, 655262299, 657159424, 657144547, 656850891, 658228378, 660415573, 662569122, 659290695, 658710251, 660834122, 661511002, 662327957, 664384537, 665619278, 659289551, 659477539, 661376114, 661427231, 661515579, 660857773, 660414581, 659649963, 658550873, 657894363, 656897583, 656277237, 655218048]
1588.4F55218048o93283j141739j251449j468888j226425j221466k518768j291046
1596.1F44404984j593857r65729j366959k024154j949616k170677j201973k269707
1603.8F30862312j969032k009048j663552k344703k373505k266121l195305j496506
1611.5F13544540k978439k405357k567063o81533K03743j1245919j529770j305885
1619.2E91034317j812744k763939j046143j697616p214623j329231j992416r05648
1626.9E72271957m022255m184761j661262k766037j975746k474098N25436R92050m775467
1635.6E51929817n292282j6861j039429j518516K8610j666374K72140j148719K77137
1644.3E41825523K126313j711998l43399k083016J329422P04994K356034L563080k688370
$$ y = [655218048, 654524765, 653383026, 652131577, 650662689, 649436264, 648214798, 645696030, 644404984, 642811127, 641845398, 640478439, 638454285, 636504669, 634333992, 633132019, 630862312, 628893280, 626884232, 625220680, 622875977, 620502472, 618236351, 615041046, 613544540, 610566101, 608160744, 605593681, 604912148, 605115891, 593869972, 592340202, 591034317, 589221573, 586457634, 585411491, 583713875, 576499252, 575170021, 573177605, 572271957, 568249702, 564064941, 562403679, 559637642, 557661896, 555187798, 555713234, 556705284, 551929817, 546637535, 546620674, 545581245, 544062729, 544091339, 542424965, 542697105, 541548386, 541825523, 543951836, 542239838, 541896439, 539813423, 541142845, 541847839, 544203873, 547766953, 545078583]
1653E45078583l487587K94418K883873J054649J379433J422691J372490J419068J723594
1661.6E53141212K670632j97487K710686K207107J945534K798538L089485J793785
1669.4E70159492K36664L289223M39682K626801M529495K023468j015206K242318L572197
1678E88104134K852401L117333M99077K365036N067062J701088l140755K137299M547348
1686.7F07250023L157844J562958K112007J165924K092476K531166K508049L730278
1694.4F26110725L708039k331276K406463M341851N447502J502685r037284N602951
1702.1F37751656L761024J373825J00250O88019o47125l50342J442032L70865l92075
1710.8F44098129M13513Q78067J767960O99539n29403K768402M173202m844436p96357
$$ y = [545078583, 541590996, 541885414, 544769287, 545823936, 547203369, 548626060, 549998550, 551417618, 553141212, 555811844, 555614357, 558325043, 560532150, 562477684, 565276222, 568365707, 570159492, 570396156, 573685379, 574125061, 576751862, 581281357, 583304825, 582289619, 584531937, 588104134, 590956535, 594073868, 594572945, 596937981, 602005043, 603706131, 600565376, 602702675, 607250023, 610407867, 611970825, 614082832, 615248756, 617341232, 619872398, 622380447, 626110725, 629818764, 627487488, 629893951, 634235802, 639683304, 641185989, 632148705, 637751656, 641512680, 642886505, 642986755, 643674774, 643027649, 642677307, 644119339, 644490204, 644098129, 644511642, 645389709, 647157669, 647857208, 647327805, 650096207, 654269409, 649424973, 648628616]
1719.5F48628616J919403J040650M18243l84216q42743k90146l61709j088715r39484
1728.2F48099899o637k805939m270020j32522J531372l341827j2485466r70917j054993
1736.9F24562950l021965j619911m243736p510643r34334K78663l274078j489372R24377
1745.5F03671951J875038K267037L665237N207482N608520Q124047N486412P939643
1753.3F43845367P615509P211228Q150558N716629O713181N752487N321732N715332
1761F96042023L214340K713470L849869L214874K165833K822571K610702r56192J703949
1769.7G17381439L810806K074814j151199j535797L122024K210236q62732J317978
1777.4G26367569J144943J362992P82394j061020R77936J204300J156997j70364p39212
$$ y = [648628616, 650548019, 651588669, 652006912, 651622696, 650779953, 650489807, 650128098, 649039383, 648099899, 648093262, 645287323, 641017303, 640884781, 642416153, 639074326, 626588860, 625617943, 624562950, 621540985, 619921074, 615677338, 608166695, 607232361, 607511024, 604236946, 602747574, 603671951, 605546989, 607814026, 611479263, 616686745, 622295265, 630419312, 635905724, 643845367, 651460876, 658672104, 666822662, 672539291, 679252472, 685004959, 690326691, 696042023, 699256363, 701969833, 705819702, 709034576, 711200409, 714022980, 716633682, 715677490, 717381439, 721192245, 723267059, 722115860, 720580063, 723702087, 725912323, 725049591, 726367569, 727512512, 728875504, 729657898, 728596878, 729574814, 730779114, 731936111, 731765747, 731026535]
1786G31026535J265030Q43277M75311J145477P14188J269608j614075j738129K420807
1794.7G35808029R12628j151123N35813J788253N83878q83865J294479m5166n78384
1803.4G38264542N00030k41852L53546N21622o8664R60617J374893j095429j89056
1812.1G40380249P30972j63040L33023r1553L48130l891J23520P36465N9662O64597
1821.7G43118134K7847R24606J325913k679978p05032J767502J935272P69119l598022
1830.4G42885361j50910J986542K84195k70309n33143L42713N18188o91833O40488
1839.1G45011292N48553L63846J96991J466522J586456n240860k80227J794510K37808
1847.8G45684891m06342L41644P44553q6212M03976o1035j48620m7150k12479J23902
$$ y = [731026535, 732291565, 733134842, 733610153, 734755630, 735469818, 736739426, 735125351, 733387222, 735808029, 736720657, 735569534, 736105347, 737893600, 738477478, 737593613, 738888092, 738842926, 738264542, 738764572, 738522720, 738876266, 739397888, 739329224, 740289841, 741664734, 740569305, 740380249, 741111221, 740948181, 741281204, 741189651, 741537781, 741533890, 741657410, 742393875, 742453537, 743118134, 743145981, 744070587, 745396500, 742716522, 742011490, 743778992, 745714264, 746483383, 742885361, 742734451, 744720993, 745005188, 744734879, 744201736, 744544449, 745062637, 744370804, 745011292, 745559845, 745923691, 746120682, 747587204, 749173660, 743932800, 743652573, 745447083, 745684891, 745278549, 745620193, 746364746, 746278534, 746682510, 746621475, 746472855, 746425705, 746213226, 746337128]
1857.4G46337128l88718J46103M91180M00772m68063l10669K41623L70407O52924o65665
1867.1G46807022P59201k8763k255020N27039R78927L43018m35410l42102j61438L35007
1876.7G46527481M24042k4796J22528j91650J67694j33896m6692L1510j33515K18430
1886.3G46961136j32065J053238L94745k105484n8212R96170N5847M06646K23847j144638
1896G46651230P9269J23291j00174O22025K72140j02157j42288J54037m78973l76816
1905.6G46701584K75879K05307K25677r7275p41806m71115Q16269J62354J3428P9422
1915.3G47169724p6142J333313j134643j578370O38810M18167O87790n01252j014328
1923.9G45943069M09012N20783l32642k80304p0648j70059m2267k17896J07880n3024
$$ y = [746337128, 745948410, 746094513, 746585693, 746986465, 746518402, 746207733, 746449356, 746819763, 747472687, 746807022, 747566223, 747537460, 745282440, 745809479, 746788406, 747131424, 746696014, 746353912, 746192474, 746527481, 746951523, 746926727, 747049255, 746857605, 747025299, 746891403, 746844711, 746876221, 746742706, 746961136, 746829071, 747882309, 748277054, 746171570, 746113358, 747109528, 747165375, 747572021, 747795868, 746651230, 746730499, 746853790, 746753616, 747375641, 747647781, 747545624, 747403336, 747557373, 747078400, 746701584, 746977463, 747182770, 747408447, 747311172, 746569366, 746098251, 746914520, 747076874, 747090302, 747169724, 747093582, 748426895, 747292252, 745713882, 746352692, 746770859, 747458649, 746957397, 745943069, 746352081, 746872864, 746540222, 746259918, 746189270, 746019211, 745976944, 745759048, 745866928, 745813904]
1933.6G45813904n8289P8507J7242j38931k21787L33252j22833J018982P97501k372284
1943.2G45145264j68228R53674l15705m46243J63956K7237l51715j91498j06583K23999
1952.9G44934158J76239M58K5635N6686l5553k59170O6528r9564m27856J29547M99649
1963.5G45066757l0670j57928K89993l01972o19354k518Q6976J00708J65710J71509
1973.1G44769211J11923j67084K22855J62659n49012m25491k13623J84021O2790j64719
1982.8G43993530P4768L7155J86539j62964k9297l23257q31299O09207Q02613q92258
1992.4G43464737q86154K29034J51062j39541J78146K80762j69144o04248j2970M2572
2002.1G42534256k49100N7984K00805J73798j17951m41894o43539k15378J47247J42975
$$ y = [745813904, 745755615, 745834122, 745851364, 745712433, 745490646, 745823898, 745701065, 746720047, 747517548, 745145264, 744977036, 745930710, 745615005, 745168762, 745332718, 745359955, 745008240, 744816742, 744710159, 744934158, 745110397, 745110855, 745136490, 745193176, 745157623, 744898453, 744964981, 744865417, 744437561, 744567108, 745066757, 745036087, 744878159, 745168152, 744866180, 744246826, 744244308, 744331284, 744431992, 744597702, 744769211, 744881134, 744714050, 744936905, 745099564, 744550552, 744125061, 743911438, 744095459, 744158249, 743993530, 744068298, 744105453, 744291992, 744129028, 744099731, 743776474, 742945175, 743554382, 744356995, 743464737, 742578583, 742807617, 742958679, 742819138, 742997284, 743278046, 743108902, 742504654, 742491684, 742534256, 742285156, 742343140, 742543945, 742717743, 742599792, 742157898, 741514359, 741298981, 741446228, 741589203]
2011.7G41589203n9204l99323j46179J9836j67312n27039q3999J07650m0512L03650
2021.3G40596771j99203m80652l59726r7275j37863j49307K77176o3324k34604m40064
2031G38711929k72369j68839j91726J17950k73971k93351k36435m7607j02158j43890
2040.6G37099533P1106P6218K20031m74701j52893L2578k10037K06604m11225k65045
2050.3G36192169L28903K70844k62299k28805J32751l39432l96347k67334J77384K10419
2059.9G35818253m1275J48773L17688L61099m66156p15485J0529L88336L2044k38343
2069.6G35615463M4632K38342K46659j65558l16544l42483M6234K60849n1498K7313
2079.2G35603409j63880R7351L56751J90506j54572k52990j09711k60849J30310j5793
$$ y = [741589203, 741529999, 741130676, 740984497, 741004333, 740837021, 740309982, 740225983, 740333633, 740293121, 740596771, 740397568, 739916916, 739557190, 739459915, 739322052, 739172745, 739449921, 739386597, 739151993, 738711929, 738439560, 738270721, 738078995, 738196945, 737922974, 737629623, 737393188, 737345581, 737243423, 737099533, 737170639, 737246857, 737466888, 736992187, 736839294, 736871872, 736661835, 736868439, 736457214, 736192169, 736521072, 736791916, 736529617, 736300812, 736433563, 736094131, 735697784, 735430450, 735607834, 735818253, 735776978, 735925751, 736243439, 736604538, 736138382, 735422897, 735433426, 735821762, 735853806, 735615463, 735660095, 735898437, 736145096, 735979538, 735662994, 735320511, 735366745, 735627594, 735576096, 735603409, 735439529, 735536880, 735893631, 736084137, 735929565, 735676575, 735566864, 735306015, 735436325, 735420532]
2088.9G35420532l03879j99966M4327Q1177l7537L40805L1738J2284j38169m36249
2098.5G34815063k11715J05438M35181q1177J49078J58997R384J04065m31595Q316
2108.1G35061035L26462J96991j88980j95847k33459l30887L18222q6517j42670K07291
2117.8G34931641J18332j32065k56577J30539J34049J61895n2261N7754J3733n67855
2127.4G34539185m49448P1640M23126K5025J94931L26919k74200l25241o1188m4174
2137.1G34426575l23258j59683N0888K64282J05667j79214K0599M4937J01395j50528
2146.7G34201660J221K35138J6708j30691j19171r156k05612j0300m9972P5989K16140
2157.3G34221954j76544o0959K15836L43399j67999j74103r8877r8419L06015J47857
$$ y = [735420532, 735116653, 734916687, 734961014, 735042191, 735004654, 735345459, 735377197, 735389481, 735251312, 734815063, 734603348, 734708786, 735143967, 735062790, 735211868, 735370865, 735380249, 735484314, 735052719, 735061035, 735387497, 735584488, 735395508, 735199661, 734966202, 734635315, 734953537, 734867020, 734724350, 734931641, 735049973, 734917908, 734661331, 734791870, 734925919, 735087814, 735035553, 735093307, 735107040, 734539185, 734089737, 734161377, 734584503, 734609528, 734804459, 735131378, 734857178, 734531937, 734470749, 734426575, 734103317, 733943634, 733994522, 734258804, 734364471, 734185257, 734205856, 734250793, 734352188, 734201660, 734202881, 734438019, 734454727, 734324036, 734204865, 734195709, 733990097, 733979797, 733929825, 734005814, 734221954, 734045410, 733984451, 734200287, 734543686, 734375687, 734201584, 734102707, 734004288, 734310303, 734458160]
2167G34458160L21656m9210k18735J79901K71988N3559n53742k79464K07901N12542
2176.6G34904556L62168K34604p8660l22265K02789j75857J37176K53525k15302L3799
2186.3G35336533j755Q6899j00937J04751L29666O6910j73034j29013M6539j87302
2195.9G35379257J72806K03629L6697J95389L32946K85950m8141l2730k80533k1515
2205.5G36223755J63727j07346L4790K58637J73721k66724n2261j40991j67771O1112
2215.2G36180649K24685L61939k37045r3384J75857K12937M6463R7275L26233k10801
2224.8G37084808k32010l39050J15204M30603K0828L0365j33438n9814m34876l96118
2234.5G36086502K47421L30506l7842r7275J50833k62909j75323P1792J61744j71204
$$ y = [734458160, 734779816, 734730606, 734511871, 734691772, 734963760, 735017319, 734463577, 734184113, 734392014, 734904556, 735266724, 735501328, 735422668, 735100403, 735303192, 735127335, 735264511, 735518036, 735302734, 735336533, 735334778, 735421677, 735320740, 735425491, 735755157, 735822067, 735649033, 735520020, 735566559, 735379257, 735552063, 735755692, 735792389, 735987778, 736320724, 736606674, 736558533, 736525803, 736245270, 736223755, 736387482, 736280136, 736314926, 736573563, 736747284, 736480560, 736428299, 736287308, 736119537, 736180649, 736405334, 736767273, 736530228, 736436844, 736612701, 736825638, 736872101, 736969376, 737295609, 737084808, 736852798, 736513748, 736628952, 737059555, 737080383, 737110748, 736977310, 736917496, 736482620, 736086502, 736333923, 736664429, 736626587, 736529312, 736680145, 736417236, 736241913, 736313705, 736475449, 736304245]
2244.1G36304245n17883j46485J30997N30777N3635l5248J04065k42386J16119j05972
2253.8G36191864l22113K0905L82614K98996p477k86637p9193K08283k44675j67007
2263.4G35995560l20893J03836L01133k78473J20315Q1558J33667j05438k30789J86081
2273G35986557J6708k02255j04523J18409k98005k90145p7362L68270K63443m65316
2282.7G35315781j53351P4386M07715k7847j02081j87455n48477K62680p8354J87073
2292.3G35150070K1057o2332L32642o42777l52020j77612J04522n8899k83813K02179
2302G34233017k88086j72882J11084M4403o30569l13111n4474o29196n6839R1171M7760
2312.6G32382278r73205m32511N27649k47268j64719m85687j52207n4779k42080l47443
$$ y = [736304245, 735786362, 735639877, 735770874, 736301651, 736355286, 736320038, 736424103, 736181717, 736297836, 736191864, 735869751, 735890656, 736273270, 736572266, 736564789, 736278152, 736198959, 736407242, 736162567, 735995560, 735674667, 735778503, 736079636, 735801163, 735921478, 736003036, 736136703, 736031265, 735800476, 735986557, 736003265, 735801010, 735696487, 735814896, 735516891, 735226746, 735149384, 735517654, 735781097, 735315781, 735162430, 735236816, 735644531, 735616684, 735514603, 735327148, 734778671, 735041351, 734962997, 735150070, 735171127, 735108795, 735441437, 734798660, 734446640, 734269028, 734373550, 734314651, 734030838, 734233017, 733944931, 733772049, 733883133, 733927536, 733296967, 732983856, 732929382, 732300186, 732243347, 732334518, 732382278, 731409073, 730976562, 731504211, 731256943, 731092224, 730606537, 730454330, 730399551, 730157471, 729810028]
2322.2G29810028m7455J02616l28598P24868m27780p73392n06820o37741L81088o4392
2331.9G28232422N00107o97403r29184N69839k87475j57929J061020J38245j194763
2340.6G27234879l16849m12293L7232N1422j60446M30450m35943P58361J407318K35062
2350.2G28829193o74515q2245n94406j780548l93371J33133J09939r20181j430359
2358.9G23196640r09729r42078L96195R45434J763611j30920j421890n28641O79092
2367.6G23047714J851273j2055j26037k4109l06168P11594J014481Q71658K37503k21329
2377.2G27044525m38461j76697M9973L37753Q52814O31103L31040R8190j29318j58692
2386.8G28442230j45569k32238k68860k44522O2408K68478j90582r6741Q3848j44730
$$ y = [729810028, 729762573, 729865189, 729536591, 730261459, 729833679, 729060287, 728553467, 727915726, 728296814, 728232422, 728732529, 728035126, 727105942, 727675781, 727388306, 727230377, 728291397, 728429642, 727234879, 726918030, 726505737, 726542969, 726594391, 726433945, 726864395, 726428452, 727186813, 728594131, 728829193, 728154678, 728072433, 727478027, 725697479, 725304108, 725437241, 725547180, 724626999, 723196640, 722286911, 721344833, 721741028, 722686462, 724450073, 724319153, 722897263, 722368622, 723047714, 724898987, 724886932, 724760895, 724736786, 724430618, 725142212, 726156693, 727028351, 727265854, 727044525, 726606064, 726429367, 726479340, 726817093, 727669907, 728301010, 728632050, 728730240, 728600922, 728442230, 728296661, 728064423, 727795563, 727551041, 727613449, 727881927, 727691345, 727594604, 727678452, 727533722]
2396.5G27533722l89557m66003j51673R7122J48316l86200k80228L36762J97601j40839
2406.1G26499023l90930l50647j29242M1275l81851k22778K49634L3722p2709k96478
2415.8G24979019J7929j91269l90777O0806j03912j64185j74026J15966q6212m15191
2425.4G23648148n23301l76892K52991k63138n50689l64075K10266M84924l85132n39703
2435.1G21593399q2855K90298j53885o9122J11160m98581l50494k08740K8839M5776
2444.7G20705795j39389l15017m20533k25906k40631j5946j25045j36261j66397k65809
2454.3G18654861q9340k78167l48053k96479J53809J60827k44598j43661J79977L5858
2464G17785034n19333k00882o8969j09406j32065j43356j18790o37665k01721K55890
$$ y = [727533722, 727144165, 726678162, 726526489, 726623611, 726771927, 726385727, 726105499, 726442261, 726639862, 726499023, 726108093, 725757446, 725628204, 725669479, 725287628, 725064850, 725314484, 725348206, 725275497, 724979019, 724996948, 724805679, 724414902, 724475708, 724371796, 724207611, 724033585, 724149551, 724063339, 723648148, 723124847, 722747955, 723000946, 722737808, 722187119, 721823044, 722033310, 722518234, 722133102, 721593399, 721510544, 721800842, 721646957, 721577835, 721688995, 721190414, 720839920, 720631180, 720660019, 720705795, 720566406, 720251389, 719830856, 719604950, 719364319, 719348373, 719223328, 719087067, 718920670, 718654861, 718565521, 718287354, 717939301, 717642822, 717796631, 717957458, 717712860, 717569199, 717749176, 717785034, 717265701, 717064819, 716995850, 716886444, 716754379, 716611023, 716492233, 715854568, 715652847, 715908737]
2473.6G15908737K31857k14920o05697j32675k06223k17972j01013r537J07499k30408
2483.3G14529648n54581m6463L57819j61972K05002k7161o43997k54212j9684L2654
2492.9G13417053n78842l88107O5765K3499J77078l00064j10626K45056r4147j30081
2502.6G12326584j07193k63367k31857k58713q4534J06659m73785l03268J30538K29
2512.2G10841293M8981j74560k23542j22223r6206k3270k33841n69534j59836K93655
2521.9G09580917j5030k1972K0447j25046l09830j93787j30233l15781j29547k01416
2531.5G08158722n7144k01187l11661o5384l31192n8746j2360p9117Q1787k27051l35540
2542.1G06561127j29776k80533n51605L3416K86484K8229j73874k31705q9721n09034
$$ y = [715908737, 716140594, 715925674, 715319977, 715187302, 714981079, 714763107, 714662094, 714652557, 714760056, 714529648, 713975067, 713928604, 714286423, 714124451, 714329453, 714302292, 713658295, 713404083, 713384399, 713417053, 712838211, 712450104, 712515869, 712539368, 712716446, 712416382, 712305756, 712550812, 712456665, 712326584, 712219391, 711956024, 711724167, 711465454, 711380920, 711487579, 711013794, 710710526, 710841064, 710841293, 710890274, 710715714, 710492172, 710369949, 710273743, 710250473, 710016632, 709447098, 709287262, 709580917, 709565887, 709543915, 709564362, 709439316, 709129486, 708935699, 708805466, 708489685, 708360138, 708158722, 708101578, 707900391, 707588730, 707523346, 707192154, 707133408, 707121048, 707041931, 707123718, 706896667, 706561127, 706431351, 706150818, 705599213, 705632629, 705919113, 705947342, 705773468, 705541763, 705452042, 704943008]
2551.7G04943008l87497l2577j15051k12326j81275N0583j40762k48032p9117K49482
2561.4G03846436r537n59845l33328k58942j18561j50299l71399j40381n7296j32065
2571G01714783j80207P630j31073m89884r384k2125m50592K33154M5395n41611L0594
2581.6G00206680p63k11792l59192m49829k71759n52673k71072L48663L35846j36719
2591.3F98637390m58908k40478L8070j08108m10157l17230j20926l1128r5596j98517
2600.9F96694412m07333l10211P0190m2114N3024k20642m84848k23923k74658j7853
2610.6F94836044j25885m07943k23313l28064m44412N2414J72195m04434l72467k23312
2620.2F92530823j65940l68270n43900m03137m19846K03476R4986n02701k30636K5863
$$ y = [704943008, 704555511, 704522934, 704407883, 704195557, 704014282, 704064865, 703924103, 703676071, 703596954, 703846436, 703836899, 703277054, 702943726, 702684784, 702566223, 702415924, 702044525, 701904144, 701846848, 701714783, 701534576, 701542206, 701411133, 700921249, 700911865, 700889740, 700439148, 700672302, 700717697, 700176086, 700206680, 700205917, 699994125, 699634933, 699185104, 698913345, 698360672, 698089600, 698438263, 698774109, 698637390, 698178482, 697938004, 697976074, 697867966, 697457809, 697140579, 697019653, 696988525, 696892929, 696694412, 696287079, 695976868, 696047058, 696004944, 696057968, 695837326, 695352478, 695128555, 694853897, 694836044, 694710159, 694302216, 694078903, 693750839, 693306427, 693358841, 693531036, 693126602, 692754135, 692530823, 692364883, 691996613, 691452713, 691049576, 690629730, 690833206, 690928192, 690425491, 690194855, 690220718]
2629.9F90220718l21426o73676j25961k11258n63965n02624l19138J93787n5389j64261
2639.5F87476807m10691r36050o17600j11007j08719m60282J12992K48184n07202l13187
2649.1F84373245j11084n59463p55463k55127j30234n33676k24457K21405p5683k70462
2658.8F81679001k19193n90973m30526j18485m15497l01361j28860l16620l72772k34986
2668.4F78549728j64566l26995m76609k58331J07346j19172k88238K00195k6626p28760
2678.1F76467972m64173j525l20664p21054l63846R3689P9041j84326l73078j09024
2687.7F74103012k56653n43976j16882N646l69034l13721J8845l32336l48053j1216
2697.4F71835632k47650j32828k23617l16849k40402n15823k95563j64948l94211k91595
$$ y = [690220718, 689899292, 689225616, 689099655, 688888397, 688324432, 687821808, 687502670, 687696457, 687641068, 687476807, 687066116, 686130066, 685512466, 685401459, 685292740, 684832458, 684945450, 685193634, 684686432, 684373245, 684262161, 683702698, 682947235, 682692108, 682561874, 682028198, 681803741, 682025146, 681949463, 681679001, 681459808, 680868835, 680438309, 680319824, 679904327, 679602966, 679474106, 679157486, 678784714, 678549728, 678385162, 678058167, 677581558, 677323227, 677430573, 677311401, 677023163, 677223358, 677196732, 676467972, 676003799, 676002274, 675681610, 674960556, 674596710, 674690399, 674769440, 674585114, 674212036, 674103012, 673846359, 673302383, 673185501, 673191147, 672822113, 672508392, 672527237, 672194901, 671846848, 671835632, 671587982, 671455154, 671231537, 670914688, 670674286, 670158463, 669862900, 669697952, 669303741, 669012146]
2707F69012146J02463P0419m17938n97611m32510k91443l02048O256o8435m94385k24152
2717.6F66362762j80130n28411m62265L6773j09329p47528k61307K65427j84326n13459
2727.3F63678207l83758k26746j88751l83835p52258l76968K00271J26801K11410k36969
2736.9F61667404q23135m56925r8800K99072N3101n07966k32315k07672r5749J68152
2746.5F59765167k517k31781k82593l52783p52488q91647o74210l4179L53622J2360
2756.2F56908951j15280p3777p7514o25305q32520l27911l53012j59531K11868K85645
2765.8F54841614l8758n47409m28314l33938k64206N3405K63520L19824l25852r84344
2775.5F52555542p62634m63410k83889l44391m35715q7433r8190k03552l03422m77142
$$ y = [669012146, 669114609, 669185028, 668767090, 668169479, 667736969, 667445526, 667143478, 667149734, 667081299, 666586914, 666362762, 666182632, 665654221, 665191956, 665228729, 665119400, 664371872, 664110565, 664375992, 664191666, 663678207, 663294449, 663067703, 662878952, 662495117, 661742859, 661365891, 661566162, 661692963, 661904373, 661667404, 660844269, 660387344, 660288544, 660587616, 660640717, 660132751, 659900436, 659692764, 659597015, 659765167, 659762650, 659530869, 659248276, 658895493, 658143005, 657251358, 656577148, 656542969, 656896591, 656908951, 656793671, 656719894, 656642380, 656017075, 655184555, 654856644, 654503632, 654344101, 654555969, 654841614, 654802856, 654255447, 653827133, 653493195, 653228989, 653282394, 653545914, 653865738, 653539886, 652555542, 651792908, 651329498, 651045609, 650701218, 650265503, 650178070, 650079880, 649876328, 649572906, 649095764]
2785.1F49095764l27225l58123k31934k71912m49905l36990o31562l46145P1716m68063
2794.8F45745621p47910p83768n68847m55094r25674m61273N8670l73230o16913n38635
2804.4F40332947l76702m48303n55725n68962o29768q44498p41196k49748n22575o16570
2814F34778900n91087j039391j168823j049194r10569j146431q29315n83381p52030
2822.7F26708679n87044r60197j216469j288147j111679j499100j967201j101990j178588
2831.4F15798264j636391j715126j697159j436539j804466j935310k197495l102684
2839.1F00273094l752441l804093l989715m661255n245171n842132o331368p060127
2846.8E59586792p953949q233452p847328o979370o187439m985504l138390j781120
$$ y = [649095764, 648768539, 648410416, 648178482, 647906570, 647456665, 647119675, 646488113, 646141968, 646213684, 645745621, 644997711, 644213943, 643645096, 643190002, 642264328, 641803055, 641861725, 641488495, 640871582, 640332947, 639956245, 639507942, 638952217, 638383255, 637753487, 636908989, 636167793, 635918045, 635395470, 634778900, 634187813, 633148422, 631979599, 630930405, 630019836, 628873405, 628044090, 627460709, 626708679, 626121635, 625161438, 623944969, 622656822, 621545143, 620046043, 618078842, 616976852, 615798264, 614161873, 612446747, 610749588, 609313049, 607508583, 605573273, 603375778, 600273094, 596520653, 592716560, 588726845, 584065590, 578820419, 572978287, 566646919, 559586792, 551632843, 543399391, 535552063, 528572693, 522385254, 517399750, 514261360, 512480240]
2854.6E12480240l88489J352501K550774L556175M673958M622802L917733L899841
2862.3E36665535L823280L224259K496948J942406J122627L77579j7891l01514l85895
2870.9E48947334n76439l22151J67465M12865P81746K78206m15115l8376k13394o20347
2880.6E48401794n60073r48410r59130q42972r50164j121254j494637j590500j558075
2889.3E38376579j469612j854248j846466j346435j494675j626663j886940j895943
2897E24955597k092362k334327k004967k296524k240181j962738k245789k855453l469505
2905.7E03453751l197518k697906l041458m243126m651223m429359n006676n635071
2913.4D70551414n819129n930710o338654o463051o807022p020874o037445n091896
$$ y = [512480240, 512091751, 513444252, 515995026, 519551201, 524225159, 528847961, 532765694, 536665535, 540488815, 543713074, 546210022, 548152428, 549275055, 549652634, 549634743, 549333229, 548947334, 548370895, 548048744, 548216209, 548629074, 549410820, 549689026, 549273911, 549235535, 549022141, 548401794, 547841721, 546893311, 545934181, 545091209, 544141045, 543019791, 541525154, 539934654, 538376579, 536906967, 535052719, 533206253, 531859818, 530365143, 528738480, 526851540, 524955597, 522863235, 520528908, 518523941, 516227417, 513987236, 512024498, 509778709, 506923256, 503453751, 500256233, 497558327, 494516869, 490273743, 485622520, 481193161, 476186485, 470551414, 464732285, 458801575, 452462921, 445999870, 439192848, 432171974, 426134529, 421042633]
2921.1D21042633m058647l396301k686615j946526j241112M00963J222839K045556
2928.8D11382790K760200L213463L689003L831940M988632N348205M977265N598259
2936.5D45789757O112137N705680N368691N344849N353088N358391M771461M088974
2944.2D87893028L618737L526229L070946K096748J742936J679001J335144Q69026
2952E05831795R28344N52483J82495J043053J576233J207809J028977J907386K840081
2960.6E17098656L075027K842026K816276L099480L142166L584252L666496L767624
2968.3E43092003M114723L717651L204613K992935L241158L153648K556839K272530
2976.1E68346100K163544K106514K467422K173920J508102J900063J664428J312867
$$ y = [421042633, 416983986, 413587685, 410901070, 408954544, 407713432, 408114395, 409337234, 411382790, 414142990, 417356453, 421045456, 424877396, 429866028, 435214233, 440191498, 445789757, 451901894, 457607574, 462976265, 468321114, 473674202, 479032593, 483804054, 487893028, 491511765, 495037994, 498108940, 500205688, 501948624, 503627625, 504962769, 505831795, 506760139, 507312622, 507495117, 508538170, 510114403, 511322212, 512351189, 514258575, 517098656, 520173683, 523015709, 525831985, 528931465, 532073631, 535657883, 539324379, 543092003, 547206726, 550924377, 554128990, 557121925, 560363083, 563516731, 566073570, 568346100, 570509644, 572616158, 575083580, 577257500, 578765602, 580665665, 582330093, 583642960]
2983.8E83642960J391677J175614J332664J119919J048699J155586J169357J176376
2991.5E93212852K81945j84975L2196p7095k10495m94385n28984m45099q55903q47245
3001.1E89882812p47947j055565r38530p70035j043815j179276p04308k33573K6512
3009.8E83236275M23469O22711N02282L78952Q90922J432228J354065J056252R61571
3018.5E90858727Q24241L70560N69763M99077J66397K98424J18370j3046l14980j54152
3028.1E93223381L46146K80723k04849n81398k52533k33993n40200o35452j95046p7896
3037.8E91128883o45790q26454r95254o66314k81028k74277l76244n53054n20821r52416
3047.4E85037231p88383k89917n61867j098861j189499k38533J13029o00700j208535
$$ y = [583642960, 585034637, 586210251, 587542915, 588662834, 589711533, 590867119, 592036476, 593212852, 593494797, 593309822, 593342018, 593264923, 593054428, 592560043, 592031059, 591585960, 590730057, 589882812, 589134865, 588079300, 587140770, 586370735, 585326920, 584147644, 583443336, 583209763, 583236275, 583659744, 584282455, 584784737, 585163689, 586054611, 587486839, 588840904, 589897156, 590858727, 591682968, 592053528, 592623291, 593122368, 593288765, 593587189, 593705559, 593692513, 593377533, 593223381, 593569527, 593850250, 593645401, 593064003, 592811470, 592577477, 592037277, 591401825, 591206779, 591128883, 590483093, 589656639, 588661385, 587995071, 587714043, 587439766, 587063522, 586510468, 585989647, 585037231, 584248848, 583958931, 583397064, 582298203, 581108704, 580870171, 580983200, 580382500, 579173965]
3056.1E79173965j035499k62680l70560j087494q62770m36478m77752j91155m20112
3064.8E74029465q31223r10148r69162n39132o67076p93876n92881p31163m58564j55869
3074.4E67380371k83394l25088m10118r91288r90791n10712q52737q90923j46293r4795
3084.1E61884232m91410n84297r52949q99582o47202q56781q15163q12187p79419o75850
3093.7E54369392m10957m49562j031075r28840m35982k74124o33850j007652r42002
3102.4E48255348m52118j91574p92198j028099m99039m03595q53271r02939q05206
3111.1E42327309l39470m45175j314087o65360m78515o70052l98788j050988j052894
3119.8E35911980p79953q17604q20656o99196p89757j044922o65703m99572n51033
$$ y = [579173965, 578138466, 577875786, 577505226, 576417732, 575554962, 575118484, 574640732, 574449577, 574029465, 573198242, 572288094, 571318932, 570779800, 570112724, 569318848, 568725967, 567994804, 567536240, 567380371, 567096977, 566771889, 566361771, 565370483, 564379692, 563868980, 563016243, 562125320, 561979027, 561884232, 561392822, 560808525, 559855576, 558955994, 558308792, 557452011, 556636848, 555824661, 555045242, 554369392, 553958435, 553508873, 552477798, 551548958, 551112976, 550838852, 550205002, 549197350, 548255348, 547803230, 547611656, 546819458, 545791359, 545292320, 544888725, 544035454, 543132515, 542327309, 541987839, 541542664, 540228577, 539563217, 539084702, 538414650, 538015862, 536964874, 535911980, 535132027, 534314423, 533493767, 532794571, 532004814, 530959892, 530294189, 529794617, 529243584]
3128.4E29243584r43642j308556r96780m89235o33392j203537o66466l95012o35490
3137.1E21971474o04744p23534j161575j463013r28764o16036l60946n17311j050530
3145.8E14545021j181221j153183o59485n56755n81970q13141r42078r63363j253662
3154.5E06440163p02210p87201j007957p35436p47833n93414q92296j131287n70907
3163.1D99271622m59175j234131j250420q00667m93278q81844j403923p01561o99005
3171.8D91347618p65877o13823o86569p89032r12056n06706j384773j493721o08826
3180.5D83586235n79758p56874j177749j084786q76884j92757l83949j033516p38030
3189.2D76761932j045875j041413q94470p74116q72307q64372o25649p49054n65605
$$ y = [529243584, 528299942, 526991386, 525994606, 525505371, 524871979, 523668442, 523001976, 522606964, 521971474, 521366730, 520643196, 519481621, 518018608, 517089844, 516473808, 516112862, 515595551, 514545021, 513363800, 512210617, 511551132, 510994377, 510412407, 509599266, 508657188, 507693825, 506440163, 505737953, 504950752, 503942795, 503207359, 502459526, 501866112, 500973816, 499842529, 499271622, 498812447, 497578316, 496327896, 495527229, 495033951, 494152107, 492748184, 492046623, 491347618, 490581741, 489967918, 489281349, 488492317, 487580261, 487073555, 485688782, 484195061, 483586235, 483006477, 482249603, 481071854, 479987068, 479110184, 478917427, 478533478, 477499962, 476761932, 475716057, 474674644, 473780174, 473006058, 472133751, 471269379, 470643730, 469894676, 469329071]
3197.9D69329071q76770p39593o05927p51381q54530j156235q73375p20062l69606
3206.5D62381592p19490q08144o05621j047325o80809o65322l92685p81936j071701
3215.2D55608559k57836n88455p20596j026840j097336l50151l85170p19071r22928
3223.9D49540176j022529p40509n56221r36241o46553l26539o42585r13887o58226
3232.6D43096886k67525q90923q47473n50308p42149o02799q48655j223031j071586
3241.3D36052437m43154l02581l71743n98411p37686q89931j319199p25212m99611
3249.9D30164909k63214k86026r25674n58434m40025l63083o89278j316223j100654
3258.6D24222298m69361k54097r02023n89485p4272m74739p00188r52072r50318k58331
$$ y = [469329071, 468452301, 467712708, 467106781, 466355400, 465500870, 464344635, 463471260, 462751198, 462381592, 461662102, 460853958, 460248337, 459201012, 458520203, 457854881, 457462196, 456680260, 455608559, 455350723, 454762268, 454041672, 453014832, 451917496, 451567345, 451182175, 450463104, 449540176, 448517647, 447777138, 447220917, 446284676, 445638123, 445311584, 444668999, 443755112, 443096886, 442829361, 441938438, 441090965, 440540657, 439798508, 439195709, 438347054, 437124023, 436052437, 435609283, 435306702, 434934959, 434336548, 433598862, 432708931, 431389732, 430664520, 430164909, 429901695, 429615669, 428689995, 428131561, 427691536, 427328453, 426639175, 425322952, 424222298, 423752937, 423498840, 422596817, 422007332, 421933060, 421458321, 420758133, 419806061, 418855743, 418597412]
3268.3D18597412m43764j032142m55628l01742m43573o85425p33719m98657q61435
3276.9D13141327m16107n17464q88748o02417m55246j14479l91503l80783l83072m11376
3286.6D08580132j49727q05054p58896k55241o23589m70886K09350l70063q47893j66512
3296.2D04341621l24936q36982q64411j047058p88269p8010j23368o02150p79419m06761
3305.9C98490257L03040k24495r27086n87463p19376r03778l43819k27279n09682m47884
3315.5C93902435q09402q04482k93808m16107l65333k91825o12640p01027m27399j10740
3325.2C89069672m81568j308479j306953o52886l4523r5901p25022n02548m04549p65724
3334.8C82791519n74684l73077o95992j103477q63419o81419k59056p0343q61893j428757
$$ y = [418597412, 418153648, 417121506, 416665878, 416364136, 415920563, 415235138, 414501419, 414002762, 413141327, 412725220, 412207756, 411319008, 410716591, 410261345, 410146866, 409755363, 409374580, 408991508, 408580132, 408430405, 407625351, 406866455, 406611214, 405987625, 405516739, 405726089, 405356026, 404508133, 404341621, 404016685, 403179703, 402315292, 401268234, 400479965, 400401955, 400278587, 399676437, 398897018, 398490257, 398793297, 398568802, 397641716, 397054253, 396334877, 395431099, 395087280, 394860001, 394350319, 393902435, 393093033, 392288551, 391994743, 391578636, 391213303, 390921478, 390308838, 389607811, 389180412, 389069672, 388588104, 387279625, 385972672, 385319786, 385285263, 385189362, 384464340, 383961792, 383557243, 382791519, 382216835, 381843758, 381147766, 380044289, 379180870, 378499451, 378240395, 378170052, 377308159, 375879402]
3344.4C75879402j088905l9940l30582q13865o19507q70400o29310n19524m35982n14259
3354.1C70017128n12047m92134r35936q42361j084862q68263j59264p60956j306534
3362.8C63054771k11944K83737o18324r94721r63936o26945r65385j046486n74723
3371.4C57336044r21058q57239n29823R8342j33628o87256o62995o80236k43798q49991
3381.1C51868362p86895j03035n59998r81674n79643K29568n4855l26843n14527m08745
3390.7C47781715m21676j128617n33332j22719m23737o38695o05239k76146K59628
3399.4C43891182J16157p99980o69555n88417j23597J12687m96712k58637k45781l59535
3409.1C40577812k67715m8065J73416j08338p39174m20723J06469k81334j5641j6441
$$ y = [375879402, 374790497, 374750557, 374419975, 373606110, 372986603, 372116203, 371486893, 370967369, 370531387, 370017128, 369505081, 369012947, 368077011, 367234650, 366149788, 365281525, 365122261, 364361305, 363054771, 362842827, 363126564, 362508240, 361513519, 360549583, 359922638, 358957253, 357910767, 357336044, 356414986, 355557747, 355027924, 355126266, 354992638, 354305382, 353642387, 352962151, 352718353, 351868362, 351081467, 350978432, 350418434, 349436760, 348857117, 349086685, 349031830, 348704987, 348190460, 347781715, 347360039, 346231422, 345698090, 345575371, 345151634, 344512939, 343907700, 343631554, 343891182, 344007339, 343207359, 342537804, 341949387, 341825790, 341938477, 341441765, 341183128, 340937347, 340577812, 340310097, 340262032, 340435448, 340327110, 339587936, 339167213, 339273682, 338992348, 338976707, 338960266]
3418.7C38960266j50223l18527p1487M38652l25508l38288j01661K74849O5383l72810
3428.3C38060646M17023L95660K0905l65448J44767N47867J9188R9182J18447j3581
3438C39444656K8954O07757O51665L27530j39847k99987L16238J282120J449661j266518
3447.6C42402229l81355J165161k8534P07360O91528O4163K42806Q90655Q25653K96860
3457.3C46876526N90935K99911M61197R8496M97055J090889L50837L61061M16413O01120
3466.9C51644440N49583J010132R32617N95131M95453p7782P08428O77490M07486P24525
3476.6C57667503Q47283R45892Q91380O58722j19018N64346P11784P03354J042862
3485.2C63914108Q52776J341209M52919k83165N07164J570511J166725K27471N46341
$$ y = [338960266, 338810043, 338491516, 338420029, 338858681, 338533173, 338194885, 338093224, 338368073, 338433456, 338060646, 338477669, 338873329, 338894234, 338528786, 338673553, 339221420, 339240608, 339339790, 339458237, 339444656, 339473610, 340081367, 340733032, 341060562, 340920715, 340620728, 340936966, 342219086, 343668747, 342402229, 342020874, 343186035, 343157501, 343864861, 344556389, 344620552, 344863358, 345754013, 346579666, 346876526, 347467461, 347767372, 348228569, 348327065, 348824120, 349915009, 350265846, 350626907, 351043320, 351644440, 352194023, 353204155, 354136772, 354731903, 355227356, 355149574, 355858002, 356535492, 356942978, 357667503, 358514786, 359460678, 360352058, 361010780, 360891762, 361456108, 362167892, 362871246, 363914108, 364766884, 366108093, 366561012, 366277847, 366785011, 368355522, 369522247, 369749718, 370296059]
3493.9C70296059O37016J084862P64999M00734R34410J110001P51114R25712J223450
3502.6C78128357J01356M22020Q99697R16557J108704J608276J122246l70064J222420
3511.3C85159569J093941P48252J178437N43441J174622J140633J303215Q20656J26419
3520C93289185O90918J514129J441307J36070P18651R82018J306648J089325P91245
3528.6D01959496R34410N43708J409569J140709J010971Q19359J386528J581497L12233
3537.3D11098480J263314Q69331Q32863J279869J435928J460686J444855J572151O05507
3546D21862984J228103m56047Q31337K378350K460289L108520p91168K79045J161537
3554.7D32062950J181221K105484M51317J479874J179924J296920J029358J956826
$$ y = [370296059, 370933075, 372017937, 372782936, 373183670, 374118080, 375228081, 375979195, 376904907, 378128357, 378229713, 378651733, 379551430, 380467987, 381576691, 383184967, 384307213, 383937149, 385159569, 386253510, 387001762, 388180199, 388723640, 389898262, 391038895, 392342110, 393162766, 393289185, 393980103, 395494232, 396935539, 397071609, 397790260, 398772278, 400078926, 401168251, 401959496, 402893906, 403437614, 404847183, 405987892, 406998863, 407818222, 409204750, 410786247, 411098480, 412361794, 413231125, 414063988, 415343857, 416779785, 418240471, 419685326, 421257477, 421862984, 423091087, 422635040, 423466377, 425844727, 428305016, 431413536, 430622368, 430901413, 432062950, 433244171, 435349655, 435800972, 437280846, 438460770, 439757690, 440787048, 442743874]
3562.4D42743874J876258N83687M613190J532593k71416K61955p31811L859405J670571
3571.1D56138306J158371K030868J585579J324120J700477K603874N51644K104873
3578.8D69198112K317086P05528J366615K144203K024804P93609M191933K286072j224480
3587.5D83803482J964645j088447K411537L183174L357620K435418M55207K793808
3595.2D99316444p76481K093544L563041P62406L312950P98454J10970K237396J766892
3603.9E13185616J890296K827111K473030J35536M901581J28898j990623P550926K136421
3612.5E33238792k758216L514938p92389L201218M406128K86445K128258q87451J98517
3621.2E42536240L093719K421455J915284K478180K215805K058525O703949J629524
$$ y = [442743874, 444620132, 445203819, 449817009, 451349602, 451078186, 451340141, 450608330, 454467735, 456138306, 457296677, 459327545, 460913124, 462237244, 463937721, 466541595, 467093239, 469198112, 471515198, 472220726, 473587341, 475731544, 477756348, 478549957, 482741890, 485027962, 483803482, 485768127, 484679680, 487091217, 490274391, 493632011, 496067429, 496522636, 499316444, 498539963, 500633507, 504196548, 504958954, 508271904, 509070358, 509181328, 511418724, 513185616, 515075912, 517903023, 520376053, 520511589, 525413170, 525542068, 523551445, 531102371, 533238792, 530480576, 533995514, 533203125, 536404343, 540810471, 541096916, 543225174, 542337723, 542536240, 545629959, 548051414, 549966698, 552444878, 554660683, 556719208, 563423157, 565052681]
3628.9E65052681j0481300L174858M319191M525909O43768k102699J817093K793884
3636.6E69743385K331772L82385J000100K060852K324829P95746o5613K036018L221512
3645.3E83830986N657005k34108l181266N714988J334114m113960k772179L837967
3653E90073547L162690L836822N511665p235336J16425L956451J037407J697845L47405
3661.7F02504921R73549M05617J037788J521645Q33549M445801K957344n18417L27568
3670.4F14489365p627640N58967P380715Q900375K648583j7937203K47116P047577
3678.1F15707855M852028k089310j079444L099670J812897N72853m52881k44942M426308
3686.8F26605034O976776p601852l746834R235039n962906k861519N464859N46989
$$ y = [565052681, 554571381, 557746239, 562065430, 566591339, 567235107, 565132408, 566949501, 569743385, 572075157, 572457542, 573457642, 575518494, 577843323, 578639069, 578573456, 580609474, 583830986, 589487991, 589253883, 586072617, 591787605, 593121719, 589007759, 586235580, 590073547, 593236237, 597073059, 602584724, 595349388, 595465813, 599422264, 600459671, 602157516, 602504921, 603478470, 603884087, 604921875, 606443520, 607277069, 611722870, 614680214, 614161797, 614489365, 606861725, 607420692, 614801407, 623701782, 626350365, 608413162, 608660278, 615707855, 620559883, 618470573, 617391129, 620490799, 622303696, 622876549, 622423668, 622178726, 626605034, 633581810, 625979958, 622233124, 631468163, 625505257, 622643738, 628108597, 628655586]
3694.5F28655586J250649N75180m26903P60460j52893K699966L275376m912873l159866
3703.2F28564682L932991J385498n3558N09071K073059L746262o166840M032974O511536
3711.9F44535675j3461609K203827M150810o14433k89536K363244J617393l798370
3719.6F36707001P33185O061401l016968n193176M343529R45320r2392k633972j048279
3728.3F36805649L436279O60477N436020j738892p792358J0163192M450837q807297
3736F42613907j268997L08532j245880J880799L915023l913879J535416J3197860o226806
3744.7F50795975j9387856Q932915N077362O377106l072892j1593322J1302414m087525
3752.4F44344177p591667N358162M259415L260193n275422J916275O197358p213440
$$ y = [628655586, 629906235, 630481415, 630054512, 630814972, 630662079, 633362045, 636637421, 631724548, 628564682, 632497673, 633883171, 633829613, 634338684, 636411743, 640158005, 633991165, 638024139, 644535675, 631074066, 633277893, 637428703, 636814270, 636524734, 638887978, 640505371, 636707001, 637440186, 643501587, 640484619, 635291443, 639634972, 640580292, 640487900, 637853928, 636805649, 640241928, 640902405, 646338425, 644599533, 636807175, 646970367, 651421204, 642613907, 641344910, 641653442, 640407562, 642288361, 646203384, 642289505, 643824921, 657022781, 650795975, 631408119, 640341034, 645418396, 651795502, 648722610, 637129288, 648431702, 644344177, 636752510, 642110672, 646370087, 649630280, 644354858, 646271133, 652468491, 645255051]
3760.1F45255051k839356L309326M50364J98974M012451k375107n243759K790909N154190
3768.8F50713043J323242q179397J108169K926865m03976M59213K95791J214753q3542
3777.4F49374161K410507J125793q107986J211700K437439P42875K508773k262802
3785.2F49440460j637649J308441J140213N29251r70535n76554J09330N72738r53903
3793.8F48961792J239395M662323l172684m573211J583709L863144O491471n165711
3801.5F53890228j0557556K390900K349319N110016O423493q789292o152115L672867
3809.3F48337860K546158P45163j49231m84848J170425O274872m9743j4495545L322678
3817.9F47217789N663681N788345K768860j6867676l39584M632263K925034L111038
$$ y = [645255051, 642415695, 645725021, 646175385, 646374359, 650386810, 648011703, 642767944, 645558853, 650713043, 652036285, 643856888, 644965057, 647891922, 647487946, 647947159, 648242950, 649457703, 649374161, 651784668, 652910461, 644802475, 646014175, 648451614, 649194489, 651703262, 649440460, 647802811, 649111252, 650251465, 650780716, 649810181, 649233627, 649342957, 649915695, 648961792, 650201187, 654863510, 651690826, 647117615, 648701324, 652564468, 659055939, 653890228, 643332672, 645723572, 648072891, 653182907, 659606400, 650817108, 644664993, 648337860, 650884018, 651629181, 651479950, 650995102, 652165527, 658440399, 658390656, 643895111, 647217789, 652881470, 658669815, 661438675, 644570999, 644231415, 648863678, 651788712, 654899750]
3825.7F54899750m28467m738541n34668J562271M422989L756180r471817P07245O950531
3834.3F57125473n665665j24511R130478q419190n801849P987747m156952k57492O369247
3843F56187286k793884m456787K298965J908875j45798J114578j486740K030335P667694
3851.7F62324524k390518J538620j8201371q82263J1084748o78330k883530J691514
3859.4F51603394K618560L218155m563751L70178P218323o946030o938553L484192
3867.1F50064468M909211P807846o082611j0620270K888107N992584M883576j0145264
3874.8F49697647j100769L250046n57938K501755N984726k986603r227600M622269
3882.6F52183533J297073J984482O321030j3456421k93198L607636P77969M997787
$$ y = [654899750, 654471283, 649732742, 649198074, 650760345, 655183334, 658939514, 649467697, 650174942, 657125473, 651459808, 651335297, 660465775, 652046585, 646244736, 654232483, 650075531, 649818039, 656187286, 653393402, 648936615, 651235580, 653144455, 652998657, 654113235, 652626495, 654656830, 662324524, 659934006, 661472626, 643271255, 642388992, 653473740, 652795410, 649911880, 651603394, 654221954, 657440109, 652876358, 653246536, 660464859, 653518829, 646580276, 650064468, 654973679, 662781525, 656698914, 646078644, 648966751, 654959335, 659842911, 649697647, 648596878, 651846924, 651288986, 653790741, 659775467, 656788864, 647561264, 652183533, 653480606, 655465088, 661786118, 648329697, 648036499, 651644135, 652422104, 657419891]
3890.3F57419891L10822p709656k8763K931671j815643Q58765J847839K696991K940064
3898.9F59451981j0313797L685302K726441n849686N284271k404709j785430O50711
3906.7F51445084l06549K265625K35366n12237m80881N98831L44544q71735R38263
3915.3F53656311K554016k382431m428482L695374N43975m214172J917114K446289
3923.1F53787994J364212k342605k977219R38187J099624J490937j086121n43747K485352
3931.7F54216614j558914j960984M15116j78528N02090J178818k66724j312637o93664
3940.4F50341187J778869J697769l590698o98929K099304J578446J329269k663421
3948.1F51871796J8158Q54797k430954Q49152N25207J56174N38635m04968K40707m78439
$$ y = [657419891, 657730713, 650021057, 649992294, 652923965, 651108322, 651967087, 653814926, 656511917, 659451981, 649138184, 652823486, 655549927, 649700241, 654984512, 652579803, 650794373, 651445084, 651138535, 653404160, 653639526, 653127289, 652646408, 653245239, 653589783, 652718048, 653656311, 656210327, 653827896, 649399414, 653094788, 653638763, 649424591, 651341705, 653787994, 655152206, 652809601, 649832382, 650770569, 651870193, 653361130, 652275009, 651731262, 654216614, 652657700, 650696716, 651111832, 650933304, 651435394, 652614212, 652347488, 651034851, 650341187, 652120056, 653817825, 650227127, 649528198, 651627502, 653205948, 654535217, 651871796, 651889954, 652744751, 650313797, 651162949, 651688156, 651844330, 652382965, 651977997, 652218704, 651740265]
3957.8F51740265J36642N62287M36020j30082j950912j09406Q07724m87365J77612
3966.5F51182785P44324O8741r64966r09729P65762J120682L58581j95846o16074l58124
3976.1F51196136n42526P6065J160584J75400j000977k06757M41056N50155N86548
3984.8F52435684q48999q09097k2278K65198N92880n90515l22189k5101L88183J312485
3994.4F52376251j98746r06066p1793M17786m41132m81338
4000.2F50694962
$$ y = [651740265, 651876907, 652439194, 652875214, 652745132, 650794220, 650684814, 651492538, 651005173, 651182785, 651927109, 651995850, 651030884, 650121155, 650886917, 652007599, 652366180, 652170334, 651554260, 651196136, 650653610, 650729675, 651890259, 652065659, 651064682, 650857925, 651298981, 651849136, 652435684, 651586685, 650777588, 650755310, 651020508, 651613388, 651022873, 650700684, 650675583, 651063766, 652376251, 652177505, 651271439, 651199646, 651617432, 651176300, 650694962]
##END=$$ End of the data block
