##TITLE=$$ Begin of the data block
##JCAMP-DX=5.00 $$ ACD/SpecManager v 10.08
##SPECTROMETER/DATA SYSTEM=Varian
##DATE=04 Dec 2012 13:51:44
##DATA TYPE=INFRARED SPECTRUM
##DATA CLASS=XYDATA
##ORIGIN=
##OWNER=
##NPOINTS=3735
##FIRSTX=399.26403809
##LASTX=4000.35498047
##MAXX=4000.35498047
##MINX=399.26403809
##MAXY=75.04582977
##MINY=33.93813324
##XFACTOR=1.0000000000
##YFACTOR=0.000000100000000
##FIRSTY=62.08444595
##DELTAX=0.96440572
##XUNITS=1/CM
##YUNITS=TRANSMITTANCE
##XYDATA=(X++(Y..Y))
399.3F20844460J2791976Q428841P125778j5368004j3988189k723007O460571R519729
407F33092155n034904j731300O27212j464577J945763l348656k261352J598129M94957
415.7F23917427J127129K270698O416092K558098o904411k984314l200035m718247
423.4F18482437l048820k105217O578941O191063k131996l579445j5068K910385K079353
432.1F25361633l395157n916023J519699J912575j594353L076134K68593k323227J438484
440.7F20348358N330048m55895n097389N92270p96356p25556K075539J324959j496849
449.4F21099129m413414J671600M723740J376037q24203K22397L944625M147530j267166
458.1F30680275p249756n131111k808571K01683K560158Q42857J498299K55279l251152
$$ y = [620844460, 633636436, 642065277, 649191055, 633823051, 619834862, 617111855, 623572426, 633092155, 628057251, 626325951, 626953163, 625488586, 627434349, 624085693, 621824341, 623422470, 623917427, 625044556, 627315254, 633731346, 636289444, 629385033, 626400719, 623200684, 618482437, 615433617, 613328400, 619907341, 626098404, 623966408, 620386963, 620371895, 623282280, 625361633, 621966476, 616050453, 617570152, 619482727, 617888374, 620964508, 621233101, 618909874, 620348358, 625678406, 625222511, 620125122, 620717392, 619921036, 619195480, 621271019, 622595978, 621099129, 616685715, 618357315, 623081055, 624457092, 623632889, 623855286, 627799911, 631947441, 630680275, 623430519, 618299408, 615490837, 615692520, 618252678, 619095535, 620593834, 620849113, 617597961]
466.8F17597961m96635k052116l066712J943321K268525J892585J292191l78914n026207
475.5F13973999o573791M28543Q15391q13293p78961j890030l17727K760659J467857
484.1F09072647m402656k184449J180497J176338K092323J721611k17552n911598m508400
492.8E98018761j70937j394577K307091K222938j789131j514206l95775J772843J225319
501.5F00282326k03820j022453p58972J086884n12429l827743m167900j412850p13539
510.2E88749504k439575j074906j072311k34260J72920j358910q27370k534980l866196
518.9E75513916k219276J846962J96495j981278O12259Q30269Q82454k005501k750320
527.5E70925980L12233J110878k15531n49545K280731J087227J33667J112862q86803
$$ y = [617597961, 617101326, 615049210, 611982498, 613925819, 616194344, 618086929, 619379120, 619000206, 613973999, 607400208, 607828751, 608644142, 607830849, 607051888, 605161858, 604844131, 607604790, 609072647, 604669991, 602485542, 603666039, 604842377, 606934700, 608656311, 608438759, 602527161, 598018761, 597847824, 596453247, 598760338, 600983276, 599194145, 597679939, 597284164, 599057007, 600282326, 600078506, 599056053, 598297081, 599383965, 598871536, 595043793, 590875893, 589463043, 588749504, 586309929, 585235023, 584162712, 583928452, 584101372, 582742462, 581915092, 579380112, 575513916, 573294640, 575141602, 575338097, 573356819, 573969078, 574799347, 575681801, 573676300, 570925980, 571238213, 572349091, 572133560, 571584015, 573864746, 574951973, 575085640, 576198502, 575311699]
536.2E75311699J009178J555557l87420O76727K099876M676628K174492k966880q41446
544.9E83308411J064071J97754j61056j367760j152420O60438O76690J91230J92032
553.6E83609390j341858j888427n46151M28658K42348j65940K76146j561622k602349
562.3E76450195o89354p17735j944618l131104j902122O96373l29590j898994l133812
570.9E63399239k856408j180229l85628O524M92019M63677q88672n02091M49524J904145
580.6E60902100J867637J556702K549629J944771K100830J478386R80492M65812K07711
589.3E74054070L72352J71089J757164J555023J60294r21478o31447L84750m4555o86226
598.9E76171036n3520K206916J081314j518402j341056J2245j2284m13055M59785O11344
$$ y = [575311699, 576320877, 577876434, 577489014, 578165741, 580265617, 584942245, 587116737, 584149857, 583308411, 584372482, 584570236, 584409180, 583041420, 581889000, 582549438, 583226128, 583417358, 583609390, 582267532, 580379105, 579832954, 580261612, 580503960, 580338020, 580614166, 579052544, 576450195, 575760841, 575043106, 573098488, 569967384, 568065262, 568761635, 568432045, 566533051, 563399239, 560542831, 559362602, 558976974, 558983498, 559475517, 559939194, 559050522, 558548431, 558997955, 560902100, 562769737, 564326439, 566876068, 568820839, 570921669, 572400055, 573380547, 573846359, 574054070, 574426422, 574597511, 576354675, 577909698, 578069992, 577148514, 576517067, 576901817, 576857262, 576171036, 576117516, 578324432, 579405746, 577887344, 576546288, 576558533, 576546249, 576133194, 576592979, 577204323]
608.5E77204323J694259R47266j102257j88560J061096J471977N93491N82924J131515
617.2E83396034J318512R65653P89871J242485P55272J597328J922035K477913K509041
625.9E96974144J109047J013985K00042P10984P73506k37999M83436J485444K095031
634.6F04607620J618424K34718l10898J000405J516075N24864L66096K36588o35300
643.3F09158592n47142P63588J137657R83582M62112N09224R38301O17104P29408l57666
652.9F14394760n14068K11334m6616L17726J06850j90468j53808K63938Q65746M29993
662.5F15685387Q2702K94152Q84361J616249M13856p935867K366982L601799O58950
671.2F17668571L11738M04052R2125O94313J067848O88019P2251p782j00708O16035
$$ y = [577204323, 578898582, 579845848, 578743591, 578555031, 579616127, 581088104, 581681595, 582264519, 583396034, 584714546, 585680199, 586470070, 587712555, 588467827, 590065155, 591987190, 594465103, 596974144, 598083191, 599097176, 599297218, 600008202, 600781708, 600543709, 601027145, 602512589, 604607620, 606226044, 606460762, 606149864, 607150269, 608666344, 609191208, 609557304, 609793892, 609158592, 608611450, 609375038, 610512695, 611496277, 611958389, 612467613, 613405914, 614023018, 614752426, 614394760, 613880692, 614092026, 614045410, 614363136, 614469986, 614279518, 614125710, 614389648, 615255394, 615685387, 615768089, 616062241, 616946602, 618562851, 618976707, 611040840, 613407822, 617009621, 617668571, 617980309, 618384361, 618476486, 619170799, 620238647, 620926666, 620998917, 620991135, 620890427, 621506462]
680.9F21506462J272965R77020K76337o24924L48816O86569k58179L78990M16871j51940
690.5F24828987m10194m71306N46112J108971p8774o29692n188j338959k269058q97751
700.2F20383148L89786M31137j019783r32655j24131j386604k167740m01420J118087
708.8F16289825O89927J246337P69539m20417P04460J029739J134606J050567K72522
717.5F22767105O18820R81293O99539P86934J738892J522178J300087J932831J463623
726.2F33811302R99794J551628K472382K067833J358795R91211J089859J551132J604386
734.9F47498322J312255K02103R93652J557618Q09173R07288Q49075J74332o8589J236649
744.5F55471878j30157j380616j225662j317520K28577K28271L53623m12598j057129
$$ y = [621506462, 622779427, 623756447, 624032784, 623407860, 623756676, 624443245, 624185066, 624564056, 624980927, 624828987, 624418793, 623947487, 624493599, 625602570, 625523796, 624894104, 624888916, 623549957, 621280899, 620383148, 620772934, 621204071, 620184288, 619251633, 619127502, 617740898, 615573158, 615171738, 616289825, 616979752, 618226089, 618995628, 618575211, 619279671, 620309410, 621444016, 622494583, 622767105, 623385925, 624367218, 625066757, 625853691, 627592583, 629114761, 630414848, 632347679, 633811302, 634811096, 636362724, 638835106, 640902939, 642261734, 643252945, 644342804, 645893936, 647498322, 648810577, 649012680, 650006332, 651563950, 652373123, 653280411, 654129486, 654303818, 654235229, 655471878, 655341721, 653961105, 652735443, 651417923, 651646500, 651874771, 652228394, 651815796, 650758667]
753.2F50758667j131134k984543j940308j386871j242752J105728J337586k22626q09021
761.9F43484726k29187j36948J51749Q64410J122437M53720Q06961J712570J149216
770.6F49379654K232819K142410P11593J193009J559372J184311J476822K543106J938553
779.2F64361649J614913J703873J360932J465377J227875J189728M26025J20163N12772
787.9F73983307O49643J043091K029342J704941K37961O84128P23114K31704L36915
796.6F81624146J444168J657257L31955J184311J873245P66372m86679L74070R64279
805.3F89733124M20685J279983J342468Q34046L50876J075821J183013p8353q8425
814F96053238N47180M41284n78232J8692M65546J165009M06189j955490j291657o73447
$$ y = [650758667, 649627533, 646642990, 644702682, 643315811, 642073059, 643178787, 644516373, 644293747, 643484726, 643255539, 643118591, 643270340, 644134750, 645257187, 645710907, 646517868, 648230438, 649379654, 651612473, 653754883, 654466476, 655659485, 657218857, 658403168, 659879990, 662423096, 664361649, 665976562, 667680435, 669041367, 670506744, 671734619, 672924347, 673350372, 673470535, 673983307, 674632950, 675676041, 677705383, 679410324, 679648285, 680332413, 681055527, 681287231, 681624146, 683068314, 684725571, 685057526, 686241837, 688115082, 688881454, 688394775, 688768845, 689733124, 690153809, 691433792, 692776260, 693610306, 693961182, 695037003, 696220016, 696141663, 696053238, 696600418, 697041702, 696463470, 696482162, 696947708, 698112717, 698518906, 696563416, 695271759, 694598312]
823.6F94598312M3259k24304r04617k5788O90384j64719k424163j651688j085205j459656
833.3F87391815q90045j082535q66623j319351j950912j092606O03638j4954j648407
841.9F79130020j508026j383514j244202j133804n89981j88523n40314p35702l90778
850.6F71415176k43911q78067n80063k70996j10550j91269l67356O38123O85501m97818
860.3F69598770o82831J174851J561661J176147K181244J734314J953430J873398J268387
868.9F81839371J613311J230774K235032K810821R51996M21753J712799K205734J345444
877.6F96367035m78058n95703J7700k54669l14255j071548q55637j199875j696090
886.3F89918900j246567j922608j872406j373901j516800j501617j413803j375809
$$ y = [694598312, 694641571, 694417267, 693512650, 693486862, 694177246, 694012527, 691588364, 689936676, 688851471, 687391815, 686501770, 685419235, 684552612, 683233261, 681282349, 680189743, 680793381, 680778427, 679130020, 677621994, 676238480, 674994278, 673860474, 673270493, 673081970, 672541656, 671805954, 671415176, 671171265, 670293198, 669713135, 669442139, 669331589, 669140320, 668772964, 669411087, 670096588, 669598770, 668915939, 670090790, 671652451, 672828598, 675009842, 676744156, 678697586, 680570984, 681839371, 683452682, 684683456, 686918488, 689729309, 690681305, 691103058, 692815857, 695021591, 696367035, 695888977, 695293274, 695310974, 695056305, 694742050, 693670502, 692814865, 691614990, 689918900, 688672333, 686749725, 684877319, 683503418, 681986618, 680485001, 679071198, 677695389]
894F77695389j133118j500625j101532n22080j039429p61108j327896j797333j306839
902.7F67205429q24814p24411j032409j110077k222062j935501j374206j919022k374878
911.4F53688049l209381k512665j899871k225113k296524k030602k086754k280922
919.1F35146217k267837k143097j149750q39996j137657j316491n94291J09291r16596
927.8F24889793j185608r75532p31850O8512M58870O87866M67835L13339P80258P24640
937.4F25498123L25127Q11729J156197Q14895R20182J016426P77664Q77228J552810
946.1F33750381L14560j707954j392937j391754j811943j970863j340142j261978l367767
954.8F19819603l654785k587586k648353k873192l268089l875199m094619l904648
$$ y = [677695389, 676562271, 675061646, 673960114, 673438034, 672398605, 671637497, 670309601, 668512268, 667205429, 666380615, 665656204, 664623795, 663513718, 661291656, 659356155, 657981949, 656062927, 653688049, 650478668, 647966003, 646066132, 643841019, 641544495, 639513893, 637427139, 635146217, 632878380, 630735283, 629585533, 628745537, 627607880, 626291389, 625697098, 625806389, 624889793, 623704185, 622728653, 621996803, 622065315, 622524185, 623212051, 623679886, 623993225, 624773483, 625498123, 625823250, 626634979, 627791176, 628606071, 629526253, 630542679, 631320343, 632197571, 633750381, 634064941, 632356987, 630964050, 629572296, 627760353, 625789490, 624449348, 623187370, 619819603, 616164818, 613577232, 610928879, 608055687, 604787598, 600912399, 596817780, 592913132]
962.5E92913132l734970m209404m377671m407463m373245m341125n383721n802879
970.2E56282654o015396n904198o310844o859017o677704o990471o353645o686439
977.9E04484940o791802p265854o995582o318512p128983o177254o148338m401512
985.6D53257103l885574m917488m607010m147530k507057k535019k105866k858810
993.3D25692749k473030j530953j018447k51885j618843k38037j65215n10978k47269
1002D17638092Q2741l67928j448288K87438q13294j046142j124420j443634j388169
1010.7D10376396j936798j081238k178955j215248j591492j666641j013298j295204
1018.4C98397522j17416q65288j10703o79855p95555k90909R16443J414108N18837
$$ y = [592913132, 589178162, 584968758, 580591087, 576183624, 571810379, 567469254, 562085533, 556282654, 550267258, 544363060, 538052216, 531193199, 524515495, 517525024, 511171379, 504484940, 497693138, 490427284, 483431702, 477113190, 469984207, 463806953, 457658615, 453257103, 449371529, 444454041, 439847031, 435699501, 433192444, 430657425, 428551559, 425692749, 423219719, 421688766, 420670319, 420418434, 418799591, 418561554, 418396339, 417885361, 417638092, 417720833, 417352905, 415904617, 416192055, 415378761, 414332619, 413208199, 411764565, 410376396, 408439598, 407358360, 405179405, 403964157, 402372665, 400706024, 399692726, 398397522, 398280106, 397414818, 397304115, 396624260, 395828705, 395537796, 396454239, 397868347, 398387184]
1027.1C98387184K050629m5510M36631P46155K83393J055298K02599J053161J21346
1035.8D04290886R09424L40042N52444M95415j337204k89917j26038J720772L95012
1044.5D06950836K71950P28912J21727R44939m8523J625443J026687J476746J277199
1053.1D14375916R52224K015152J510124L058625K097892K807847K626533L076859
1060.9D32521172L345222K702599M568710L139267L534698K838669L176842J806602
1068.6D57633781j561851j366844k946854k193794m133873n420914l834610k632370
1076.3D33542671j661453k988701j321564j363716N4970K86446J89972J737709J652412
1085D30128746K304916K88430K332725K828293J986771K924957K925491K793961Q23860
$$ y = [398387184, 400437813, 400392303, 400828934, 401575089, 401858482, 402913780, 403116379, 404169540, 404290886, 405200310, 405540352, 406092796, 406588211, 405251007, 404961090, 404835052, 406555824, 406950836, 407222786, 407951698, 408073425, 409018364, 408969841, 410595284, 411621971, 413098717, 414375916, 415328140, 417343292, 418853416, 421912041, 424009933, 426817780, 429444313, 432521172, 435866394, 438568993, 443137703, 446276970, 449811668, 452650337, 455827179, 457633781, 456071930, 454705086, 451758232, 449564438, 445430565, 440009651, 436175041, 433542671, 431881218, 428892517, 427570953, 426207237, 426262207, 426548653, 426738625, 428476334, 430128746, 432433662, 432722092, 435054817, 437883110, 439869881, 442794838, 445720329, 448514290, 449338150]
1093.6D49338150K847328K185745J118050J514626O02607J084061M5319J007576J103706
1102.3D60847168Q92410O81458O81877R69009L04642J383896J412926J950607R73968
1111D70097961J583367K251549R50508J396141M21715R77134L28484O30340J705666
1119.7D80342865J104546J385917O90537J528434J671830J922722J552810J007233
1127.4D91206894J393547J163521J608429Q91800J526336P75605R2353L8414j388549
1136.1D97308350q53844j238480j309738k080650k139015k010422k537003j744117
1143.8D83395081k864228k536659k626266k443543k503281k601623j208153j649132
1151.5D64962196j097068k020760j762543q67538l46413j21002n75905J089439P44553
$$ y = [449338150, 452185478, 454371223, 455489273, 457003899, 457606506, 458690567, 458735886, 459743462, 460847168, 461739578, 462421036, 463102913, 464071922, 464376564, 465760460, 467173386, 469123993, 470097961, 471681328, 473932877, 474883385, 476279526, 476701241, 477678375, 478006859, 478637199, 480342865, 481447411, 482833328, 483523865, 485052299, 486724129, 488646851, 490199661, 491206894, 492600441, 493763962, 495372391, 496264191, 497790527, 498566132, 498658485, 498696899, 497308350, 496454506, 495216026, 493906288, 491825638, 489686623, 487676201, 485139198, 483395081, 480530853, 477994194, 475367928, 472924385, 470421104, 467819481, 466611328, 464962196, 463865128, 461844368, 460081825, 459214287, 458867874, 458746872, 458170967, 459260406, 460004959]
1160.2D60004959J098213J458054K508049K817001K707939M020272L421249M316712
1167.9D82352448L623886L976402M742508M556007N284081M908828M740677L560677
1175.6E17745514M445000M708366L943329M330559M527321M729461L348961L298416
1183.3E51076927L491821L205109L135338K802620K871857K298164J763573J355095
1191E72000504J590805J545753J006432Q31451P79533R76639O5918j30882P53708Q06198
1200.7E80226059O19812P53937N65529j98632L18642Q84399P07436P38792O76842J067696
1210.3E86360512R19075J96304O00014J258545J065407J006660Q27103N07354N112
1219E92746086m54521P0763K09198j84250p25594r55391n13801n65186p37953p61376
$$ y = [460004959, 461103172, 462561226, 465069275, 467886276, 470594215, 474614487, 478035736, 482352448, 485976334, 489952736, 494695244, 499251251, 504535332, 509444160, 514184837, 517745514, 522190514, 526898880, 530842209, 535172768, 539700089, 544429550, 547778511, 551076927, 554568748, 557773857, 560909195, 563711815, 566583672, 568881836, 570645409, 572000504, 573591309, 575137062, 576143494, 576974945, 577754478, 578731117, 578797035, 578666153, 579419861, 580226059, 580845871, 581599808, 582165337, 581966705, 582285347, 583169746, 583877182, 584615974, 585292816, 586360512, 587279587, 587475891, 588075905, 589334450, 590399857, 591406517, 592233620, 592740974, 592746086, 592291565, 592362328, 592571526, 592387276, 591661682, 590706291, 590192490, 589627304, 588889351, 588127975]
1228.6E88127975q34732j181144j086541r05494j336785n34553P4081k88696p51305
1237.3E81282806p18879j39923l72010n06630K5292N17731R9029M00009P62711N71937
1247E81922073J053353O41174P94601O88973O27403J241913P34520O88972Q72918O10962
1256.6E89876862L09257O65169O96945O46668J061096O02264M76380L80439O01807
1265.3E95316887Q55293Q46176J170998R19800P50313N76667N20935M75083O87370
1274F02119522R76143M86336L57589M70696N30891M00620L16200K89116J25771O73217
1283.6F06746101J013184O06499J43089L10326N31425L63808N33409J55220j04256
1292.3F10298805J22605j30310N9204O1378k96707m60396n89027j18790L19328K62642
$$ y = [588127975, 587293243, 586112099, 585025558, 584120064, 582783279, 582248726, 582322807, 582034111, 581282806, 580563927, 580424004, 580051994, 579545364, 579570656, 580088387, 580187416, 580587425, 581350136, 581922073, 582975426, 583616600, 584411201, 585100174, 585727577, 586969490, 587704010, 588392982, 589265900, 589876862, 590186119, 590851288, 591548233, 592194901, 593255997, 593858261, 594334641, 594715080, 595316887, 596172180, 597018356, 598189354, 599109154, 599859467, 600436134, 600957069, 601432152, 602119522, 603095665, 603582001, 603939590, 604410286, 604941177, 605341797, 605657997, 605947113, 606072884, 606746101, 607759285, 608365784, 608508873, 608819199, 609350624, 609714432, 610247841, 610403061, 610298805, 610421410, 610291100, 610350304, 610411682, 610114975, 609654579, 609065552, 608946762, 609266090, 609528732]
1301.9F09528732l49159o17523l1243J20049k66876k90032K86675j53885q61244r6054
1311.6F07269440K55241m07448n68084j89553l74641o94390j48696j82190p11403n85099
1321.2F03663177o18324l03421o1722o08711o71005n82466o15120o64787p26243o57424
1330.9E98153954n76745l71475p29675n75218o8894k38838l87611k21215m3182r16519
1340.5E94024582n94215L90968R4642j19247P8583K02179K70309P6981j2779k90299
1350.2E94121704m42886l49159m58680k66609m85115q94089l76434l38821m81759J4611
1359.8E90042763l20435p92236n63011j685295q79288P2136p70416l34893k29110p34368
1369.4E83805847K14043k37503r3308L34893n56984q14629n36919l22570l82119L11890
$$ y = [609528732, 609179573, 608562050, 608530807, 608650856, 608383980, 608093948, 608380623, 608226738, 607365494, 607269440, 607524681, 607117233, 606549149, 606359596, 605984955, 605290565, 605141869, 604959679, 604248276, 603663177, 603044853, 602741432, 602679710, 602070999, 601399994, 600817528, 600202408, 599537621, 598811378, 598153954, 597577209, 597205734, 596476059, 595900841, 595831947, 595593109, 595205498, 594984283, 594941101, 594024582, 593430367, 593821335, 593915977, 593796730, 593875313, 594077492, 594347801, 594424782, 594412003, 594121704, 593678818, 593329659, 592870979, 592604370, 592119255, 591225166, 590848732, 590509911, 590028152, 590042763, 589722328, 588930092, 588367081, 586681786, 585802498, 585874634, 585104218, 584769325, 584540215, 583805847, 584019890, 583782387, 583689079, 584023972, 583466988, 582652359, 582115440, 581792870, 581410751, 581722641]
1379.1E81722641P01904Q76656O41708K29721P53136P81593J380463J899109P25975
1387.8E89712906P23305J320457J110153P14264K38991Q55522m03595k365799L64685
1396.4E92270889O61850Q23288p37495j353226M63982j08681N4016M10957p18650m40140
1406.1E91326790K71034k50816l16277m1961k20643l87840j030655m67415l26843o485
1415.7E88548889L03154j8120J324234j680908k5215J533241N32074O57501p63931
1424.4E90410919O13671R47723J01700L24173j7929q13790r54399O84700m9171p48711
1434.1E90498886P51648J035805l437882j515464K065887K05269R6969K89422p23954
1442.7E89266586l31840o84395m7226L40691M50554j952515p22237K17858j558037
$$ y = [581722641, 582424545, 583301201, 583942909, 584172630, 584925766, 585707359, 587087822, 588986931, 589712906, 590436211, 591756668, 592866821, 593581085, 593820076, 594675598, 594272003, 591906204, 592270889, 592932739, 593756027, 593018532, 591665306, 592129288, 592020607, 592074623, 592485580, 591766930, 591326790, 591597824, 591347008, 591030731, 590988770, 590768127, 590380287, 589349632, 588882217, 588555374, 588548889, 588852043, 588833923, 590158157, 588477249, 588452034, 589985275, 590517349, 591174850, 590410919, 591024590, 591972313, 592074013, 592398186, 592380257, 591566467, 590612068, 591296768, 591247597, 590498886, 591250534, 592286339, 588848457, 587332993, 589398880, 589604149, 589701118, 589990540, 589266586, 588934746, 588250351, 588203125, 588543816, 588994370, 587041855, 586319618, 586537476, 584979439]
1451.4E84979439j442261j682320Q622l38669p3700j510277l165436K361603l22914
1460.1E78814087J993294L15818J99280J964073j200409N30129J141663M041214M048805
1468.8E91847954N969963P376747N424500O764373L937226N047721M155922L114701
1476.5F33639107K428932L290710L188248K480011K914352J227799J906738J392822
1484.2F52468719J136628K166137N55802N50918K054367J074982k712936K51541J420135
1492.9F58966293K25220R61838J017380l660355P02591R68017k670593N54123K76795
1501.6F57341309r96247l33709P52105K291260l986969r265823J269149K077485q69523
1510.2F48279037l88412j054688l335800j44729o80237m77829L46374l618545J847305
$$ y = [584979439, 583537178, 581854858, 581863480, 581524811, 581451111, 579940834, 576775398, 579137001, 578814087, 580807381, 581123199, 581322479, 583286552, 582086143, 582616272, 583757935, 587799149, 591847954, 597817917, 605194664, 610619164, 617383537, 621320763, 626368484, 630524406, 633639107, 636068039, 639358749, 642546997, 645027008, 647941360, 649169159, 651075897, 652468719, 653605347, 655771484, 656327286, 656878204, 658932571, 660007553, 657294617, 657546158, 658966293, 659191513, 660153351, 661170731, 657510376, 658212967, 659180984, 656510391, 657064514, 657341309, 656345062, 656011353, 656763458, 659054718, 655067749, 645801926, 647071075, 649148560, 648279037, 647890625, 646835937, 643500137, 643355408, 642675171, 642197342, 642543716, 638925171, 640772476]
1518.9F40772476K937927m01077k166519j377716R44672J741485j375809o28891R68323
1527.6F41414871j428833n97038O48537J78833Q68454p98340m160424O96030O75659
1536.3F37497749R58290K915192j197967o760560M863320O91719k596512J178169R99527
1545F38548927j337738J069451J328430J582947J223831j664505J173477K164307J945800
1553.6F46034927p67898K56271M962311M532394r47113l363189k510834M155350K147674
1562.3F54499893J722489J470871J71966M24652J370392K142487J509781l292313K35443
1571F60255661J968842N06591N34821J668014J447144n507050J43662J788254L7994
1579.7F62843933K8458r31244n49545n53894r94339q24280j000595k49176p01752o52313
$$ y = [640772476, 643710403, 643309326, 641142807, 639765091, 640709763, 642451248, 641075439, 640446548, 641414871, 639986038, 639389000, 640037537, 640216370, 641084824, 640286484, 636126060, 636822090, 637497749, 638456039, 641371231, 640173264, 633412704, 638276024, 638967743, 636371231, 637549400, 638548927, 637211189, 638280640, 639609070, 641192017, 642415848, 640751343, 641924820, 644089127, 646034927, 645267029, 645523300, 650485611, 655018005, 654070892, 650707703, 648196869, 652352219, 654499893, 656222382, 657693253, 657865219, 658289871, 659660263, 661802750, 663312531, 660020218, 660255661, 662224503, 662731094, 663265915, 664933929, 666381073, 660874023, 661017685, 662805939, 662843933, 662872391, 661941147, 661391602, 660837708, 659843369, 659019089, 658018494, 657769318, 657067566, 656415253]
1589.3F56415253j587982j542511j322098j299820j080170k289429j263733j392669
1597F44636841j311341j937561k005386j200943j423263j752091l008499j957741k255630
1605.7F27784386j941452k227784j962776j870270l320961j667137l086280k681046
1613.4F09026680k734566m28161M96254j1072655j309090j441917j811753k742233
1621.1E87982559j254425j543960p564240j255875j523857r52072m153251m060402
1628.9E65674477j657906k566261j669960k776070L6850Q76885m391747n264854o49224
1637.5E47612190p82089j133957r0523j838340m3564r79843Q20770K378425j650543
1646.2E44292526n14946k651596J251183O78444J893463L668747n44892n516014l53241
$$ y = [656415253, 654827271, 653284760, 651962662, 650662842, 649582672, 647293243, 646029510, 644636841, 643325500, 641387939, 639382553, 638181610, 636758347, 635006256, 631997757, 630040016, 627784386, 625842934, 623615150, 621652374, 619782104, 616461143, 614794006, 611707726, 609026680, 606292114, 605863953, 606360207, 595287552, 593978462, 592536545, 590724792, 587982559, 586728134, 585184174, 577619934, 576364059, 574840202, 573888130, 569734879, 565674477, 564016571, 561450310, 559780350, 557004280, 557041130, 557918015, 553526268, 548261414, 547612190, 546830101, 545696144, 545605621, 543767281, 543723717, 542743874, 543564644, 545943069, 544292526, 543777580, 541125984, 542377167, 543055611, 544949074, 548617821, 548072929, 542556915, 542203674]
1654.9E42203674L078919J640014J530190R64775J184120J944542K391243L044510
1662.6E57981987o39610K178878K607079K202721K678070L409958J288757Q5640L803406
1671.3E75596886J034431K296181L671036J847152m65698K395935L366547K404365
1679E92146835K670861O08787K928238M980393J431732k820206J674309M576072L325158
1687.7F11522179J775322K216148J334915J981621K386742K493019L838386L668785
1695.4F31217117l543091K699357M567489N268326L130112q124504M102783L309212
1703.1F42626801J359329n98526Q68377k66494p90634J302490L06473n01557K29645
1711.8F44535904J215515J964798K68631k2354K806854L049698n393829L46069K260895
$$ y = [542203674, 545282593, 546922607, 548452797, 549417572, 550601692, 552546234, 554937477, 557981987, 557342377, 559521255, 562128334, 564331055, 567009125, 570419083, 571707840, 571793480, 575596886, 576631317, 578927498, 582598534, 584445686, 583979988, 586375923, 589742470, 592146835, 594817696, 595426483, 598354721, 603335114, 604766846, 601946640, 603620949, 608197021, 611522179, 613297501, 615513649, 616848564, 618830185, 621216927, 623709946, 627548332, 631217117, 627674026, 630373383, 634940872, 640209198, 643339310, 635214806, 639317589, 642626801, 643986130, 643387604, 644255981, 643989487, 643198853, 644501343, 644807816, 644306259, 644535904, 645751419, 647716217, 647984848, 647962494, 650769348, 653819046, 648425217, 648771286, 651032181]
1720.5F51032181J201019R15375m42887r66873r8724j95007j238709j455612j46332
1729.1F48604431k539215l713226j32065P41272l296089j2052155j075210n76439k834854
1737.8F23126450j701737l583679p288055j280175j70479l309021r08775R85680J803169
1746.5F07673378K187233L434486N104180N774612Q348427N188866P995529P796402
1754.2F53503113P044678P974624N684204O511994N581741N454254N823059L140335
1761.9G00718002K689667L943787L424530K152481K531585K502671q07114J794205
1769.7G18949814M026718J909027j655960j586304L005905K213364r88235J399994
1777.4G27274323J458129J611786J239014j261368N51300J201935J167755k61307p53708
$$ y = [651032181, 652233200, 653148575, 652705688, 651738815, 651640091, 651445084, 650206375, 648750763, 648604431, 646065216, 642351990, 642219925, 642961197, 639665108, 627612953, 626537743, 625961304, 623126450, 621424713, 617841034, 610552979, 609272804, 609102325, 605793304, 604884529, 605870209, 607673378, 609860611, 613295097, 618399277, 624173889, 632522316, 637711182, 645706711, 653503113, 660547791, 668522415, 674206619, 680718613, 686300354, 691754608, 697577667, 700718002, 703407669, 707351456, 710775986, 712928467, 715460052, 717962723, 717155609, 718949814, 722976532, 724885559, 723229599, 721643295, 724649200, 726862564, 725874329, 727274323, 728732452, 730344238, 731583252, 730321884, 730873184, 732075119, 733242874, 732981567, 732227859]
1786G32227859J325837O91986O49643J559601Q77609J286697k182541k016296K565536
1794.7G36985931J220093r89837K80532J709137M25949q14209J704941j17492o01578
1803.4G39803467O05850m20914L52555O08520k36435R66416J629409j191406n65491
1812.1G41551971P39060K5711L56064p9117L61710q6365J60904Q47778n9586O36521
1821.7G44454651J60370P54318J271515k513809q98285J671905J835556Q42209k539139
1830.4G45039291N0965J606827K6779m44870n99594K18658L97263m59671M79202J61056
1840.1G46475906L95661K33764J356202J340942m673843K86407J591110M11911j40228
1848.7G47277832k69165N14908J36871K87094j10702j3809p5150j33362L77045l71857
$$ y = [732227859, 733553696, 734245682, 734895325, 736454926, 737332535, 738619232, 736436691, 734420395, 736985931, 738206024, 737216187, 737496719, 739205856, 739631805, 738817596, 740522537, 740405045, 739803467, 740409317, 739988403, 740340958, 740949478, 740713043, 741679459, 743308868, 742117462, 741551971, 742291031, 742316742, 742672806, 742593689, 742955399, 742869034, 743029938, 743877716, 743818130, 744454651, 744615021, 745369339, 746640854, 744127045, 743228760, 744900665, 746736221, 747578430, 745039291, 745090256, 746697083, 746723862, 746278992, 745679398, 745898056, 746295319, 745835648, 746314850, 746475906, 746871567, 747105331, 748461533, 749802475, 745128632, 745415039, 747006149, 747418060, 747277832, 747008667, 747523575, 747660446, 747947540, 747836838, 747823029, 747747879, 747614517, 747991562, 747619705]
1858.4G47619705m6539K46658L74298m03976m65775K29569M63333Q04367m50516P21131
1868G49092255k12860k141419O69479Q73871L73001m68444j77308L20893J7318p5531
1877.7G48271255j84936k2430M3945M76913p1869m9667R92k91596J66855o3476J330795
1888.3G49606781Q51517k418900m90570Q76312J34049N48096N3634j019974L11966
1896.9G48452911n1651l26156N09796K06070J08871J13755o028l89099k63366o0883
1906.6G48294220J7090P8964Q1177j66092m25568N64041J58616R4604o2256n8288J448440
1917.2G50024948j506500j688461Q19931M49371Q94852m95377j294327N49851O03027
1925.9G48357315k48413m3945j77918l84750j05896o1188Q8654m58145n0965L80325
$$ y = [747619705, 747573166, 747819824, 748194122, 747790146, 747324371, 747553940, 748017273, 748821640, 748371124, 749092255, 748879395, 746737976, 747407455, 748281326, 748654327, 748185883, 748008575, 748329468, 748346786, 748271255, 748086319, 748063889, 748107834, 748584747, 748512878, 748463211, 748464203, 748172607, 748339462, 748275986, 749606781, 750458298, 748039398, 747548828, 748425140, 748559189, 749107285, 749160919, 748140945, 748452911, 748401260, 748075104, 748584900, 748790970, 748899841, 749013596, 749007568, 748618469, 748355103, 748294220, 748311310, 748390274, 748471451, 748305359, 747879791, 748443832, 748602448, 748697052, 748634796, 748576508, 750024948, 748518448, 746829987, 747649918, 748099289, 748994141, 748498764, 747204437, 747754288, 748357315, 748108902, 748064957, 747887039, 747502289, 747396393, 747335205, 747423859, 746965714, 746914749, 747295074]
1935.5G47295074N3635j87988k40021K12402j57547J012955N43823k224655O2180Q64563
1945.2G47234421l2730Q5983J65100n34286p09839M5089J46332J45951K79541J39694
1954.8G46965256l49274o8436Q1940l56369K14081K13089k71607j54190P8888n7983
1964.5G46295395j28708K55280n8289j77155J31760k02866j88598J61362k2965o0043
1974.1G46005173m4022k4872O7139m43039m20074P5759J75934n722j52740o1417K38419
1984.7G45410538M87899r5672j08948j06964n63507K53143M07944n91660n62515Q9798
1994.3G44620056O7673j22757l8605P6981J61514k18048k58713j52588r2544O6452
2004G44109421r7428p8277j77307l68805l25165j79825L128J84860J41221o2027j53733
$$ y = [747295074, 747348709, 747160721, 746920700, 747133102, 746975555, 747988510, 748532333, 746307678, 746369858, 747234421, 747201691, 747287674, 747452774, 746918488, 746208649, 746253738, 746400070, 746546021, 746825562, 746965256, 746615982, 746547546, 746629486, 746273117, 746487198, 746700287, 746428680, 746274490, 746353378, 746295395, 746166687, 746421967, 746363678, 746186523, 746318283, 746115417, 745926819, 746088181, 746065216, 746005173, 745961151, 745936279, 746003418, 745560379, 745140305, 745216064, 745391998, 745386276, 745233536, 745172119, 745410538, 745898437, 745802765, 745693817, 745586853, 745023346, 745276489, 745684433, 745092773, 744530258, 744620056, 744687729, 744564972, 744526367, 744603348, 744764862, 744546814, 744288101, 744135513, 744042969, 744109421, 744011993, 743933716, 743756409, 743387604, 743062439, 742882614, 742885742, 743070602, 743211823, 743149796, 742996063]
2014.6G42996063j69678k79998m34189k3117m2343j3581J8616l01590m043l36991j97830
2025.2G41211319j5488l59115j18714k28576p7286k38190l11584k3499N188q3923k91214
2035.8G39468918M0283j38016m83017k52533K12555M1123j6175L54386l09067j91956
2045.5G38726501j29699j37024J37253l86963k99759K35290P40967j65481o29273r3613
2055.1G37998199k47726J5183k47117j37252l3265j31530L37143J74179J77307P629
2064.7G37912750m35409l88413q9950j5717J8005J90812L47366K46887l50189l53699
2074.4G37082443j59836J01471Q7357j94092P9956K61688K86866j88599q5602M9820
2084G37321472o3705J45187j64413j28250l93525k11715J34735J04828L23715j78833
$$ y = [742996063, 742826385, 742546387, 742112198, 742089081, 742046738, 742033157, 742051773, 741750183, 741746140, 741409149, 741211319, 741195831, 740836716, 740718002, 740489426, 740412140, 740173950, 739862366, 739838867, 739844055, 739760132, 739468918, 739509201, 739371185, 738888168, 738635635, 738848190, 738889313, 738873138, 739227524, 738918457, 738726501, 738596802, 738459778, 738597031, 738210068, 737910309, 738145599, 738886566, 738721085, 738091812, 737998199, 737750473, 737765656, 737518539, 737381287, 737348022, 737216492, 737553635, 737727814, 737905121, 737912750, 737477341, 737088928, 736998978, 736983261, 737001266, 737192078, 737539444, 737786331, 737436142, 737082443, 736922607, 737024078, 737111435, 736917343, 736997299, 737258987, 737545853, 737357254, 737271652, 737321472, 737257767, 737402954, 737238541, 737110291, 736716766, 736505051, 736639786, 736744614, 737068329, 736889496]
2093.7G36889496q1787J70517K2888j8387q8425j57394L9215J92566j7548L21808j74789
2104.3G37098160l15247R9259k95945m0283P4387k4033r9563J49459J66550p0877Q0566
2114.9G36822433j08261O180k34756k68860p0114O5536L42713J41067K0294j82876
2124.5G36533356J47705k17438n39551N3177J26801L80478M5013K4796J144k85873
2134.2G36269608P7209m5242j90354j64413J13449k6703l17383k87094j45950K32696
2143.8G35515823J35422p0801l36380J4267K61154q3313J44959J86768K4490Q6746
2153.5G35879135J53732k32315k18811J78757L00598J64795j82495l5629j21308J47858
2163.1G36034317J72730l04108O6299K32468J907k36282J77307K40402r079J34735
$$ y = [736889496, 736807709, 736978226, 737001114, 736982727, 736894302, 736736908, 736776123, 736968689, 736951141, 737272949, 737098160, 736782913, 736882172, 736586227, 736545944, 736620331, 736596298, 736496735, 736646194, 736812744, 736741867, 736822433, 736714172, 736720352, 736485596, 736216736, 736146622, 736212158, 736554871, 736695938, 736716232, 736533356, 736681061, 736463623, 735924072, 735977249, 736104050, 736484528, 736529541, 736554337, 736555481, 736269608, 736346817, 736301575, 736111221, 735946808, 736060257, 736033554, 735716171, 735429077, 735283127, 735515823, 735651245, 735580444, 735244064, 735258331, 735519485, 735436172, 735581131, 735767899, 735792389, 735879135, 736032867, 735800552, 735581741, 735760498, 736061096, 736225891, 736043396, 736007767, 735886459, 736034317, 736207047, 735902939, 735969238, 736201706, 736203613, 735967331, 736144638, 736385040, 736375961, 736510696]
2172.8G36510696m8599O9351L1662l2348P4157L91846K75574J9607J96762j98822k28652
2183.4G37061234l52021n0659K25830L0365K82364K6321K70386K17972l433j27411
2193G37580948m57382j59989O6986N82734L62396k83814m49676j4496O40869M58069
2202.6G38326645J2588m69513r15K53982p9040J6327K14081L50265j88904j94168r689
2213.3G38231659k3727n4017r3078P400R3842N53512J32599o6909N2490J5869j9760
2223.9G38829880m15726p4615r1782K89993N21088L4103Q7204r3918l83911n83725
2233.5G38118591j36184k22931j80893L34701L16239N07888o2103m19235l68958n7830
2243.2G37829285R4452j92566K02179J46865o5231m4937K81219L10059L5400j983m75846
$$ y = [736510696, 736462097, 736531448, 736563110, 736530762, 736604919, 736996765, 737272339, 737291946, 737488708, 737289886, 737061234, 736709213, 736658554, 736884384, 736914749, 737197113, 737223434, 737493820, 737711792, 737708359, 737580948, 737123566, 736963577, 737030563, 737613297, 737975693, 737691879, 737242203, 737227707, 737868576, 738326645, 738339233, 737869720, 737868805, 738122787, 738043747, 738060074, 738274155, 738624420, 738435516, 738241348, 738231659, 738207932, 738153915, 738060837, 738068237, 738162079, 738715591, 738848190, 738781281, 738833771, 738849640, 738829880, 738414154, 738339539, 738247757, 738537750, 739058838, 739092941, 739180145, 739086227, 738702316, 738118591, 737982407, 737759476, 737578583, 737913284, 738229523, 738737411, 738675308, 738256073, 737887115, 737829285, 737923737, 737731171, 737933350, 738080215, 738014984, 737970047, 738251266, 738561325, 738596725, 738594742, 738118896]
2253.8G38118896m90875K06681N52902j76087k10113j75171j89972M29535j89362k77557
2263.4G37598877k67639m5319L01743n3711L33252K68097Q0185l90625l49045O9580
2273G37545395k08130k5482Q7356R6589J69754M89807k11182o21033l0746q3237m4784
2283.7G37164307m8523M36096j11160k08664K57492m59671Q774M2953J24893k9983
2293.3G37176514l92533j32751l80936j79062j38931L27454k29j29090J12687n94254
2302.9G35668869j60294M7608j28250o30951k67487k14538m99497P06558L34321l2731
2312.6G34823608o72226o35757L33710o7520m92173q74862r3460l6469p1564O5003
2322.2G32278290j19400j55335o94198k52610l73535O30646m21066j442490M75998
$$ y = [738118896, 737628021, 737834702, 738387604, 738211517, 738001404, 737826233, 737636261, 738065796, 737876434, 737598877, 737331238, 737285919, 737587662, 737533951, 737867203, 738135300, 738215485, 737824860, 737475815, 737545395, 737337265, 737311783, 737399139, 737495728, 737665482, 738155289, 737944107, 737323074, 737292328, 737209091, 737164307, 737115784, 737551880, 737440720, 737232056, 737489548, 737029877, 737038651, 737081604, 737206497, 737176514, 736783981, 736651230, 736270294, 736091232, 735952301, 736279755, 736279526, 736150436, 736263123, 735668869, 735508575, 735556183, 735427933, 734796982, 734529495, 734314957, 733815460, 734522018, 734856339, 734823608, 734151382, 733515625, 733849335, 733781815, 733289642, 732414780, 732321320, 732284851, 732213287, 732278290, 732158890, 732003555, 731309357, 731056747, 730683212, 731313858, 730892792, 729450302, 729926300]
2330.9G29926300K90299N10101p43942l55530P89642q59146o55670n6153k82821K2278
2340.6G28585358P26547l60947m08935O5841q82492k33535R17434J491852J177139
2349.2G31078262N48096j382294j876602J87760j9913j663666j524124Q30154K40937
2357.9G26418610q10624p94296j001358M48380J71508J204072L80630j292572n50842
2366.6G24173508R5520P60803O07300N58700J46332P35779O88629Q1787N17807K94342
2376.2G28660507m2496j96685L81622L97186J10550M64554L53470N7831J32980K42844
2385.9G30562363k13013p4387k74810p23267j27716L9291J70975J63040J14136J18408
2395.5G29755020j6632l39050p28607j07117Q8272r2545j41906k9145J68229j65253
$$ y = [729926300, 730216599, 730726700, 729982758, 729627228, 730416870, 729557724, 728902054, 728845901, 728563080, 728585358, 729311905, 728950958, 728542023, 728607864, 727725372, 727491837, 728409271, 729901123, 731078262, 731626358, 730244064, 728367462, 728555222, 728535309, 726871643, 725347519, 726177673, 726418610, 725607986, 724813690, 723812332, 724260712, 724432220, 725636292, 726016922, 724724350, 724173508, 724269028, 725029831, 725637131, 726195831, 726342163, 727077942, 727766571, 727848358, 728366165, 728660507, 728618011, 728421326, 728802948, 729200134, 729310684, 729775238, 730128708, 730186539, 730319519, 730562363, 730349350, 730274963, 730000153, 729276886, 729149170, 729188461, 729359436, 729522476, 729636612, 729755020, 729738388, 729399338, 728670731, 728563614, 728651886, 728559341, 728417435, 728388290, 728556519, 728391266]
2405.2G28391266k04697k86407j83716j45874j11923q927k87704k54135j63880R5215
2414.8G26839218j77460l09295J27334K4033k14920m85535j58691K12478J13068j51367
2424.5G25818863m71878k25754P9041j40152k83966j02768n1041K36130j0834n34210
2434.1G24313431n43747l17536J20926k27356j220R8343l70484r7275n12924k77176
2443.7G22184982L19443K8915k47345k98843l03116l82080p7972K7008k7542k08588
2453.4G21014862k26517k5253k89459m40979k34223K53296M044n42221m01840O2179
2463G19173889L9444l48816J32218K37808j35651l89709k16141L0899l41873l31802
2472.7G17850266l62702J87836K59247l08686q0185l68957m99420l41416Q469Q7662
$$ y = [728391266, 728186569, 727900162, 727716446, 727570572, 727458649, 727449722, 727162018, 726907883, 726744003, 726839218, 726661758, 726352463, 726479797, 726503830, 726288910, 725803375, 725644684, 725857162, 725970230, 725818863, 725346985, 725121231, 725200272, 725060120, 724776154, 724673386, 724622345, 724858475, 724847641, 724313431, 723769684, 723452148, 723573074, 723345718, 723344498, 723442841, 723072357, 722975082, 722462158, 722184982, 722504425, 722533340, 722285995, 721987152, 721684036, 721301956, 721223984, 721250992, 721223450, 721014862, 720788345, 720763092, 720473633, 720032654, 719798431, 720051727, 720055771, 719513550, 719111710, 719173889, 719213333, 718864517, 718996735, 719234543, 719098892, 718709183, 718493042, 718523941, 718182068, 717850266, 717487564, 717675400, 717934647, 717625961, 717545776, 717176819, 716677399, 716335983, 716344452, 716432114]
2482.3G16432114k25983j38245j67999m883l7765l4561o7063j82419j20544k47421
2492G15205231k45209k91061J96762M10919o333k37503m88128m19388j2894L79563
2501.6G14491959J76010k0371j91879n38788m50744k21253j82495l91846K2888K52991
2511.2G12946472q2321j27869k29110k45667k55432q6136O1951l9139l06015j02005
2520.9G11534729L85742l2043l68119l73764k08587J6632Q5754q0490m22058j14975
2530.5G10422821K0828n4855l72772o97251k83813J19476L91846p9804m47769K8382
2540.2G09047089r5139m12445k36130m60586m59977J23826K15988M11453J23596l00140
2549.8G07957535k25296n33753l73001k95410l61404k04010j2894k8076k32392M3259
$$ y = [716432114, 716206131, 716067886, 715899887, 715895004, 715857239, 715822678, 715755615, 715573196, 715452652, 715205231, 714960022, 714668961, 714865723, 715276642, 715270309, 715032806, 714544678, 714125290, 714112396, 714491959, 714667969, 714647598, 714455719, 713916931, 713466187, 713244934, 713062439, 712670593, 712693481, 712946472, 712864151, 712736282, 712507172, 712261505, 712006073, 711919937, 711981888, 711942749, 711636734, 711534729, 711920471, 711888428, 711520309, 711146545, 710937958, 710954590, 711040344, 710959854, 710537796, 710422821, 710443649, 710388794, 710016022, 709318771, 709034958, 709154434, 709546280, 709466476, 709018707, 709047089, 708951950, 708539505, 708303375, 707842789, 707382812, 707506638, 707722626, 708134079, 708257675, 707957535, 707732239, 707198486, 706825485, 706530075, 706168671, 705964661, 705951767, 705923691, 705691299, 705734558]
2559.5G05734558l25775l21808R2621k32239j7319R9793k02637j91421k57035m22134
2569.1G03956604o5536n8213m99801l00217j5411j9455m2420K11258j5030m64401l43628
2579.7G02343750j98364j90811l69187k93045l64761k42768J01700p2479J7090K39258
2589.4G00970383J16882n59463n65720n9586J2665L967k96859j79062j90582N569J18484
2600F99376678n55572n09720k01340L2502j33973k52227J34048J1444o02798n67780
2609.6F96731262O7444l14102m34189k58865l50495j63574k35519J38473R3537k11792
2619.3F95062180l48206n12924m16031l93524j05591l10059j85775R1171k50015k93580
2628.9F92337646l81546m48761o05850k90374j43433m61731l71704j26038K97318j47171
$$ y = [705734558, 705408783, 705086975, 705179596, 704947357, 704930038, 705029831, 704827194, 704635773, 704378738, 703956604, 703891068, 703832855, 703333054, 703032837, 703017426, 702997971, 702955551, 703166809, 703151779, 702687378, 702343750, 702145386, 701954575, 701585388, 701292343, 700927582, 700684814, 700786514, 700714035, 700731125, 700970383, 701087265, 700527802, 699962082, 699902496, 699915161, 699919128, 699622269, 699443207, 699252625, 699258194, 699376678, 698821106, 698311386, 698110046, 698142548, 698008575, 697756348, 697890396, 697901840, 697299042, 696731262, 696798706, 696484604, 696050415, 695791550, 695441055, 695277481, 695041962, 695180435, 695273972, 695062180, 694713974, 694201050, 693785019, 693391495, 693285904, 692975845, 692790070, 692881241, 692631226, 692337646, 691956100, 691507339, 690901489, 690611115, 690467682, 690005951, 689634247, 689508209, 689805527, 689658356]
2638.5F89658356n41230m09774l00370k4185j36795k99454q17947l99551K15606m74090
2648.2F86470566l57361j66321k92053k31323l25394k84729n37186m53033j72043j35651
2657.8F83515472J17875j73264o09589l50952j88064k55738k30941k20108j66550k70157
2667.5F81167984m70276k71301n7755l17306k81296m1199k87475q2321L25317j44196
2677.1F79540176o75582p03431l99551l05634n70068k14081J77155r8267m15344k70386
2686.8F76064987Q1177k91290m90723j94550j31149j29928l89710j62659K12784j43204
2696.4F74425735n39398l16467P0877k45819k67487k71911p91702l93448L32946J04752
2706F72108078l24783j88980k40326m51889m47922k80152k96401m81949j09787j81961
$$ y = [689658356, 689117126, 688707352, 688406982, 688382797, 688246002, 687946548, 687128601, 686729050, 686944656, 686470566, 686113205, 685946884, 685654831, 685423508, 685098114, 684813385, 684276199, 683823166, 683651123, 683515472, 683633347, 683460083, 682850494, 682499542, 682311478, 682055740, 681824799, 681604691, 681438141, 681167984, 680697708, 680426407, 680368652, 680051346, 679770050, 679728851, 679441376, 679359055, 679684372, 679540176, 678864594, 678161163, 677761612, 677455978, 676885910, 676671829, 676848984, 676750717, 676335373, 676064987, 676146164, 675854874, 675364151, 675169601, 675038452, 674908524, 674518814, 674356155, 674568939, 674425735, 673886337, 673569870, 673640747, 673394928, 673127441, 672855530, 672063828, 671670380, 672003326, 672108078, 671783295, 671594315, 671353989, 670902100, 670454178, 670174026, 669877625, 669395676, 669285889, 669103928]
2715.7F69103928k55280K0828k75650m24270o02494l63083K976k71378k84957n8823
2725.3F66591797J38092l15476q99276p08008m70047j17722J5335k87933j75629K9831
2735F63800964K31934J57242m11148n90973m81491j36414j75781m53797L82K11639
2744.6F62152557l6468l36533j53885o2790n97991p28913l52402J24588j88293j67160
2754.3F59652710Q2397l72848k89536m29687l12729j40381l10516j62735l17841q1939
2763.9F57316895k12098k55737J02615n24520o20957j34659k13775k77405P5149K63443
2773.5F55518951j64413p53326n69535r5215m39987n86242k38038k81753n30853l59879
2783.2F51499710j46561l96194l97186q2932k2278k40173j99204l78646q60138o49567
$$ y = [669103928, 668848648, 668869476, 668593826, 668169556, 667567062, 667203979, 667206955, 666935577, 666650620, 666591797, 666729889, 666414413, 665515137, 664807129, 664337082, 664219360, 664234695, 663946762, 663771133, 663800964, 664032898, 664190140, 663778992, 663188019, 662706528, 662570114, 662394333, 661940536, 661940918, 662152557, 662116089, 661779556, 661625671, 661562881, 660964890, 660235977, 659883575, 660008163, 659819870, 659652710, 659735107, 659362259, 659072723, 658643036, 658330307, 658189926, 657879410, 657716675, 657398834, 657316895, 657104797, 656849060, 656951675, 656427155, 655806198, 655671539, 655457764, 655180359, 655255508, 655518951, 655354538, 654601212, 654031677, 653936462, 653496475, 652910233, 652672195, 652390442, 651859589, 651499710, 651353149, 650956955, 650559769, 650476837, 650454559, 650214386, 650015182, 649636536, 648776398, 648126831]
2792.8F48126831k82669j62430m72641p90252n05829l80555o01577o30265m14047m20227
2802.5F43466339l98331k69012m46777p73087o27136k90375m88205n21126o18133p24678
2812.1F38309479o43578j004028r67941o39954p54471q74252p26319j183815j599311
2820.8F29915810o97327r422o10886j321068j161804j272163j540108j323814j484910
2829.5F20494308j552734j397476j287117j501541j523171j672249k280006j698151
2837.2F07581863k107277l671150l425903l124352m324150n129547n351333o103402
2844.9E74344749o197547o411896p820282q538819p916374o916198o425286n224838
2852.6E18893509l231735j747895R8572J732025K766877L631019M167938M479256M197273
$$ y = [648126831, 647844162, 647681732, 647209091, 646418839, 645913010, 645532455, 644930878, 644300613, 643886566, 643466339, 643068008, 642798996, 642352219, 641579132, 640951996, 640661621, 640173416, 639652290, 639034157, 638309479, 637665901, 636661873, 635693932, 635053978, 634299507, 633425255, 632698936, 631515121, 629915810, 629218483, 629209061, 628598175, 627277107, 626115303, 624843140, 623303032, 621979218, 620494308, 618941574, 617544098, 616256981, 614755440, 613232269, 611560020, 609280014, 607581863, 605474586, 601803436, 598377533, 595253181, 590929031, 585799484, 580448151, 574344749, 568147202, 561735306, 553915024, 545376205, 537459831, 530543633, 524118347, 518893509, 515661774, 513913879, 514012451, 515744476, 518511353, 522142372, 526310310, 530789566, 534986839]
2861.3E34986839L557511L722534L610191K554207K017555Q15506o7558J59759J1864
2870E51368408k01874k93388n3253l28140j02425M55704J97220K06031l21388o10313
2879.6E50316582l41454k67029p42683j181564o64978r55887j320877j397133j824341
2888.3E41620636j605988j404991j534538j401634j450234k009353j840592j669998
2896E28703308k090874k074546j988411j941338k156372k363777k448540k503929k842064
2904.7E08293457l390655l386651l292846k976303l394890m371071n037804n241127
2912.4D77202110n023689n946465o412544o129226o113396o435242o941757o247788
2920.1D27952003n378456m297104l549461k480888j497307j523972N7526J296692K262230
$$ y = [534986839, 538544350, 542266884, 545877075, 548431282, 550448837, 551264343, 551196785, 551356544, 551368408, 551166534, 550873146, 550819893, 550491753, 550389328, 550845032, 551042252, 551248283, 550926895, 550316582, 549975128, 549708099, 548965416, 547783852, 547118874, 546162987, 544842110, 543444977, 541620636, 540014648, 538609657, 537075119, 535673485, 534223251, 532213898, 530373306, 528703308, 526612434, 524537888, 522549477, 520608139, 518451767, 516087990, 513639450, 511135521, 508293457, 504902802, 501516151, 498223305, 495247002, 491852112, 487481041, 482443237, 477202110, 472178421, 466231956, 459819412, 453690186, 447576790, 441141548, 434199791, 427952003, 422573547, 418276443, 414726982, 412246094, 410748787, 409224815, 409282341, 410579033, 412841263]
2928.8D12841263L079529L032684L708801M620476M998093M779701N152435N390663
2936.5D47603645N717621O088867N543175N108032N385514N580673M567604M146080
2944.2D89741211M285660L708534K584724J991692K245407J396484Q50487P89681N01289
2952.9E08095169O31905N27496R49249J601296J516647J115685J554184K422599L271714
2961.6E21685944L608741K827912K964554L476982L277816L077202L722306M599189
2969.3E49240646L735276K897338L109017L054008L251725L310737K438622J881103
2977E72918472K029534K234916K015343J715965J995659J920738J514626J026764J023407
2985.7E88395424J676254J402283R92088Q29048Q24433J118622N41763J15013J98708
$$ y = [412841263, 415920792, 418953476, 422662277, 427282753, 432280846, 437060547, 442212982, 447603645, 453321266, 459410133, 464953308, 470061340, 475446854, 481027527, 485595131, 489741211, 494026871, 497735405, 500320129, 502311821, 504557228, 505953712, 506804199, 507593880, 508095169, 508727074, 509254570, 510203819, 511805115, 513321762, 514437447, 515991631, 518414230, 521685944, 525294685, 528122597, 531087151, 534564133, 537841949, 540919151, 544641457, 549240646, 552975922, 555873260, 558982277, 562036285, 565288010, 568598747, 571037369, 572918472, 574948006, 577182922, 579198265, 580914230, 582909889, 584830627, 586345253, 587372017, 588395424, 590071678, 591473961, 592466049, 593295097, 594119530, 595238152, 595779915, 595894928, 596093636]
2994.4E96093636r6016l14370l82232m22974q36906j057625o09436q55065j175460
3003.1E90343552j062279r56726n32417p76940j103973m24996K15226R6130K32124
3011.7E86029701Q88024J098823J333389J025963Q78220J306496Q73413P34863P26356
3020.4E94895248Q14133N51605M6006L65829o0501m28963n4435J15814n3139J11504
3030.1E96303101L38096l19519p23305p77053o21109m63829l29895l35808m80004j40342
3039.7E92450333n38369o87866l26614o07796p67441o54258n01519m80537n18036p41157
3049.4E86626740m41666m29573j057892q49495n79453k99987m44908j044007r30977
3058E80548782n57708o55480r88731p41043l97530k61230o40679o76765l26691o08978
$$ y = [596093636, 595997620, 595683250, 595301018, 594878044, 594041138, 592983513, 592374077, 591519012, 590343552, 589281273, 588324547, 587792130, 587015190, 585911217, 585486221, 585701447, 585797577, 586029701, 586917725, 588016548, 589349937, 590375900, 591254120, 592560616, 593434029, 594168892, 594895248, 595709381, 596260986, 596306992, 596672821, 596612320, 596183357, 596128922, 596244736, 596191597, 596303101, 596641197, 596321678, 595598373, 594821320, 594200211, 593736382, 593406487, 593070679, 592590675, 592450333, 591911964, 591224098, 590897484, 590289688, 589522247, 588867989, 588366470, 587885933, 587367897, 586626740, 586185074, 585755501, 584697609, 583848114, 583268661, 582968674, 582523766, 581479759, 580548782, 579991074, 579335594, 578346863, 577605820, 577208290, 576947060, 576306381, 575629616, 575302925, 574693947]
3067.7E74693947p02362j125908q50563l52440p49168m52691k20298m43344q58689
3076.4E68938484q10165l47481n69954p52678p11555p74002n75714l88031n47524l15170
3086E63146210n47676j232872p73697l42331o45561o99540m64439o95953n69764n14717
3095.6E56659660j085891o77414n86663q35723o54107p42874o43921o50062o70700
3104.3E50112305m48304o97517r62410m86221l59078n30739q21037j131668q54568
3113E43820763o80237j87111o42166j101494l86429q26836j067047q98742o22521n36308
3122.6E36871872j038742o75202p73201j104240p59354p83805r10454q43239j098251
3131.3E28885384p53708l86009q97294o31828n75447o77757p91512j096039r65309
$$ y = [574693947, 573991585, 572865677, 572015114, 571662674, 570913506, 570460815, 570240517, 569797173, 568938484, 568128319, 567780838, 567210884, 566458206, 565746651, 564972649, 564396935, 564008904, 563461380, 563146210, 562598534, 561365662, 560591965, 560249634, 559604073, 558904533, 558440094, 557744141, 557174377, 556659660, 555573769, 554896355, 554309692, 553473969, 552819862, 552076988, 551433067, 550783005, 550112305, 549664001, 548966484, 548004074, 547517853, 547158775, 546628036, 545806999, 544675331, 543820763, 543140526, 542953415, 542311249, 541209755, 540823326, 539996490, 538929443, 538030701, 537408180, 536871872, 535833130, 535157928, 534384727, 533280487, 532521133, 531737328, 530826874, 529983635, 528885384, 528131676, 527745667, 526848373, 526216545, 525641098, 524963341, 524171829, 523075790, 522110481]
3140E22110481j281624p11021l42827q53691q66051o75735o87218j149635q35419r72366
3149.6E13734894j260491o26411o39267p58362q47359r09843r31549r57985r45244
3158.3E05858383q55408o04476p55845p82508p12204j012536j343765r24377m80118
3167D98387146p31659q02841q61626j163063j378670q05626j82800m50821j038780
3175.7D90971260r36775o84395j164017q49800p72552r70040q53958q88862n77507
3184.4D83273354r99375o20842j57203r89228j142120q24814j024551j050721m55970
3193D76008530r14193r97390o97403r51615o18820q50563p78198q18367j082573q70819
3202.7D67428589m87709n46341j132774k55700l26538r76791p16858r45778q40874
$$ y = [522110481, 520828857, 520117836, 519775009, 518921318, 518055267, 517379532, 516692314, 515542679, 514707260, 513734894, 512474403, 511847992, 511208725, 510450363, 509603004, 508693161, 507761612, 506803627, 505858383, 505002975, 504398499, 503642654, 502860146, 502147942, 501135406, 499791641, 498867264, 498387146, 497655487, 496852646, 495991020, 494827957, 493449287, 492643661, 492460861, 492010040, 490971260, 490034485, 489350090, 488186073, 487336273, 486563721, 485593681, 484739723, 483850861, 483273354, 482273979, 481653137, 481495934, 480506706, 479364586, 478539772, 477515221, 476464500, 476008530, 475094337, 474096947, 473399544, 472447929, 471829109, 470978546, 470200348, 469381981, 468299408, 467428589, 466940880, 466394539, 465261765, 465006065, 464679527, 463702736, 462985878, 462040100, 461199226]
3211.4D61199226p29980n40733j064339j113320j09367k14805q46634j020737q66623
3220D54692688j011505q40645p54890k88811j5907j041108j097030p23114m87519n97038
3229.7D47835121r18770q84018q05359m83932n90515o22978r72252r37958l76358o29578
3239.3D40613403p07969o17066p20749r57565n59807k93464o24390o22597p37343r79576
3249D33792877r09385k42615m25225p13310q82988j037445j69372p60079j509437j074486
3258.6D26068535n38559m30718n91430j76773n69496j086693p61528j47019k53792
3267.3D21512527o37893m59023p87124r21593l43323r4757j078186r48105j98517n27572
3276.9D15516434m04778q30765n51796j44119m96635o74744r65576k01302l12118p57790
$$ y = [461199226, 460469246, 459928513, 458864174, 457750854, 457641487, 457426682, 456580048, 455559311, 454692688, 453681183, 452840538, 452085648, 451796837, 451780930, 450739822, 449642792, 448919678, 448432159, 447835121, 446916351, 446032333, 445226974, 444743042, 444152527, 443529549, 442557297, 441619339, 441242981, 440613403, 439905434, 439288368, 438567619, 437610054, 437050247, 436756783, 436132393, 435509796, 434772453, 433792877, 432883492, 432640877, 432215652, 431502342, 430619354, 429581909, 429412537, 428652458, 427143021, 426068535, 425529976, 425099258, 424507828, 424331055, 423761559, 422674866, 421913338, 421766319, 421512527, 420874634, 420415611, 419628487, 418706894, 418363571, 418268814, 417190628, 416242523, 416044006, 415516434, 415111656, 414280891, 413729095, 413584976, 413088341, 412413597, 411448021, 411246719, 410934601, 410176811]
3286.6D10176811k01759n8251m85153n79719k19078q15926p65610m32281q33550k67677
3296.2D05517807L81q78562j034928l46565J4687L5247o48765p24373k42119l49388
3305.9D01343422l53851p27120r76715q70781l94211j16882l26729r35097j186561
3314.6C95455475k57836o40869m78820J54724o03371o87141o29464n86433m73671K03362
3324.2C91455956k06299j349144q72536p26471n62439k50473l73611q52700o85730
3332.9C85576553j95884n68352l98369n20401p70721j071663j296273p90214k75955
3341.6C79688721J98364l12119r53903r58404n82962q08792r21441k54135n38215p51458
3351.2C73805656r27009o34957m07562q54759p26814q43201n86929n08003o58379p02591
$$ y = [410176811, 409975052, 409916801, 409431648, 408851929, 408632851, 407816925, 407051315, 406619034, 405785484, 405517807, 405518188, 404639626, 403604698, 403258133, 403272820, 403308067, 402659302, 401934929, 401692810, 401343422, 400989571, 400262451, 399285736, 398414955, 398020744, 397903862, 397577133, 396642036, 395455475, 395197639, 394556770, 394077950, 394232674, 393629303, 392942162, 392312698, 391726265, 391252594, 391455956, 391249657, 389900513, 389027977, 388301506, 387739067, 387488594, 387114983, 386262283, 385576553, 385380669, 384812317, 384413948, 383893547, 383122826, 382051163, 380754890, 379964676, 379688721, 379887085, 379574966, 378621063, 377662659, 377079697, 376270905, 375349464, 375095329, 374557114, 373805656, 372878647, 372243690, 371836128, 370981369, 370254555, 369411354, 368824425, 368316422, 367658043, 366955452]
3360.8C66955452j191750j297950n97077N1308l92380o90842o25991l07122o24580
3369.5C61279068j093330n37568p97996q63724p45010o95305k58026m33006j189385
3378.2C54665718j235351o3324k2965m64897q00324q29277k25944j96839k59971p21474
3387.8C49845352n78346o53992n98869M92554J5068r36852p83043k01454k71416m92096
3397.5C45836906j76963K5138k53829p68166m48608k14653l54958n81169j74904L471
3407.1C42892265n25131r9945j7242k10457j92909K79045j05553j244354p66449o1989
3416.8C39947281J92909j40610J6556p858m26750j57547m2649O66199L17078o1608
3426.4C40303001k76146m94041K67944L39165L81508q01n5428J88523N83763M54063
$$ y = [366955452, 365763702, 364465752, 363868675, 363919983, 363527603, 362836761, 362210770, 361903648, 361279068, 360185738, 359648170, 358850174, 357986450, 357241440, 356546135, 356288109, 355855103, 354665718, 353430367, 353367043, 353344078, 352879181, 352078857, 351249580, 351023636, 350826797, 350566826, 349845352, 349267006, 348613014, 348014145, 348506699, 348521767, 347584915, 346801872, 346600418, 346329002, 345836906, 345659943, 345685081, 345431252, 344663086, 344214478, 343999825, 343644867, 343063698, 342888794, 342892265, 342367134, 342267189, 342249947, 342039490, 341846581, 342125626, 342020073, 340775719, 340009270, 339947281, 340140190, 339999580, 340016136, 340008278, 339581528, 339423981, 339381332, 340047531, 340364609, 340303001, 340026855, 339532814, 339800758, 340139923, 340521431, 340520630, 340465202, 340653725, 341237488, 341691551]
3436.1C41691551l27987k04354m18205L68004P73086M74320k26898n25780R63859J386643
3445.7C43954239J259384n45807m50859M63257k49558M01612K94990R05419O21147
3454.4C46653824N26504R83239j12496M87137N42374P47604Q33855M10499J47019k03934
3464C51015625N89180O64864P80716N68618Q15811R50776M53033O79474N09796Q71086
3473.7C57898979M36135M02297P42989O43196J057396N49469M58145J019631J084747
3482.3C64292984J0490N82543J343307O87447Q17871J6365L69377J300965J014480
3491C70435829N64118N14717Q49495M21447M76303M14391J161575J497269O09207J015930
3500.7C77960281J252976J028519K32582l29552M22439J078415J204949J624832O87180
$$ y = [341691551, 341363564, 341159210, 340741005, 341109009, 341882095, 342356415, 342129517, 341603737, 342567596, 343954239, 345213623, 344667816, 344216957, 344680214, 344430656, 344832268, 345127258, 346032677, 346653824, 347180328, 348163567, 348051071, 348538208, 349080582, 349828186, 350662041, 351072540, 351219559, 351015625, 351604805, 352269669, 353050385, 353619003, 354434814, 355385590, 355838623, 356518097, 357027893, 357898979, 358335114, 358737411, 359480400, 360123596, 361180992, 361730461, 362188606, 363208237, 364292984, 364303474, 364886017, 366229324, 366916771, 367734642, 367751007, 368120384, 369421349, 370435829, 370999947, 371514664, 372364159, 372785606, 373261909, 373676300, 374837875, 376335144, 376944351, 377960281, 379213257, 380241776, 380474358, 380144806, 380567245, 381645660, 382850609, 384475441, 385162621]
3509.4C85162621j97030J513062J229515Q61893P56263Q11425J640892R99679Q72040
3518C93650360P70226J039886R72824R96285Q87222j59836J052666J519966J607742
3526.7D02337341Q55637L77006O45676R09195J537170P19605J218033J030655J747703
3535.4D11378021J784706Q5945J236573R14764J338425J080475J093673J871491J768684
3544.1D22552757J501923n53932J098518R17664J355247J822548J355629K465210m32625
3552.7D32082939J175881J501464P76368J798706N88836K018395J807937J371384N09529
3561.4D43631439J566200K078515R34944M280777J413345N19714P72896j346016K751122
3570.1D56602936J886787J792336J700134J232872J072273J550789K272759P65457
$$ y = [385162621, 384965591, 386478653, 387708168, 388570061, 389326324, 390137749, 391778641, 392778320, 393650360, 394420586, 395460472, 396433296, 397429581, 398316803, 398156967, 399209633, 400729599, 402337341, 403192978, 403569984, 404215660, 405124855, 406662025, 407381630, 408599663, 409630318, 411378021, 413162727, 413248672, 414485245, 415400009, 416738434, 417818909, 418912582, 420784073, 422552757, 424054680, 423500748, 424599266, 425516930, 426872177, 428694725, 430050354, 432515564, 432082939, 433258820, 434760284, 435536652, 437335358, 437924194, 439942589, 441750526, 443121910, 443631439, 445197639, 447276154, 448211098, 452491875, 453905220, 454424934, 455197830, 453851814, 456602936, 458489723, 460282059, 461982193, 463215065, 464287338, 465838127, 468110886, 468876343]
3577.8D68876343K565269K009011J077003J847343J434327J676826J445427M307213
3585.5D85238762K577057j198731J556549m65774K211990L323059L415871J701813
3593.2D98360596P52601L774300J0796J353836K717475M62266L256225J890106Q19931
3601.9E13398132J980133J259270J616516L093758K786980l52326L784027l33443j090698
3610.6E26142349Q477326K435112k535019L788490j679039K884941M566651M98046
3618.3E44578857K283059o95572N44357K374344J778793K103462K893601K378387J482048
3627E59721336O494179K287483j0642128K112160M145470N925941R91554l285865K070198
3635.7E69820328K788543J705475M02260J728401K680397K632866J200028m07219J321373
$$ y = [468876343, 471441612, 473450623, 474527626, 476374969, 477809296, 479486122, 480931549, 485238762, 487815819, 486617088, 488173637, 487707863, 489919853, 493242912, 496658783, 498360596, 499113197, 502887497, 502898293, 504252129, 506969604, 507431870, 510688095, 512578201, 513398132, 515378265, 516637535, 518254051, 521347809, 524134789, 523782463, 527566490, 527233047, 526142349, 534619675, 537054787, 534519768, 538308258, 536629219, 539514160, 544080811, 544578857, 546861916, 546166344, 546710701, 549085045, 550863838, 552967300, 555860901, 558239288, 559721336, 566215515, 568502998, 557860870, 559973030, 564118500, 570044441, 571035995, 567750130, 569820328, 572608871, 574314346, 574716606, 576445007, 579125404, 581758270, 582958298, 582551079, 583872452]
3644.4E83872452L285141O047096r22432l556518N979881J158256l461265l377266
3652.1E89025345L953819L606796L704071N866280q152657J35117N168152J131210
3659.8F04438133R30863q9531J621933J231041J134147J189614K66380L559494K279968
3668.5F16562042K78282k02369p366486J752281P806435R453850J381225j9371261
3676.2F10293999J290970Q161850M984817l235207j145858K665748J721764J365433
3683.9F26103516j10970p1907M905167P952346q395652n829163Q320503m426727j491775
3692.6F26955338M032745m41971J610451N81207o45866R96742O90842K977867L441772
3701.3F40199127m374122l529053L582229J024514m38462J24283K030983M574852n197372
$$ y = [583872452, 587157593, 593204689, 592282257, 588725739, 594705620, 595863876, 592402611, 589025345, 592979164, 596585960, 600290031, 606156311, 598003654, 598138771, 603306923, 604438133, 605368996, 605279465, 606901398, 608132439, 609266586, 610456200, 610722580, 614282074, 616562042, 616840324, 616637955, 609271469, 611023750, 618830185, 628284035, 629665260, 610293999, 611584969, 619746819, 624731636, 621496429, 620350571, 623016319, 624738083, 626103516, 625992546, 625920639, 630825806, 638778152, 630382500, 624553337, 632873840, 628447113, 626955338, 630988083, 630546112, 632156563, 632737770, 632091904, 633088646, 633779488, 636757355, 640199127, 635825005, 632295952, 635878181, 636902695, 636464233, 636588516, 638619499, 643194351, 637996979]
3709.9F37996979L760452N147324j2885781L211785L585205n01557j30386J675568
3717.7F41859589J666870l608208N25703O133118k564926m839439M142799N18646o36673
3726.3F43197479k994842m79660M150695O37970N242463j376267q001022R993057M002762
3735F54372635j1015701j454468J495743k99225K750625M019928m022445J286926J1677856
3743.7F58811874n612793j8679237P468605N514069P154007l704071j0696869J3662338
3751.4F53917923l178406r572067M303894L927078L721009n891877J239014O056213
3759.1F54522781p165451k445678L510437Q49838M3487L950119j151504m714890K219849
3767.8F49618988M540176J025467q443222Q62732K698746p5455P93076k21939R93652
$$ y = [637996979, 641757431, 646904755, 634018974, 637230759, 640815964, 640314407, 640184021, 641859589, 643526459, 639918251, 640443954, 646577072, 644012146, 639172707, 643315506, 643834152, 643197479, 640202637, 639722977, 643873672, 644511642, 649754105, 648377838, 640376816, 650369873, 654372635, 643356934, 641902466, 643398209, 643098984, 645849609, 649869537, 645847092, 647134018, 658811874, 653199081, 634519844, 641988449, 647502518, 654656525, 650952454, 640255585, 653917923, 650739517, 641167450, 645471344, 649398422, 653119431, 647227554, 648466568, 654522781, 647357330, 644911652, 648422089, 649271927, 649315414, 653265533, 652114029, 647399139, 649618988, 654159164, 655184631, 646741409, 647604141, 650302887, 650227432, 651020508, 650798569, 651792221]
3776.5F51792221L56369K787552J058578q023986J220626K372056J071395K680741
3784.2F55315552k154160j784286N68847N95627P63931o20040r7657L76129J28556
3792.9F53092499l48206J314087L867493k796936n085144J736755M402237N993805
3800.6F62176590n272827r561310K414093J191559M262390O587296p219239n254669
3808.3F49323883L214722J437149O8054K51846k52609J260071O607513N37415j4207001
3817F48241043K925720N505219N315780K075425j7375336K34604N290680K241974K830352
3825.7F57285461P31049m044647r13162J183166M207459K977905r301682J569443P558212
3834.3F61253204n127563j116104P785110r254837m667206R282685m601212r80224
$$ y = [651792221, 652148590, 654936142, 655994720, 647970734, 649191360, 651563416, 652634811, 655315552, 653161392, 651377106, 651945953, 652541580, 653305511, 652685471, 652587814, 652963943, 653092499, 652744293, 654058380, 657925873, 655128937, 650043793, 651780548, 656182785, 662176590, 656903763, 647342453, 649756546, 650948105, 655210495, 661797791, 654578552, 649323883, 652538605, 653975754, 654043808, 654295654, 654043045, 655303116, 661910629, 662448044, 648241043, 651166763, 656671982, 661987762, 664063187, 646687851, 646922455, 652213135, 654455109, 657285461, 658016510, 653971863, 653058701, 654241867, 658449326, 661427231, 652125549, 653694992, 661253204, 656125641, 655009537, 662794647, 653539810, 648872604, 658155289, 653554077, 652573853]
3842.1F52573853O802215j942367m288025J559372J312866M1351J416397j549454J314545
3850.7F57240753O333313k654953N514298j6480103m000626J0371781l01743k165222
3858.4F53857498J836929K282868K658920n920105N76630Q401031o333999p386170
3866.2F49973602K983933M841308P852936n498123j0645828K373123O073227N733261
3873.9F63687439r115143j734238K877045n26352K048340N212250l312988p970658
3881.6F51165695M919815P73773J858826O517639j3796997n99899M166794P21893M495316
3890.3F60222855J377105p439956k16675L018951k114105Q62808J457215K576065K401886
3898.9F62146149j1240921M793090L191453n821229N599900l358917k106705J359634
$$ y = [652573853, 659376068, 657433701, 653145676, 654705048, 656017914, 656059265, 657475662, 655926208, 657240753, 663574066, 660919113, 666433411, 649953308, 645952682, 656324463, 656022720, 653857498, 655694427, 657977295, 660636215, 654716110, 655292740, 663693771, 657359772, 649973602, 652957535, 657798843, 665651779, 660153656, 649507828, 651880951, 657954178, 663687439, 654572296, 652838058, 655715103, 655188751, 657237091, 662449341, 659136353, 651165695, 656085510, 656859283, 658718109, 665235748, 651438751, 650838852, 655005646, 655727539, 660222855, 661599960, 654160004, 653943329, 656962280, 654848175, 655710983, 657168198, 659744263, 662146149, 650905228, 655698318, 658889771, 653068542, 658668442, 655309525, 653202820, 654562454]
3906.7F54562454J19477J871185l02048j18637n0278N1575L6087p19070J036911L067245
3916.3F59554901k598724m295578M562454K07825m677735J826783J793975J040573
3924F57414474j982650k788315J144714J404877J660767q43964o68793K453003j339187
3932.7F56454926j463242J239777k59324n2642L36303j014022r62525j19934K434616
3941.4F56593933K154083l916320j422959J136246J048660J460800k199325P8430O57196
3950.1F55590744k025757J349182R91211j93710o24313m56696L96500n47181O35529
3958.7F55115509M6005j98745J1596j481933N68008R55963o45828k73819Q60519Q52356
3968.4F55809631n08194p34253M6540J20468l09754l1585N86395K61078p09610l59268
$$ y = [654562454, 654681931, 656553116, 656251068, 656132431, 656082153, 656133728, 656169815, 655450745, 656487656, 659554901, 656956177, 652660599, 657223053, 657430878, 652753143, 654579926, 656373901, 657414474, 655431824, 652643509, 653788223, 655193100, 656853867, 656009903, 655341110, 657794113, 656454926, 654991684, 656231461, 655972137, 655919495, 656255798, 655241776, 654279251, 654159317, 656593933, 658748016, 654831696, 653408737, 654544983, 655593643, 657054443, 654855118, 654933548, 655590744, 653564987, 654914169, 655905380, 655711670, 655087357, 654630661, 655027161, 654479980, 655115509, 655161514, 654962769, 654974365, 653492432, 654060440, 655016403, 654370575, 654096756, 654957275, 655809631, 655301437, 654567184, 654613724, 654734192, 654424438, 654392853, 654979248, 655240326, 654530716, 654171448]
3978F54171448O41021P2175l31192L81l13492J91651N79071n85785k38190L19366m17327
3988.6F54089127q774n1041r9029M54940N62210J55335r93576j01090J122208j00021
3998.3F55030289q60367j44425
4000.2F54025497
$$ y = [654171448, 654812469, 654884644, 654553452, 654553833, 654240341, 654431992, 655011063, 654425278, 654187088, 654506454, 654089127, 654080353, 654029312, 653930283, 654385223, 654947433, 655102768, 654109192, 654008102, 655130310, 655030289, 654169922, 654025497]
##END=$$ End of the data block
