##TITLE=$$ Begin of the data block
##JCAMP-DX=5.00 $$ ACD/SpecManager v 10.08
##SPECTROMETER/DATA SYSTEM=Varian
##DATE=04 Dec 2012 13:51:38
##DATA TYPE=INFRARED SPECTRUM
##DATA CLASS=XYDATA
##ORIGIN=
##OWNER=
##NPOINTS=3735
##FIRSTX=399.26403809
##LASTX=4000.35498047
##MAXX=4000.35498047
##MINX=399.26403809
##MAXY=75.16746521
##MINY=34.07671738
##XFACTOR=1.0000000000
##YFACTOR=0.000000100000000
##FIRSTY=64.95675659
##DELTAX=0.96440572
##XUNITS=1/CM
##YUNITS=TRANSMITTANCE
##XYDATA=(X++(Y..Y))
399.3F49567566q799973q434333l511658j710282j607170q520851o287498R224090
$$ 649567566 640767593 632333260 628821602 627111320 625504150 616983299 610695801 619919891
407F19919891M860764m751282L69301N387726M747543L96767o32820l389817k456283
$$ 619919891 624780655 620029373 620398674 625786400 630533943 630930710 630297890 626908073 624451790
415.7F24451790M089393N077210k35596o851539m168778l334846l263436q86039j59913
$$ 624451790 628541183 633618393 633382797 626531258 622362480 619027634 615764198 614878159 614718246
424.3F14718246J483231O331863J969491n445099k247124J769028K611312N777474
$$ 614718246 616201477 622533340 624502831 619057732 616810608 618579636 621190948 626968422
432.1F26968422j937141r073105k218514J020012j14K715683K161674P80449k55852
$$ 626968422 625031281 615958176 613739662 614759674 614759560 617475243 619636917 620417366 620161514
440.7F20161514j672821m433975k781639M074974K730064L84598L237419K210198j114655
$$ 620161514 618488693 614054718 611273079 615348053 618078117 618462715 621700134 623910332 622795677
449.4F22795677j411018K950096M073524k955856n809288L831329P687226l438645
$$ 622795677 621384659 624334755 628408279 625452423 619643135 623474464 631161690 627723045
457.1F27723045q604774n84870m716758k578240N208435P34673j424713L787498J665917
$$ 627723045 619118271 618533401 613816643 611238403 616446838 617181511 615756798 619544296 621210213
465.8F21210213k853546k321358O98128K758522l07351n752258n016785L330384J934929
$$ 621210213 618356667 616035309 616733437 619491959 619184608 613432350 608415565 611745949 613680878
474.5F13680878k869530k636871J202430o19049k842560r93423n12009p91816j321144
$$ 613680878 610811348 608174477 609376907 608757858 605915298 604921875 604409866 603618050 602296906
483.2F02296906n30777L278503J658287l188782j349067L434104O83747k792053k239304
$$ 602296906 601766129 605044632 606702919 603514137 602165070 605599174 606282921 603490868 601251564
491.8F01251564q71124P36313R33761Q80928j159553n65453k01530k139397J451149
$$ 601251564 600380440 601116753 602050514 602931442 601771889 601206436 601004906 598865509 600316658
500.5F00316658j808052m258919K996750J960831J022835q69027m618911m828568k963791
$$ 600316658 598508606 594249687 597246437 599207268 600230103 599361076 594742165 589913597 586949806
509.2E86949806j311035m04129N72662k084617j196251J512146M38804l614540n582275
$$ 586949806 585638771 585234642 585807304 583722687 582526436 584038582 584477386 580862846 575280571
517.9E75280571j87073k62146J38092j06773j293831K126770R16977k032967k894210
$$ 575280571 575093498 574831352 574969444 574862671 573568840 575695610 576612587 574579620 571685410
526.6E71685410m08898r99374j867867J329956J730652K731972K357178J124611O93092
$$ 571685410 571276512 570277138 568409271 569739227 571469879 574201851 576559029 577683640 578376732
535.2E78376732j267967L72390K021981J591453N04189q01392K353630K800598j046066
$$ 578376732 577108765 577481155 579503136 581094589 581598778 580797386 583151016 585951614 584905548
543.9E84905548k25143P10678p91435j640130j497154k00615J215744K032662J237678
$$ 584905548 584680405 585391083 584599648 582959518 581462364 581261749 582477493 584510155 585747833
552.6E85747833l80745l042183k991371M64325P65686p33413j653138N46036J016045
$$ 585747833 585367088 582324905 579333534 579797859 580563545 579830132 578176994 578723030 579739075
561.3E79739075j965485j305771k578277l422394j164665k17972j17150p34214j123200
$$ 579739075 577773590 576467819 573889542 570467148 569302483 569084511 568967361 568233147 567109947
570E67109947k821464k071534j550827r14802O4773k491836n27649Q63457J913948
$$ 567109947 564288483 562216949 560666122 559751320 559816093 557324257 556796608 557660065 559574013
578.6E59574013K487793R31473J910171N12772R54666K494735R09653J227226K087937
$$ 559574013 562061806 562993279 564903450 565416222 566370888 568865623 569775276 571002502 573090439
587.3E73090439M26292Q55141K255173O06842r98383o45141N19218M77066p4081L75747
$$ 573090439 573516731 574371872 576627045 577233887 576235504 575590363 576109581 576586647 576512566 576888313
597E76888313P70493N30128k81105N47028J029091j143418k115783M02641J466179
$$ 576888313 577658806 578188934 577907829 578454857 579483948 578340530 576224747 576627388 578093567
605.6E78093567J209831J466370o55556o33583K71912M158J53694k04392R80530J505966
$$ 578093567 579303398 580769768 580114212 579480629 579752541 579756699 579910393 579706001 580686531 582192497
615.3E82192497J195069R40818J098900J244812J050492J409416J182098J197777R43985
$$ 582192497 583387566 584328384 585427284 586672096 587722588 589132004 590314102 591511879 592455864
624E92455864K102852K297706J332703J750450J66092K69432J576195R64813L18794
$$ 592455864 594558716 596856422 598189125 599939575 600105667 600375099 601951294 602916107 603234901
632.7F03234901P47223J413117J019935M29230N61524J190033m98429o17676J969948
$$ 603234901 603982124 605395241 606415176 606844406 607405930 608595963 608097534 607479858 609449806
641.3F09449806J231346r460K52190Q70933M76990l67089q0757J56632J228294J765518
$$ 609449806 610681152 610671692 610923882 611794815 612271805 611904716 611823959 611980591 613208885 614974403
651F14974403Q66738j70365p96623j14136P74460J213265R99450o13250o87790M23240
$$ 614974403 615841141 615670776 614874153 614760017 615534477 616747742 617747192 617133942 616446152 616869392
660.6F16869392K52495O01349L80974n06210j67008J121750K15492p648086K498665
$$ 616869392 617121887 617723236 618104210 617598000 617430992 618552742 618768234 611120148 613618813
669.3F13618813K405586L96614J803703J840782L42598L53623J226310N46532o17905
$$ 613618813 616024399 616421013 618224716 620065498 620408096 620761719 621988029 622534561 621916656
678F21916656o08215N57251J822815J125908O38428R269o57081N51414R04541k88620
$$ 621916656 621308441 621865692 623688507 624814415 625452843 625462112 624805031 625356445 626260986 625972366
687.6F25972366r31358k62833L96920L57513M94995O72074p6752o0578j83067j976662
$$ 625972366 625041008 624778175 625175095 625532608 626027603 626699677 626622925 626562347 626379280 624402618
697.3F24402618j909790r74121k4910N03197l95317m37965n10865J91651n15633k028198
$$ 624402618 622492828 621518707 621493797 621996994 621601677 621163712 620652847 620844498 620328865 618300667
706.9F18300667n55229l22991k26211P99713J002693J348152J100350J55181P5570
$$ 618300667 617745438 617422447 617196236 617995949 618998642 620346794 621447144 621602325 621677895
715.6F21677895Q67729J65176K95105J387444J029319J736565K402344K019539J745453
$$ 621677895 622545624 622710800 623005905 624393349 625422668 627159233 629561577 631581116 633326569
724.3F33326569J531524J125679N01862J014709J979142K200660K223816N48020O4010
$$ 633326569 634858093 635983772 636485634 637500343 639479485 641680145 643903961 644451981 644515991
733F44515991J756745J164093R54437J347656N81894O11954P56988J534043J922531
$$ 644515991 646272736 647436829 648391266 649738922 650320816 650932770 651689758 653223801 655146332
741.6F55146332j48773o16684J340103J288528J24130j120529j439056l79181l92609
$$ 655146332 654997559 654380875 655720978 657009506 657133636 656013107 654574051 654194870 653802261
750.3F53802261m61044j150742j677627n08804p08390k483902k255325j45493M11377
$$ 653802261 653341217 652190475 650512848 650004044 649295654 646811752 644556427 644410934 644822311
759F44822311j38931l27225k98233j0833l69339j44196J121445R25827O36749J602326
$$ 644822311 644683380 644356155 644057922 644047089 643677750 643533554 644654999 645580826 646217575 647819901
768.6F47819901J784210K257919K392349Q57315J110764J838531P45469J99050K022782
$$ 647819901 649604111 651862030 654254379 655111694 656222458 658060989 658806458 659005508 661028290
777.3F61028290K864990J025162R59625J687698J659241J314240R28497R67255O99310
$$ 661028290 663893280 664918442 665878067 667565765 669225006 670539246 671467743 672434998 673134308
786F73134308P19223M80270J067429J828995J735916J129989J32523N03311J332474
$$ 673134308 673853531 674333801 675401230 677230225 678966141 680096130 680228653 680731964 682064438
794.7F82064438J140823L06244P07245Q19855J170349J671371N49164R59702J147232
$$ 682064438 683205261 683511505 684218750 685038605 686208954 687880325 688429489 689389191 690536423
803.4F90536423J392059J127625j63269M26712M55932n14297l0060K241669J933746
$$ 690536423 691928482 693056107 692892838 693319550 693775482 693261185 693231125 695472794 697406540
812F97406540L07770j1063L23029J97143j233444L06625Q31833l38135k9296j62812
$$ 697406540 697714310 697703247 698026276 698223419 696989975 697296600 698128433 697790298 697761002 697598190
821.7F97598190l97110m83398m83093j102295j83335n29327r67636L23028k96783l00827
$$ 697598190 697201080 696717682 696234589 695132294 694948959 694419632 693451996 693775024 693478241 693177414
831.3F93177414j756592k549744j383132j709061j763840n47485R231q71353j47400
$$ 693177414 691420822 688871078 687487946 685778885 684015045 683467560 683476791 682605438 682458038
840F82458038l84597j862488k593079j658020M9439j349945j146393l88031m80881
$$ 682458038 682073441 680210953 677617874 675959854 676009293 674659348 673512955 673124924 672644043
848.7F72644043L97263n39704j183853p27692k63748m53796K53601L61328m77142P14340
$$ 672644043 673041306 672501602 671317749 670590057 670326309 669872513 670126114 670487442 670010300 670724640
858.3F70724640O03332J06507m35181l80783J496735J475525J492919K172928J981659
$$ 670724640 671327972 671434479 670999298 670618515 672115250 673590775 675083694 677256622 679238281
867F79238281J608734J457672J745606J845703J557007J688690J633682R61533J595306
$$ 679238281 680847015 682304687 684050293 685895996 687453003 689141693 690775375 691736908 693332214
875.7F93332214K142182J278610l13950q43505J78375P31506n54047k038955j386490
$$ 693332214 695474396 696753006 696439056 695595551 695773926 696505432 695951385 693912430 692525940
884.4F92525940j276169r46045j057586j995316j383057j421890k115860j960373j129303
$$ 692525940 691249771 690303726 689246140 687250824 685867767 684445877 682330017 680369644 679240341
893F79240341j441574p83157q47168j876297k84653q56934j370391r66416j367569
$$ 679240341 677798767 677015610 676168442 674292145 674007492 673150558 671780167 670813751 669446182
901.7F69446182j229248j563492n13153p04193j848907k097931k070618j704712k372055
$$ 669446182 668216934 666653442 666140289 665436096 663587189 661489258 659418640 657713928 655341873
910.4F55341873k394714k510605k303543j102066j819306k857132k495231j946030
$$ 655341873 652947159 650436554 648133011 647030945 645211639 642354507 639859276 637913246
918.1F37913246j901741k142258k052688j636124j133194j307182j283264p05109o82449
$$ 637913246 636011505 633869247 631816559 630180435 629047241 627740059 626456795 625751686 625069237
926.8F25069237k80342j94016p26242p07321L4561J5411k18429R00307Q09402Q12416
$$ 625069237 624788895 624594879 623868637 623161316 623195877 623211288 622992859 623893166 624702568 625514984
936.4F25514984Q23059l1242R52034J198234K61956N07774J513519J206093N54581
$$ 625514984 626338043 626306801 627258835 628457069 628719025 629226799 630740318 631946411 632500992
945.1F32500992J349106q2703j782188j300545j592026j796036j672401j664276j745796
$$ 632500992 633850098 633767395 631985207 630684662 629092636 627296600 625624199 623959923 622214127
953.8F22214127k115593k683907k817230l215714l660392k988167l393364m037819
$$ 622214127 620098534 617414627 614597397 611381683 607721291 604733124 601339760 597301941
961.5E97301941m120140m102631m148140m098129m039040m439048m688950n719337
$$ 597301941 593181801 589079170 584931030 580832901 576793861 572354813 567665863 561946526
969.2E61946526o010209o046524n924987n950585o597214o586036o812439o297074
$$ 561946526 555936317 549889793 543964806 538014221 531417007 524830971 518018532 511721458
976.9E11721458o958465p527199p592964o513558n744972o860351o033402o176834
$$ 511721458 504762993 497235794 489642830 483129272 477384300 470523949 464490547 458313713
984.7D58313713m632950m295387n216370m180450l605118k620697l220138k751084
$$ 458313713 453680763 449385376 444169006 439988556 436383438 433762741 430542603 427791519
992.4D27791519k581940j283874r21707j723442j113739j888733K56424L34701l41148
$$ 427791519 425209579 423925705 423003998 421280556 420166817 418278084 418534508 418869209 418528061
1001.1D18528061j80512l61023o6909o45943L01056j292152j640931j098709j357002
$$ 418528061 418347549 417986526 417919617 417273674 417574730 416282578 414641647 413542938 412185936
1009.7D12185936j303291j669731j370926k613068j700096j619263j091652n91850
$$ 412185936 410882645 409212914 407841988 405228920 403528824 401909561 400817909 400226059
1017.5D00226059r82857J5259o48079M4632n67436j79978m80079j65406J168137L33939
$$ 400226059 399243202 399258461 398610382 398655014 398087578 397907600 397427521 397262115 398430252 398764191
1027.1C98764191J160926n54885M25834R91211O56967J300774Q42209J403389q64296
$$ 398764191 399925117 399370232 399796066 400787277 401444244 402745018 403587227 404990616 404126320
1035.8D04126320L27339M94843L27682J657333N37377n17388j354675J165543N18913
$$ 404126320 404453659 404948502 405276184 406933517 407470894 406953506 405598831 406764374 407283287
1044.5D07283287P8392l1433K18697J400108K76070J866607K06146J200219K087249
$$ 407283287 407361679 407330246 407548943 408949051 409225121 411091728 411297874 412498093 414585342
1053.1D14585342J515274K281342J519279L097725J561585K545204L071671K807083
$$ 414585342 416100616 418381958 419901237 422998962 424560547 427105751 430177422 432984505
1060.9D32984505L444900L079148M689750L349800L490029K125396J979180K204475
$$ 432984505 436429405 439508553 444198303 447548103 451038132 453163528 455142708 457347183
1068.6D57347183q06312j767617l609466l417244l989411l649215l110619l178978
$$ 457347183 456540871 454773254 451163788 447746544 443757133 440107918 436997299 433818321
1076.3D33818321k401123k960625j40419p50732r56421K9297R48563J977501J586265
$$ 433818321 431417198 428456573 428316154 427565422 426609001 426638298 427586861 429564362 431150627
1085D31150627K398110N84869J717949K240753K296600K836800K460632K368279R07898
$$ 431150627 433548737 434133606 435851555 438092308 440388908 443225708 445686340 448054619 448962517
1093.6D48962517L221054K686462J394158J344413R57032J022377l18566Q16651Q77571
$$ 448962517 452183571 454870033 456264191 457608604 458565636 459588013 459269447 460086098 460963669
1102.3D60963669J181221M97169P88765J509362J20849J641770J500206J758537J603889
$$ 460963669 462144890 462642059 463430824 464940186 465061035 466702805 468203011 469961548 471565437
1111D71565437J337548J465835J299744J430321j10360J057816J514168J463928M56619
$$ 471565437 472902985 474368820 475668564 477098885 476988525 478046341 479560509 481024437 481481056
1119.7D81481056N73006J801796M40750J521263Q79440J592713K303009J550369J582413
$$ 481481056 482054062 483855858 484296608 485817871 486697311 488290024 490593033 492143402 493725815
1128.4D93725815k18239J019211K067451J552201L16009N89295R55352r14497j543579
$$ 493725815 493507576 494526787 496594238 498146439 498462448 499051743 500007095 499092598 497549019
1137D97549019k483254j289329j255570j875648j697464k547989k164650k831802k520867
$$ 497549019 495065765 493776436 492520866 490645218 488947754 486399765 484235115 481403313 478882446
1145.7D78882446k370605k024460l107071l391914j548195j854859q24203j702805
$$ 478882446 476511841 474487381 471380310 467988396 466440201 464585342 463761139 462058334
1153.4D62058334j240501p53059j076050k85340j5182J398811m8980J265640K787933
$$ 462058334 460817833 460064774 458988724 458703384 458688202 460087013 460038033 461303673 464091606
1162.1D64091606K647705K425308J791382L906403L976555L583336L301773L932800
$$ 464091606 466739311 469164619 470956001 474862404 478838959 482422295 485724068 489656868
1169.8D89656868M557915M893074N661392N033913N024109M170646M302330M457817
$$ 489656868 494214783 499107857 504769249 509803162 514827271 518997917 523300247 527758064
1177.5E27758064M250450M420205L899612M132500M039993L833733L314666L104210
$$ 527758064 532008514 536428719 540328331 544460831 548500824 552334557 555649223 558753433
1185.3E58753433K838478K490807K601814K061691J945954J855659J246643J193695
$$ 558753433 561591911 564082718 566684532 568746223 570692177 572547836 573794479 574988174
1193E74988174J981278J480713K83356M83627N13191K70882K55546L05939K90489M82369
$$ 574988174 576969452 578450165 578733521 579217148 579730339 580001221 580256767 580562706 580853195 581335564
1202.6E81335564Q63609N71175M20074O99425P47299L56560O15959J186371J046982
$$ 581335564 582199173 582770348 583190422 583889847 584637146 584993706 585609665 586796036 587843018
1211.3E87843018L92646K16713J239128J395684Q44612L17573K50054M11224j42479
$$ 587843018 588235664 588452377 589691505 591087189 591931801 592249374 592499428 592910652 592768173
1220E92768173M0932Q430n79223p99637o97479l53165m86031n61790o92711r64584
$$ 592768173 592809105 592817535 592238312 591438675 590741196 590388031 589902000 589340210 588647499 587682915
1229.6E87682915j057511o56051p49932j375732p93839o96220l83758j26000p15904
$$ 587682915 586625404 585969353 585219421 583843689 583049850 582353630 581969872 581843872 581127968
1238.3E81127968m89311m28925j39084M997J77422M94499N08499N70259O61278Q82492
$$ 581127968 580638657 580209732 580070648 580075645 580253067 580747566 581256065 581826324 582487602 583370094
1247.9E83370094P21970R79767O89010M61579Q28285P15828O39038O43768J095276
$$ 583370094 584092064 585071831 585760841 586222420 587050705 587766533 588405571 589049339 590144615
1256.6E90144615Q76122N75370N38903P38334J127663M47617L28636M69360O38237
$$ 590144615 591020737 591596107 592135010 592873344 594001007 594448624 594777260 595246620 595884857
1265.3E95884857P54776O13709J066284Q25271N64576R98611R44710M81300M64058
$$ 595884857 596639633 597253342 598319626 599144897 599709473 600708084 601652794 602134094 602598152
1274F02598152O38046O21262M16946L41111M36325L07922M29611O28395P80182O14891
$$ 602598152 603236198 603857460 604274406 604615517 605051842 605359764 605789375 606417770 607197952 607812843
1283.6F07812843K34604M92935O26145M31556L65372L82385J84899O2332J09291j63422
$$ 607812843 608047447 608540382 609166527 609598083 609963455 610345840 610530739 610593071 610702362 610538940
1293.3F10538940k95066L3722R7808m20799l99208J08604L9101J24359R4071n05944
$$ 610538940 610243874 610277596 610375404 609954605 609555397 609664001 609703102 609827461 609921532 609415588
1302.9F09415588k73056J67580n8670n00145n02243M18282J68304o43158j30730J21384
$$ 609415588 609142532 609310112 609251442 608751297 608249054 608667336 608835640 608192482 608061752 608183136
1312.5F08183136j79214n28603o08902n15213m47731k12212o14357q28285m41284j64681
$$ 608183136 608003922 607475319 606866417 606351204 605903473 605691261 605076904 604248619 603807335 603642654
1322.2F03642654L9368m76227r47113o43272l11356k84767p82661r13849m55628m61387
$$ 603642654 603682022 603205795 602258682 601615410 601304054 601019287 600236626 599322777 598867149 598405762
1331.8E98405762o02112n32875m65164m72298n28107m27665K22435j80855j339874
$$ 598405762 597803650 597270775 596805611 596333313 595805206 595377541 595599976 595419121 594079247
1340.5E94079247r4376O66275Q4610l02048J50833M61579J25618k24610k42843k62452
$$ 594079247 593984871 594651146 594735756 594433708 594584541 595046120 595171738 594947128 594704285 594441833
1350.2E94441833n27458k29339L318o9923l05138q06427m74929p41043r60732m2381
$$ 594441833 593914375 593685036 593688354 593618431 593313293 592506866 592031937 591290894 590330162 590287781
1359.8E90287781j56632m87098q93784j812553q0986K18925r17244l26996l18680q03298
$$ 590287781 590131149 589644051 588750267 586937714 586856728 587075653 586158409 585831413 585512733 584709435
1369.4E84709435k00730k29606N05714M83322p79533j457138q37326n0278k51656M85306
$$ 584709435 584508705 584279099 584784813 585268135 584488602 583031464 582194138 582143860 581892204 582377510
1379.1E82377510P28493P09381P63817M37736P55768Q26988J446114J853752N91011
$$ 582377510 583106003 583815384 584579201 585016937 585772705 586599693 588045807 589899559 590490570
1387.8E90490570K85950J378364J091957K91176P31430J066475k04391j394654m57496
$$ 590490570 590776520 592154884 593246841 593538017 594269447 595335922 595131531 593736877 593279381
1396.4E93279381L7460Q90389q69942j186295O58532J01051j2436J43394p80830n36919
$$ 593279381 593316841 594207230 593337288 592150993 592809525 592910576 592898140 593041534 592260704 591723785
1406.1E91723785M71840K58713q5373j93519o20614m24728q88443o67763n08194l16467
$$ 591723785 592195625 592454338 592368965 592175446 591554832 591130104 590241661 589573898 589065704 588749237
1415.7E88749237K92969M80346J123124k178727K08397J856385Q16078P08542p89490
$$ 588749237 589042206 589522552 590645676 588466949 588675346 590531731 591347809 592056351 591266861
1424.4E91266861M92744R74427L49121L28712l45115o54602p19071L67432M2076n20821
$$ 591266861 591759605 592734032 593083153 593411865 593066750 592412148 591693077 592060509 592102585 591581764
1434.1E91581764N59426J007614l121643j686058J933975L50876k08588l05977l59382
$$ 591581764 592141190 593148804 590027161 588341103 590275078 590625954 590417366 590111389 589752007
1442.7E89752007J52092r23081o5002L92837J50833j905098p84950J49460j264343
$$ 589752007 589904099 588981018 588916016 589308853 589459686 587554588 586769638 586919098 585654755
1451.4E85654755j327134j725692K441l85361K9984j596298l745613K829361R8724
$$ 585654755 584327621 582601929 582604370 582219009 582248993 580652695 576907082 579736443 579835167
1460.1E79835167J707039J44119L77922K121086j220817N84678J083947L636550M078141
$$ 579835167 581542206 581686325 582064247 584185333 582964516 583549194 584633141 588269691 592347832
1468.8E92347832N911216O922837N919342P633552L225289M978065M191132K601280
$$ 592347832 598259048 605181885 611101227 618734779 621960068 626938133 631129265 633730545
1476.5F33730545K400246L613205L300895K696152L280335J054840J375045J231308
$$ 633730545 636130791 639743996 643044891 645741043 649021378 650076218 651451263 652682571
1484.2F52682571J385270K257156J038742J059723J621780O07148k585602J19705J247635
$$ 652682571 654067841 656324997 657363739 658423462 660045242 660652390 658066788 658186493 659434128
1492.9F59434128L39660J083603J025849l299408O09131O30645k407684O60019j03607
$$ 659434128 659773788 660857391 661883240 658583832 659192963 659823608 657415924 658075943 657972336
1501.6F57972336j188660l28369N92346J935654l460770p466202R6283Q96378q76083
$$ 657972336 656783676 656455307 657047653 658983307 655522537 648056335 648152618 649048996 648172913
1510.2F48172913J4114j321945l314591N01633k42920l30276m35486m087944K468605
$$ 648172913 648187027 646865082 643550491 644052124 643809204 643478928 643043442 638955498 641424103
1518.9F41424103K926636o34079j850358j757659L56292J438141l59039m51508N36728
$$ 641424103 644350739 643716660 641866302 640108643 640464935 641903076 641544037 641092529 641629257
1527.6F41629257j108475m59823P21817o4850P01141j2664m419480N34172J036186
$$ 641629257 640520782 640060959 640782776 640717926 641419067 641406403 636986923 637521095 638557281
1536.3F38557281J021576L474198J802826r923020K404023J688728j797257J052781
$$ 638557281 639578857 643053055 644855881 634932861 637336884 639025612 637228355 638281136
1544F38281136J030731j241913J229172J487236J636276J248398j654816J098557J879043
$$ 638281136 639311867 638069954 639299126 640786362 642422638 643671036 642016220 643114777 644993820
1552.7F44993820J677628o51322L41111N239944M894562l628845l441391j81961M055786
$$ 644993820 646671448 646020126 646361237 651601181 656495743 652866898 649425507 649243546 653299332
1561.4F53299332K342529J947021J525956j08567K26441J352310K165298K120362l279801
$$ 653299332 655641861 657588882 659114838 659006271 659232712 660585022 662750320 664870682 661590881
1570F61590881m03137K161865P19376N51682J617202J300736n502548R2773J928711
$$ 661590881 661187744 663349609 664068985 664620667 666237869 667538605 662036057 662128830 664057541
1578.7F64057541M5318q392p44781p88422n60455o03867r18960j129914l97415j153259
$$ 664057541 664102859 664094467 663349686 662561264 662000809 661396942 660477982 659348068 658950653 657797394
1588.4F57797394r33151j217957j209106j664200j309128q38471k139587j329803j880188
$$ 657797394 656864243 655646286 654437180 652772980 651463852 650625381 648485794 647155991 645275803
1597F45275803j116867j487046k185516j773758j819801j365166k796936j844978j727105
$$ 645275803 644158936 642671890 640486374 638712616 636892815 635527649 632730713 630885735 629158630
1605.7F29158630k081184k675171j983719j727905k975807j543694l066177k664681
$$ 629158630 627077446 624402275 622418556 620690651 617714844 616171150 613104973 610440292
1613.4F10440292k892990q80203l12614j0252114o03142j333656k045097l125420j050682
$$ 610440292 607547302 606667099 606354485 596102371 595499229 594165573 592120476 588995056 587944374
1622.1E87944374j503906q038750j225815j456718l69034l635330m363861j801605
$$ 587944374 586440468 578401718 577175903 575719185 575350151 571714821 567350960 565549355
1629.8E65549355k743569j776161k914734r8267J021195l915558n056343j027794j202202
$$ 565549355 562805786 561029625 558114891 558016624 559037819 555122261 550065918 549038124 547835922
1638.5E47835922q88443J65482j879616r346q64372O27327J443023k298927J045151
$$ 547835922 546947479 547112961 545233345 545223999 544359627 544986954 546429977 544131050 545176201
1647.2E45176201k409630R28879R20296K210350L735771j242295p161445N12504L895646
$$ 545176201 542766571 543695450 544615746 546826096 550561867 549319572 542158127 542670631 546566277
1655.9E46566277J617050J403656J393814J520920J830558K121125K854576m09889
$$ 546566277 548183327 549586983 550980797 552501717 554332275 556453400 559307976 558898087
1663.6E58898087K165374J871071J852837L098068L274612J114235L75100L546981
$$ 558898087 561063461 562934532 564787369 567885437 571160049 572274284 572649384 576196365
1671.3E76196365Q18291K560043M079934J939964o27556K301331L414726K712211K639504
$$ 576196365 577014656 579574699 583654633 585594597 584967041 587268372 590683098 593395309 596034813
1680E96034813J81541K758484N062943K174644k537727J217346M658966L024063R65538
$$ 596034813 596216354 598974838 604037781 606212425 603674698 604892044 609551010 612575073 613540611
1688.6F13540611K441368J793328J483726J991463K550011L723793L836975k272949
$$ 613540611 615981979 617775307 619259033 621250496 623800507 627524300 631361275 629088326
1696.4F29088326K126274M033737M935455Q74405q408813N848465M004592J423645
$$ 629088326 631214600 635248337 640183792 641058197 632649384 638497849 642502441 643926086
1704.1F43926086p2250J303864m46625r96933J111297R0027l67202O80618J087799
$$ 643926086 643853836 645157700 644711075 643714142 644825439 644915466 644548264 645228882 646316681
1712.8F46316681J603317M18396P0954K613449K723465m760895N24673K184906R70841
$$ 646316681 647919998 648338394 648409348 651022797 653746262 648985367 649510040 651694946 652665787
1721.4F52665787P14340M8828o78101l34625l40957r51996j012345j56021k603531
$$ 652665787 653380127 653428955 652750854 652416229 652075272 651123276 650110931 649954910 647351379
1730.1F47351379l838501o1493J231461l758240j2595253j009254q00972k538910j358414
$$ 647351379 643512878 643451385 644682846 640924606 628329353 627320099 626519127 623980217 622621803
1738.8F22621803l855743p219849j009636K55280l194809j303291J238823K054290
$$ 622621803 618766060 611546211 610536575 610791855 607597046 606293755 607532578 609586868
1746.5F09586868K271233L664818M732513N373421Q056335N358124Q139916P747039
$$ 609586868 611858101 615522919 620255432 625628853 633685188 639043312 647183228 654930267
1754.2F54930267P075119P980881N574570O535263N580215N406647N856094L026276
$$ 654930267 662005386 669986267 675560837 682096100 687676315 693082962 698939056 701965332
1761.9G01965332K678909L782273L281936K624283K579956J901932p94754K128754
$$ 701965332 704644241 708426514 711708450 714332733 716912689 718814621 718019867 720148621
1769.7G20148621M082794J732483j453858j179733K849503K090835q30612J343307
$$ 720148621 724231415 725963898 724510040 723330307 726179810 728270645 727440033 728783340
1777.4G28783340J249161J202545P05338r24835Q66012J222992J227036j84555m96369
$$ 728783340 730032501 731235046 731940384 731015549 731881561 733104553 734331589 734147034 733650665
1786G33650665J203537N34668N63202J458664P49741P77511j738968j573791K405472
$$ 733650665 734854202 735388870 735952072 737410736 738160477 738937988 737199020 735625229 738030701
1794.7G38030701J317825p78732M84543J670303K30713j180191J215057m1122k56424
$$ 738030701 739348526 738569794 739054337 740724640 740955353 739775162 740990219 740949097 740692673
1803.4G40692673P38067n1803M42886J92871l00140Q66089J502075o47202j76162Q45947
$$ 740692673 741430740 741378937 741821823 742014694 741714554 742580643 744082718 743435516 743259354 744105301
1813G44105301j46866J45721j68457K18354j31302K23236J175079J68457M44336k16140
$$ 744105301 743958435 744104156 743935699 744154053 744022751 744245987 745421066 745589523 746033859 745817719
1822.7G45817719N30700J252365k348633o51016J371384J617584R60999k875748J42365
$$ 745817719 746348419 747600784 745252151 744601135 745972519 747590103 748551102 745675354 745817719
1831.4G45817719J619873R9945k53601n63431M98962N03616n38406N01022J00785M77066
$$ 745817719 747437592 747537537 747283936 746720505 747219467 747723083 747184677 747685699 747786484 748263550
1841G48263550M18396J509399J483307n300445q2016J789321L05863l56751o7596N66559
$$ 748263550 748681946 750191345 751674652 746374207 746292191 748081512 748387375 748030624 747963028 748529587
1850.7G48529587K31933N92728k1973r3078j14136m01764J22604k22930k5788J74179
$$ 748529587 748761520 749354248 749332275 749239197 749125061 748723297 748845901 748622971 748597183 748771362
1860.3G48771362O16837M3335r3460Q5678K6626R52530Q40M40368o79016k194519M91562
$$ 748771362 749388199 749431534 749338074 749423752 749450378 750402908 750403748 750844116 750165100 747970581 748462143
1870.9G48462143O15234L42713k16522j82343K23007K65122K0218j4878L05557l65982
$$ 748462143 749077377 749420090 749203568 749021225 749244232 749509354 749529572 749514694 749820251 749454269
1880.6G49454269N5542K53296k8228l38746k41775N10178J41220J124572O98471k280807
$$ 749454269 749509811 749763107 749734879 749396133 749154358 749664536 749805756 750930328 751628799 749347992
1890.2G49347992m94843R22471J69754L96881L4561j062241J62430K61307j53580J53732
$$ 749347992 748853149 749775620 749945374 750342255 750376816 749314575 749477005 749738312 749584732 749738464
1899.8G49738464J60599L31497J19782k38190p02057l69186K96860L89862p4616j95007
$$ 749738464 749899063 750230560 750350342 750112152 749410095 749040909 749337769 749727631 749653015 749458008
1909.5G49458008k26288j95313Q67081L54309P8507l40805m16260J276855j095199
$$ 749458008 749231720 749036407 749903488 750257797 750336304 749995499 749579239 750856094 749760895
1918.2G49760895j489029O95572N90820R68781m26026j222610M68368M72718n26124
$$ 749760895 748271866 748967438 749558258 750527039 750101013 748878403 749346771 749819489 749293365
1926.8G49293365l29132m5623M8751j30081l67508K91977L891j15814N3482J01471
$$ 749293365 748964233 748918610 748967361 748837280 748469772 748761749 748765640 748649826 748703308 748804779
1936.5G48804779K8534k47879K6398p6447J134491M52499k287292p7209R88159j0453
$$ 748804779 748833313 748585434 748611832 748535385 749669876 750122375 747835083 747757874 748746033 748735580
1946.1G48735580m38308L4485k8153l59039j20392r5291q4458J67847M84390R7199
$$ 748735580 748297272 748331757 748303604 747944565 747824173 747728882 747644424 747812271 748296661 748393860
1955.8G48393860q7052l1814k17743j10626n9586j07498k16980J57242K3346q3695
$$ 748393860 748306808 748274994 748057251 747946625 747887039 747779541 747562561 747719803 747743149 747659454
1965.4G47659454J73416o13327l30734N22461K99835j11847j49688j29090r155j3580
$$ 747659454 747832870 747219543 746888809 747411270 747711105 747599258 747449570 747320480 747311325 747297745
1975.1G47297745r1477P9727l00292j68610K51312O1646l14255m76837K04086K67258
$$ 747297745 747206268 747285995 746985703 746817093 747068405 747130051 746815796 746338959 746543045 746810303
1984.7G46810303j23978J15204K50168k74124n31083K77100M18625n59311n09720L67966
$$ 746810303 746686325 746801529 747051697 746777573 746246490 746523590 746942215 746382904 745873184 746241150
1994.3G46241150L04031k16446l57742j57089k4567l06396N2719K10647j60293l5553
$$ 746241150 746545181 746328735 745970993 745813904 745789337 745482941 745535660 745746307 745586014 745550461
2004G45550461R7961j67999m56772l11432k34070l585K58255P2631k84423m22669j54800
$$ 745550461 745648422 745480423 745023651 744712219 744478149 744474564 744732819 744805450 744521027 744098358 743943558
2014.6G43943558L4713j49002m59518k7008n8441j01700K28729j49841n875j95083
$$ 743943558 743978271 743829269 743369751 743342743 743284302 743182602 743411331 743261490 743255615 743060532
2024.2G43060532k63672j45188n21392j91880m6997k07290m62647k29492j4801O0348
$$ 743060532 742796860 742651672 742130280 741938400 741891403 741684113 741221466 740991974 740977173 741037521
2033.9G41037521K91520k35825k80075j18103j72043j68152p8125r9640k5253M17633
$$ 741037521 741329041 741093216 740813141 740695038 740522995 740354843 740276718 740177078 740151825 740569458
2043.5G40569458N9204k46200l82157j95770l1967l77655k33460J40229P09075P0801
$$ 740569458 740628662 740382462 740000305 739804535 739772568 739394913 739161453 739301682 740010757 740081558
2053.2G40081558n88074m41284j24206N42297k9602m32892l27682l7842K87857J90277
$$ 740081558 739493484 739052200 738927994 739470291 739440689 739007797 738680115 738642273 738930130 739120407
2062.8G39120407L48511j36032m06952K060J45569k55127k42081K72217R7809j50223
$$ 739120407 739468918 739332886 738925934 738927994 739073563 738818436 738576355 738848572 738946381 738796158
2072.5G38796158k06146J37252J57242j21536k12173j77994P2326J35422M96445K99301
$$ 738796158 738590012 738727264 738884506 738762970 738550797 738372803 738445129 738580551 739076996 739376297
2082.1G39376297j97983m54483k89383R1400j21383J3580j41830j77765J5640J65939
$$ 739376297 739178314 738723831 738434448 738525848 738404465 738418045 738276215 738098450 738114090 738280029
2091.7G38280029J99662m9363K12326j15585o3934j54648l57895K39105J04981L6621
$$ 738280029 738479691 738430328 738642654 738527069 738463135 738308487 737950592 738189697 738294678 738331299
2101.4G38331299j71814N9509L84751J69372N8899m04053k24991O9580P7897j65940
$$ 738331299 738159485 738218994 738603745 738773117 738832016 738427963 738202972 738272552 738350449 738184509
2111G38184509j57089L96195K24151k17667l59191j2055J86997j53656j38474K11411
$$ 738184509 738027420 738423615 738647766 738430099 738070908 738058853 738245850 738092194 737953720 738165131
2120.7G38165131o3019j73111J15280r3918J83563J35270k50931l38822k33764J70898
$$ 738165131 738102112 737929001 738044281 737950363 738133926 738269196 738018265 737679443 737445679 737616577
2130.3G37616577m1504J72653K23008l50342j74484K15988P6675j16882J67084N416
$$ 737616577 737575073 737747726 737970734 737620392 737445908 737661896 737738571 737621689 737788773 737794189
2140G37794189k37045j03531j01776j78222M4479J1902k32468K85339J01242l0441
$$ 737794189 737557144 737453613 737351837 737173615 737218094 737229996 736997528 737282867 737384109 737353668
2149.6G37353668K59629K9754j90124k58561L01896Q0261p9804J79901j24664j27258
$$ 737353668 737613297 737643051 737452927 737194366 737496262 737576523 737496719 737676620 737551956 737424698
2159.3G37424698K4567L34548q1481j27030R8801j41525K49404J35727j24740j01090
$$ 737424698 737449265 737783813 737702332 737575302 737674103 737532578 737781982 737917709 737792969 737691879
2168.9G37691879J6022L05939M69284J16501k70691k54822j48087L89939K22168O8283
$$ 737691879 737707901 738013840 738483124 738599625 738328934 738074112 737926025 738315964 738538132 738606415
2178.5G38606415O7520o5613J37100k11715O9961O5613j55563P7819O1188L74527L55683
$$ 738606415 738673935 738608322 738745422 738533707 738603668 738669281 738513718 738591537 738652725 739027252 739382935
2189.1G39382935q698k27356J75171p0343l68576K49329j22681l10364J15204K13318
$$ 739382935 739374237 739146881 739322052 739251709 738883133 739132462 739009781 738699417 738814621 739027939
2198.8G39027939J21918L01742L98255K9296k95333k99912K54059L96652Q8883l76511
$$ 739027939 739149857 739451599 739849854 739879150 739583817 739283905 739537964 739934616 740023499 739646988
2208.4G39646988q2398M39606K66876K31095l97110k77176r8343k45895Q4381J52664
$$ 739646988 739564590 740004196 740271072 740502167 740105057 739827881 739729538 739483643 739568024 739720688
2218.1G39720688N64041K78091n1879l91617j53733M86756o3629k00882l25318J07193
$$ 739720688 740284729 740562820 740510941 740119324 739965591 740452347 740388718 740187836 739862518 739969711
2227.7G39969711M66385Q5526M8217N265o9199m69360j88828R0790k0065j02844m0284
$$ 739969711 740436096 740521622 740569839 740575104 740505905 740036545 739847717 739938507 739918442 739815598 739775314
2238.3G39775314K23008q8120p6904l7232P8659M4937j34887j49002k54898J51519
$$ 739775314 739998322 739910202 739833298 739796066 739874725 739919662 739784775 739635773 739380875 739532394
2248G39532394J57471O0120N3253K22855P6141l87039j97983J95999M25415l27072
$$ 739532394 739689865 739749985 739803238 740026093 740102234 739715195 739517212 739713211 740138626 739811554
2257.6G39811554l01971j69526j7318M46167l19367j12610l4713J06887J60447r1095
$$ 739811554 739509583 739340057 739322739 739768906 739449539 739336929 739302216 739409103 739569550 739478455
2267.3G39478455K27203k18430j05362q7814J27564l4638j26037K66571j71891Q2016
$$ 739478455 739705658 739487228 739381866 739294052 739421616 739386978 739260941 739527512 739355621 739437637
2276.9G39437637k40326P4082K15149l16391n0965k26135k16446k99759K74201K27279
$$ 739437637 739197311 739271393 739486542 739170151 739119186 738893051 738676605 738376846 738651047 738878326
2286.5G38878326J71128k0523q95157j19400K42615O19430l4256m94232l5858l59345
$$ 738878326 739049454 739028931 738133774 738014374 738256989 738876419 738842163 738347931 738312073 737952728
2296.2G37952728k29n08728k00271j52359K7237N68771k82135M6768k87323m56085
$$ 737952728 737952499 737443771 737243500 737091141 737118378 737687149 737405014 737451782 737164459 736708374
2305.8G36708374k75421M5700j12534r79843j22070m3335L78189k4490m62189J13525
$$ 736708374 736432953 736478653 736366119 735386276 735264206 735220871 735599060 735574570 735112381 735225906
2315.5G35225906m75692Q2550j76392n22232J05515J33361m71420n00870O409k95181
$$ 735225906 734750214 734832764 734656372 734134140 734239655 734373016 733901596 733400726 733407135 733111954
2325.1G33111954m9134k22702L36457J53045m36248n98221o25611J059342n49011j181565
$$ 733111954 733062820 732840118 733176575 733329620 732893372 732295151 731669540 732728882 732179871 730998306
2334.8G30998306N1575l29819o08597q80050K71988P14569N33600Q5067l00445p9193
$$ 730998306 731049881 730720062 730111465 729231415 729503403 730217972 730751572 730836639 730536194 730457001
2344.4G30457001m79737m78515J75857J064301J098480K60315j361008r44290L90854
$$ 730457001 729977264 729498749 729674606 730738907 731837387 732097702 730736694 729792404 730183258
2353.1G30183258q03986j827621n69077N14756q25653L50341k24609j225815J600571
$$ 730183258 729379272 727551651 726982574 727497330 726671677 727022018 726797409 725571594 727172165
2361.8G27172165O53458K4719j060257j353836L45382Q96607O37207l62701N54580
$$ 727172165 727825623 727850342 726790085 725436249 725781631 726678238 727315445 726952744 727507324
2370.4G27507324M08554N25055J143875L05786J42975K91596M0054n13077j14364J90429
$$ 727507324 727915878 728440933 729584808 729890594 730033569 730325165 730365219 729852142 729737778 729928207
2380.1G29928207L04871N69305L56141N11856K24685j40533K5101r8725m70276l47671
$$ 729928207 730233078 730802383 731158524 731670380 731895065 731754532 731779633 731680908 731210632 730862961
2389.7G30862961M9133L20511M60052j96228k39028K38571j50681o21719l90625K97317
$$ 730862961 730912094 731232605 731692657 731496429 731257401 731495972 731345291 730723572 730332947 730630264
2399.4G30630264J29090m92096n06897L8833J71433n8747J14213K1057k54517m44565
$$ 730630264 730759354 730267258 729760361 729799194 729970627 729911880 730026093 730047150 729792633 729348068
2409G29348068k55050j25428k50625j42212J0681l8528k36588J69220K0523l99628
$$ 729348068 729093018 728967590 728716965 728574753 728585434 728546906 728310318 728479538 728500061 728100433
2418.7G28100433k29187m12368k24457L21579M86755j7700m42123m80118k93274l7613
$$ 728100433 727871246 727458878 727234421 727556000 728042755 728025055 727582932 727102814 726809540 726771927
2428.3G26771927l18985m26636j85928K04239m0741n07965l65143O5994K40402n20935
$$ 726771927 726452942 726026306 725840378 726044617 726003876 725495911 725130768 725196762 725437164 724916229
2438G24916229k25677M18854k29n01786o25000R003J27182j42364m45099l61252Q6670
$$ 724916229 724690552 725109406 725109177 724607391 723982391 723991394 724118576 723976212 723531113 723169861 723256531
2448.6G23256531R384j61514k98081O7597k6245k86408j80511k69318j78757j31836
$$ 723256531 723265915 723104401 722806320 722873917 722847672 722561264 722380753 722111435 721932678 721800842
2458.2G21800842M9744k51923l89480q7815K79999J57013p53021m83780Q7357L26080
$$ 721800842 721850586 721598663 721209183 721121368 721401367 721558380 720805359 720321579 720408936 720735016
2467.8G20735016m1886m80651k14005k61536J88599L1510l70636k20795k92435k05231
$$ 720735016 720693130 720212479 719998474 719736938 719925537 719957047 719586411 719365616 719073181 718867950
2477.5G18867950k31552r9792K6169K39410n951n04989n47715k56500K07291j86234
$$ 718867950 718636398 718536606 718562775 718802185 718796234 718291245 717743530 717487030 717694321 717508087
2487.1G17508087n7144J02768l89710k72140l2196K83203o1264l82233q1634K2049
$$ 717508087 717450943 717553711 717164001 716891861 716859665 717142868 717081604 716699371 716617737 716639786
2496.8G16639786J9150m29459n77698J13678M01230j15967m04968j01318J11694j77612
$$ 716639786 716658936 716229477 715651779 715765457 716166687 716050720 715645752 715544434 715656128 715478516
2506.4G15478516k00043k67029n66101m1656J69982J49460J52054n28488o38733k4033
$$ 715478516 715278473 715011444 714445343 714403687 714573669 714723129 714875183 714346695 713707962 713683929
2516.1G13683929K07215R6817K9983m44107l04184J95847L3722p8812m34341l36228
$$ 713683929 713891144 713987961 714017944 713573837 713269653 713465500 713499222 713420410 712986069 712649841
2525.7G12649841p6294o8435j31073l26310P8736Q7356j48391l31040m45099j30539
$$ 712649841 712573547 712505112 712374039 712047729 712126465 712213821 712065430 711734390 711289291 711158752
2535.4G11158752j51519k91901o1035K88238k4871j53809N2109k91901m65774l84827
$$ 711158752 711007233 710715332 710654297 710942535 710917664 710763855 710815964 710524063 710058289 709673462
2545G09673462k20871P4234M05197r0027m86908P9804k13471n96618k11792q1101j70059
$$ 709673462 709452591 709526825 709932022 709841995 709355087 709434891 709221420 708624802 708413010 708331909 708161850
2555.6G08161850r2087n4626j05286j30463k54821k37732k45514j98822j33286l49502
$$ 708161850 708069763 708015137 707909851 707779388 707524567 707286835 707041321 706842499 706709213 706359711
2565.2G06359711l77808q4000q8043k20260P8201P3242j81427k84042j54496j45721
$$ 706359711 705981903 705897903 705809860 705589600 705667801 705741043 705559616 705275574 705121078 704975357
2574.9G04975357l82996j74255J6403J63880l16010n01556J59607o6681k84348l85437
$$ 704975357 704592361 704418106 704434509 704598389 704282379 703780823 703940430 703873749 703589401 703203964
2584.5G03203964k66418p3776l04947j1826L15628J0300n01709j68915j70212m44183
$$ 703203964 702937546 702863770 702558823 702546997 702862625 702872925 702371216 702202301 702032089 701587906
2594.2G01587906j75476k46506j3122j91803k86179M2190k27584j33057J52130k21939
$$ 701587906 701412430 701165924 701152802 700960999 700674820 700717010 700489426 700356369 700508499 700286560
2603.8G00286560p06940m47464K0981L47290K9068m94003l12958l29208l63007j17035
$$ 700286560 699579620 699132156 699153137 699500427 699529495 699035492 698722534 698393326 698030319 697913284
2613.5F97913284K87247l1204m87137k68707m26712l41111j35040j88675n99365n76248
$$ 697913284 698200531 698169327 697682190 697413483 696986771 696645660 696510620 696321945 695722580 695146332
2623.1F95146332j02616k22625m1428j28326l83454k40173K1286l41721p39212j24359
$$ 695146332 695043716 694821091 694779663 694651337 694267883 694027710 694048996 693707275 692968063 692843704
2632.8F92843704m00162n98220k54517J3275K78626k71988l66135l16772l70255n14221
$$ 692843704 692443542 691845322 691590805 691604080 691882706 691610718 691244583 690927811 690557556 690043335
2642.4F90043335p17011k19726q3771j31073K1134r4910l10288l41949n27191n60456
$$ 690043335 689326324 689106598 689022827 688891754 688912888 688817978 688507690 688165741 687638550 687078094
2652F87078094k91290m13437n47180m82101p2937K34222K04086j67007o53229o63070
$$ 687078094 686786804 686373367 685826187 685344086 685271149 685505371 685709457 685542450 684889221 684226151
2661.7F84226151o10047M7226K57187l03726m15344l73536p7896j2207j84784m33426
$$ 684226151 683616104 683663330 683920517 683616791 683201447 682827911 682750015 682737808 682553024 682119598
2671.3F82119598l25927p0114k91367k01645j31073j13296l24097q01087o76803q6289
$$ 682119598 681793671 681723557 681432190 681230545 681099472 680986176 680662079 679860992 679184189 679097900
2681F79097900J19553j88828l12652q3389K59933k10266m19617j22986m63409k00958
$$ 679097900 679217453 679028625 678715973 678632584 678892517 678682251 678262634 678139648 677676239 677475281
2690.6F77475281n6687l97339m41741l35160k29034j60599j41830k17972P3471k55814
$$ 677475281 677418594 677021255 676579514 676244354 676015320 675854721 675712891 675494919 675568390 675312576
2700.3F75312576k46124P7057o19431n13382j39160M4632n2337m42353k60772j52436
$$ 675312576 675066452 675143509 674524078 674010696 673871536 673916168 673863831 673421478 673160706 673008270
2709.9F73008270k61154n71442n06591k83738J45798Q2550q12225j51672J05285q56170
$$ 673008270 672747116 672175674 671669083 671385345 671531143 671613693 670801468 670649796 670755081 669898911
2719.5F69898911o70166J754O8512l08456k50778j16883j66626k09045n70297p05414
$$ 669898911 669228745 669230499 669299011 668990555 668739777 668622894 668456268 668247223 667676926 666971512
2729.2F66971512k50626j2970l22113j32675r9869m81109k5254L14331k51541p61947
$$ 666971512 666720886 666707916 666385803 666253128 666153259 665672150 665646896 665961227 665709686 664947739
2738.8F64947739l28751J33743j03683k77939l97186k58103L1739J25579k3040n55268
$$ 664947739 664618988 664752731 664649048 664371109 663973923 663715820 663747559 663873138 663850098 663294830
2748.5F63294830n63278k84958j98517j59301o30646o11420J43738L69873J7624m51584
$$ 663294830 662731552 662446594 662248077 662088776 661458130 660846710 660990448 661360321 661377945 660926361
2758.1F60926361o63223l04794j00709m12216k17743m9743j10626K41012J0910o14242
$$ 660926361 660263138 659958344 659857635 659445419 659227676 659177933 659067307 659308319 659319229 658704987
2767.8F58704987p54853k82745L1052j42975R0332J44653k56195n73578p44247m87366
$$ 658704987 657950134 657667389 657698441 657555466 657645798 657790451 657534256 656960678 656216431 655729065
2777.4F55729065j63651k35748j44043k14538q32444o21795q6441k48261n03311l41949
$$ 655729065 655565414 655329666 655185623 654971085 654138641 653516846 653430405 653182144 652678833 652336884
2787F52336884M6234k31324l65448k40478n79147n82657l32184l26386n25360n20019
$$ 652336884 652383118 652151794 651786346 651545868 650966721 650384064 650051880 649725494 649200134 648680115
2796.7F48680115m04511m33426o43310q86460o81839k80303o4316l36304o64673p33871
$$ 648680115 648275604 647842178 647198868 646312408 645630569 645350266 645285950 644949646 644284973 643551102
2806.3F43551102o04935m39682o66351n90897o09360p28531l55148m31785p83577r10149
$$ 643551102 642946167 642506485 641840134 641249237 640639877 639911346 639556198 639124413 638340836 637430687
2816F37430687j031494j191597j146889q59947o53534q19244q17376n15670r76067
$$ 637430687 636399193 635207596 634060707 633200760 632547226 631727982 630910606 630394936 629418869
2824.7F29418869j440277j299629j167527j112175j350898j633301j589356j481742
$$ 629418869 627978592 626678963 625511436 624399261 623048363 621415062 619825706 618343964
2832.4F18343964j533585j385155j675453k237739j867524k120742l371659l788147
$$ 618343964 616810379 615425224 613749771 611512032 609644508 607523766 604152107 600363960
2840.1F00363960l523597l894082m922714n699043n822334n980034o823654p462349
$$ 600363960 596840363 592946281 588023567 582324524 576502190 570522156 563698502 556236153
2847.8E56236153q043862q677635p575874n882454m881020l469047k041550k66571
$$ 556236153 548192291 539514656 531938782 526056328 521175308 517706261 515664711 515398140
2855.5E15398140J731300K862931L386039M047699M740563M510078L792954L571243
$$ 515398140 517129440 519992371 523378410 527426109 532166672 536676750 540469704 544040947
2863.2E44040947L315811K481384J827469J195565M44717k27509p18956k14996L49083
$$ 544040947 547356758 549838142 551665611 552861176 553305893 553078384 552359428 552144432 552493515
2871.9E52493515K53754j42899m30412K18086M61006J4839j43051m38194l99513l93067
$$ 552493515 552747269 552604370 552173958 552392044 552853050 552867889 552724838 552286644 551887131 551494064
2881.6E51494064o16874p17469j195945j369095j414490j518822j416855j472969j439819
$$ 551494064 550877190 550159721 548963776 547594681 546180191 544661369 543244514 541771545 540331726
2890.2E40331726j406555j135597j202698j883850k220879k289734k090606k059060
$$ 540331726 538925171 537789574 536586876 534703026 532482147 530192413 528101807 526042747
2897.9E26042747k071876j789551k040100k595177k460212k154999k804871l261184
$$ 526042747 523970871 522181320 520141220 517546043 515085831 512930832 510125961 506864777
2905.7E06864777l065262l291703l540077l661461m195861m643021m885674n848274
$$ 506864777 503799515 500507812 496967735 493306274 489110413 484467392 479581718 473733444
2913.4D73733444n959511n457801o324959o631127o739654p058907o116333n093727
$$ 473733444 467773933 462316132 455991173 449360046 442620392 435561485 429445152 424351425
2921.1D24351425m508095l905182k413825j477814j194267J25885J383857K316284
$$ 424351425 419843330 415938148 413524323 412046509 410852242 410978127 412361984 414678268
2928.8D14678268K418557L054618M047585M398766M835701N028877N722008N467033
$$ 414678268 417096825 420151443 424199028 428597794 433433495 438462372 444184380 449651413
2936.5D49651413N093613N589332N709686N943833N476951M851113M805641M466476
$$ 449651413 454745026 460334358 466044044 471987877 477464828 482315941 487121582 491588058
2944.2D91588058M080010L742027K821045J803017J453895J711960J386833N04113
$$ 491588058 495668068 499410095 502231140 504034157 505488052 507200012 508586845 509090958
2952E09090958Q31565J086464N99213N68543R56955J451072J518669J766701K633705
$$ 509090958 509922523 511008987 511608200 512176743 513133698 514584770 516103439 517870140 520503845
2960.6E20503845L402100L138428K679405K884636L227386L747177L888321L748970
$$ 520503845 523905945 527044373 529723778 532608414 535835800 539582977 543471298 547220268
2968.3E47220268L495217L635826L993149L803176L100014K206078K558136K711029
$$ 547220268 550715485 554351311 558344460 562147636 565247650 567453728 570011864 572722893
2976.1E72722893K267380K344360K247276K242012J891327J378098J267357J590080
$$ 572722893 574990273 577334633 579581909 581823921 583715248 585093346 586360703 587950783
2983.8E87950783J675682J186256J207505J171913R53674J099091J108360Q76846M09737
$$ 587950783 589626465 590812721 592020226 593192139 594145813 595244904 596353264 597230110 597639847
2992.5E97639847J20582L00522j7509m21067k89649m10500o58302r30863p12051p89795
$$ 597639847 597760429 598060951 598043442 597622375 597332726 596922226 596263924 595333061 594621010 593831215
3002.1E93831215j315765o91491o17904j265869j244965n37338K66876m5853k5367
$$ 593831215 592515450 591823959 591206055 589940186 588695221 588157883 588424759 588378906 588353539
3010.8E88353539O78367O69212P61681J248512J056481P09152J150093J365204Q01849
$$ 588353539 589031906 589701118 590462799 591711311 592767792 593476944 594627037 595992241 596794090
3019.5E96794090L69644O56434N33371R6206K46124K61727R308r5597N1384q888Q6899
$$ 596794090 597163734 597820168 598353539 598449745 598695869 598957596 598966904 598871307 598922691 598913803 599000702
3030.1E99000702O9466n18570m66309j18866m40369q70590n75218n34859l73916r3346
$$ 599000702 599070168 598551598 598085289 597966423 597526054 596655464 596080246 595545387 595171471 595078125
3039.7E95078125o34232n30548n12542o03829n41382o71081k21482m84733q56171p25479
$$ 595078125 594443893 593913345 593400803 592796974 592255592 591584511 591363029 590878296 590022125 589296646
3049.4E89296646o30226l76091o21605j003151q36258n48172o38275o82869n45883
$$ 589296646 588666420 588290329 587668724 586665573 585829315 585281143 584642868 583959999 583414116
3058E83414116p59125j120033p76444m08058m64401m76913p65725l25584l81165j017418
$$ 583414116 582654991 581534958 580758514 580350456 579886055 579409142 578643417 578317833 577936668 576919250
3067.7E76919250n33218p06291r69658p04842n83000l86085l00522j94855l96004q75625
$$ 576919250 576386032 575679741 574710083 574005241 573422241 573036156 572735634 572540779 572144775 571269150
3077.3E71269150r93538o68106o70243o62193k69813k77558q53615q06427k08358q17566
$$ 571269150 570275612 569607506 568937263 568275070 568005257 567727699 566874084 566067657 565859299 565041733
3087E65041733j013870p70989q92563l34396k36359o63872r79118l22800k57492j239929
$$ 565041733 564027863 563256874 562364311 562029915 561793556 561129684 560150566 559827766 559570274 558330345
3096.6E58330345j160126p87391l17726n60990n89256l53546q32672n51873n99708
$$ 558330345 557170219 556382828 556065102 555504112 554914856 554561310 553728638 553176765 552577057
3105.3E52577057q05130n63278l98712o66314j171875j154670p77474n05752p33681
$$ 552577057 551771927 551208649 550809937 550143623 548971748 547817078 547039604 546533852 545800171
3114E45800171m22096m84429p00149l94135j092949j234970q31795p00531o76651p15446
$$ 545800171 545378075 544893646 544193497 543799362 542706413 541471443 540639648 539939117 539262466 538547020
3123.6E38547020o86188q54988p38258j035080j331787p83005l98331p90558q77800
$$ 538547020 537860832 537005844 536267586 535232506 533900719 533117714 532719383 531928825 531051025
3132.3E31051025q41865j089401n75066m10233p92236j143455q05359o08788r70192
$$ 531051025 530209160 529119759 528544693 528134460 527342224 526198769 525393410 524784622 523814430
3141E23814430o04858j055260j109009p26280p93571n35164p80945p56607q47855r22012
$$ 523814430 523209572 522154312 521045303 520319023 519525452 518990288 518209343 517452736 516604881 515682869
3150.6E15682869r76677q89740o14548q94890p22122r42001j007233q02688r62754
$$ 515682869 514706192 513816452 513201904 512307014 511584892 510642891 509635658 508832970 507870216
3159.3E07870216r84497r59587o55517q13103p42874m59709p09534j142006j021004
$$ 507870216 506885719 505926132 505270615 504457512 503714638 503254929 502545395 501403389 500382385
3168E00382385q67347j282349r29794p51458o78558o72760p92427p15065q69827o63948
$$ 500382385 499515038 498232689 497302895 496551437 495872879 495200119 494407692 493692627 492822800 492158852
3177.6D92158852j391449j410599n52750o35948q10013m89883k30332j246147j273460
$$ 492158852 490767403 489356804 488804054 488168106 487358093 486868210 486637878 485391731 484118271
3186.3D84118271j152802j258392l34206o41403r66263r44900p49741k67372m15535
$$ 484118271 482965469 481707077 481372871 480731468 479765205 478820305 478070564 477803192 477387657
3195D77387657r68208j113815q93975j018181o85577q49113q96721q29964j186523
$$ 477387657 476419449 475305634 474411659 473393478 472707901 471858788 470962067 470132103 468945580
3203.6D68945580o73371m61540p20444j072998m75197j65405o98509p82318j075974
$$ 468945580 468272209 467810669 467090225 466017227 465542030 465376625 464678116 463895798 462819824
3212.3D62819824p03010p92542p09267m45899o61889m65812j109925j173935r04350
$$ 462819824 462116814 461324272 460615005 460169106 459507217 459041405 457931480 456757545 455853195
3221D55853195q55255n18684n51834p28150p32727q05321j044387l97492n57518p33032
$$ 455853195 454997940 454479256 453927422 453199272 452466545 451661224 450616837 450219345 449661827 448928795
3230.7D48928795m50707q50296n27115o13899o34041j114273j406288n00793n15862
$$ 448928795 448478088 447627792 447100677 446486778 445852737 444738464 443332176 442831383 442315521
3239.3D42315521p54699q46444n01747n23262o41212m05159m44985k84309q11081j085548
$$ 442315521 441560822 440714378 440212631 439689369 439048157 438642998 438198013 437913704 437102623 436017075
3249D36017075j008034n62706k02255q09060q52737o39343o77986j102562j086884
$$ 436017075 435009041 434446335 434244080 433435020 432582283 431942940 431264954 430162392 429075508
3257.7D29075508m73404j99394m09813r95636q25119o05202q83712o87600l6544m27552
$$ 429075508 428602104 428402710 427992897 426997261 426172142 425566940 424683228 423995628 423959084 423531532
3267.3D23531532r88464k72141l96766r69773l08494Q1978p74422p70683n11895j112213
$$ 423531532 422543068 422270927 421874161 420904388 420595894 420677872 419903450 419132767 418620872 417508659
3276.9D17508659p11174m23050m91600l05366l25432p10068q99810o63262q48579l04756
$$ 417508659 416797485 416374435 415882835 415577469 415252037 414541969 413642159 412978897 412130318 411825562
3286.6D11825562K50129p6332n99747o66694m85954p28570n51719r50241n66864M80156
$$ 411825562 412075691 411999359 411399612 410732918 410246964 409518394 408966675 408016434 407449570 407929726
3296.2D07929726l51143r77059o08139m27131m92020n43175o04057k93274l85323m16412
$$ 407929726 407578583 406601524 405993385 405566254 405074234 404531059 403927002 403633728 403248405 402831993
3305.9D02831993j21498j046753r42612m05616m14124m29840p50465k23694l47786
$$ 402831993 402710495 401663742 400721130 400315514 399901390 399471550 398721085 398497391 398149605
3314.6C98149605o43578p04765p47147l67469m56276m60663m96865m42428m97475o15082
$$ 398149605 397506027 396801262 396054115 395686646 395230370 394769707 394272842 393830414 393332939 392717857
3324.2C92717857n36918m53835o12907q02460n89790r84116m94308j97144q98552o95953
$$ 392717857 392180939 391727104 391114197 390311737 389721947 388737831 388243523 388046379 387147827 386451874
3333.8C86451874p74193n68314k42843n78385q80470o47888k94533m36172q33359j149597
$$ 386451874 385677681 385109367 384866524 384288139 383407669 382759781 382465248 382029076 381195717 380046120
3343.5C80046120m78211l65181p13005o95190n64270j24283q48847j106605n74455
$$ 380046120 379567909 379202728 378489723 377794533 377230263 377105980 376257133 375150528 374576073
3352.2C74576073o06118o00166m48532p63931j285172o17523p98302j311111m67644
$$ 374576073 373969955 373369789 372921257 372157326 370872154 370254631 369456329 368145218 367677574
3360.8C67677574l21388m38118r5711j89972q30154j365090j014328j05400m14543
$$ 367677574 367356186 366918068 366822357 366632385 365802231 364437141 363422813 363317413 362902870
3369.5C62902870p65114m93164r88388r51881p65610p28226p55920r23653p32231n54352
$$ 362902870 362137756 361644592 360656204 359704323 358938713 358210487 357454567 356530914 355798683 355244331
3379.2C55244331k41890l21350l37600n19295n29823n03808q99467m94881m48112k05269
$$ 355244331 355002441 354681091 354343491 353824196 353294373 352790565 351891098 351396217 350948105 350742836
3388.8C50742836j55830m33579l76396p55463n56488l28254q774j58463p41539l50723
$$ 350742836 350587006 350153427 349777031 349021568 348465080 348136826 348128052 347969589 347228050 346877327
3398.4C46877327K31628P897q47168p24678m29497j91460l7307j59760j7052m69436
$$ 346877327 347108955 347116852 346269684 345545006 345115509 344924049 344886742 344726982 344709930 344240494
3408.1C44240494n13306m07219n17654j37482l81m55666m02298J44806K8114k84996
$$ 344240494 343727188 343319969 342802315 342664833 342664452 342208786 341806488 341951294 341979408 341694412
3417.7C41694412n92575j79405j02654n2604O91185J45683O3705N799l96080k01721
$$ 341694412 341101837 340922432 340819778 340767174 341458359 341604042 341667747 341673546 341277466 341075745
3427.4C41075745r9831K36931M04320J75323J1673M02908L47176K78397m9363o79893
$$ 341075745 340975914 341212845 341617165 341792488 341804161 342207069 342554245 342832642 342783279 342103386
3437C42103386o6567N61829Q32481N12238J10779n60188n39322N81779J192322J194305
$$ 342103386 342036819 342598648 343431129 343943367 344054146 343493958 342954636 343536415 344728737 345923042
3446.7C45923042m13704k3765O76002K16637L22571J4114Q46214O35186M42848N80444
$$ 345923042 345509338 345485573 346161575 346378212 346700783 346714897 347561111 348196297 348639145 349219589
3456.3C49219589M07143R97314L42217J71089j91345M09508J216735O55747M44565
$$ 349219589 349626732 350624046 350966263 351137352 350946007 351355515 352572250 353227997 353672562
3465C53672562n4932Q35037J147423R81255N62248l6698O12145M00391O92558M98695
$$ 353672562 353617630 354452667 355600090 356581345 357143593 357106895 357719040 358119431 358811989 359310684
3474.6C59310684J15853P10029R44939J175117J097336Q78945M77790J00823K05574
$$ 359310684 359426537 360136566 361081505 362256622 363353958 364232903 364710693 364811516 365017090
3483.3C65017090J090126Q12034R10187J607476J69639J13297R01909J007957N95131
$$ 365017090 366107216 366919250 367829437 369436913 369606552 369719849 370621758 371629715 372224846
3492C72224846M52156R25446N59120Q43734Q17299Q11539Q83980J118583J579018J100922
$$ 372224846 372677002 373602448 374161568 375005302 375822601 376634140 377518120 378636703 380215721 381316643
3501.6C81316643O45637j94320N78346J167412M45175O63452J803741J387482k81677
$$ 381316643 381962280 381767960 382346306 383513718 383958893 384622345 386426086 387813568 387531891
3510.3C87531891Q73909R25598P86247J019821O20423J380729J061745Q51326Q42590
$$ 387531891 388405800 389331398 390117645 391137466 391757889 393138618 394200363 395051689 395894279
3519C95894279N47600P96242J781578J752853K08436P66601J194687J288757R92661
$$ 395894279 396441879 397238121 399019699 400772552 400980988 401747589 402942276 404231033 405223694
3527.7D05223694J004371J042443R57298R87511M01954J214943Q20961J696129J554184
$$ 405223694 406228065 407270508 408227806 409215317 409617271 410832214 411653175 413349304 414903488
3536.4D14903488l35846J213188J213913J368065R48487J311874J827621J540871J975021
$$ 414903488 414567642 415780830 416994743 418362808 419311295 420623169 422450790 423991661 425966682
3545D25966682J42403J271858N74761J211014K063827J086502K084618n35050Q78411
$$ 425966682 426109085 427380943 427955704 429166718 431230545 432317047 434401665 433866615 434745026
3553.7D34745026J718406J318627K094230N22728J691819J787605J660614O74362J512451
$$ 434745026 436463432 437782059 439876289 440399017 442090836 443878441 445539055 446213417 447725868
3562.4D47725868K147103R42154M216346J036911r95865L82195J12839L255386J198654
$$ 447725868 449872971 450815125 455031471 456068382 455072517 455454712 455567551 458822937 460021591
3571.1D60021591J608391K692795J886253Q06389J542320K625237M99077J982650J788216
$$ 460021591 461629982 464322777 466209030 467015419 468557739 471182976 471682053 473664703 475452919
3579.7D75452919Q86917J855736K246590K061767J046639M505653K371941j464043
$$ 475452919 476339836 478195572 480442162 482503929 483550568 488056221 490428162 488964119
3587.5D88964119J849060n99861K601242K818565K974396K604942R65538L277703j52893
$$ 488964119 490813179 490213318 492814560 495633125 498607521 501212463 502178001 505455704 505302811
3596.1E05302811J701355K929229R21784L459091R76524R7046J555023J552353K197495
$$ 505302811 507004166 509933395 510855179 514314270 515290794 515387840 516942863 518495216 520692711
3604.8E20692711L517036L558045p25823L277130N7869j812858P221031K181549j576996
$$ 520692711 524209747 527767792 527041969 530319099 530376968 528564110 535785141 537966690 536389694
3613.5E36389694M041596j141167K963295M495125Q31871K636337q50487n61638K588082
$$ 536389694 540431290 539290123 542253418 546748543 547580414 550216751 549366264 548804626 551392708
3622.2E51392708K694130K118797K515526K217903J708488N804139P50847q909607
$$ 551392708 554086838 556205635 558721161 560939064 562647552 568451691 569202538 560292931
3629.9E60292931K973251M079704N584259J472588k873573J424522L104286K554093
$$ 560292931 563266182 567345886 572930145 574402733 571529160 572953682 576057968 578612061
3637.6E78612061r346Q66508K416420K486229J352920k11181J025543L232269N873299
$$ 578612061 578602715 579469223 581885643 584371872 585724792 585513611 586539154 589771423 595644722
3646.3E95644722q46596l897362N013199K688561k768593l207855L716545K880516
$$ 595644722 594798126 590900764 595913963 598602524 595833931 592626076 596342621 599223137
3654E99223137L786507O407241p116508m73328M335556J410408J022225l26767J276016
$$ 599223137 603009644 609416885 602300377 601827049 606162605 607573013 608595238 608268471 609544487
3662.7F09544487Q94165J185989J398201M92211L572883J778527N46188J954842q381386
$$ 609544487 610438652 611624641 613022842 613515053 617087936 618866463 619412651 621367493 612986107
3671.4F12986107O28204Q066254Q545799j42059j6753502J699676P024308M237213
$$ 612986107 613614311 621680565 630226364 630084305 613330803 615030479 622054787 626292000
3679.1F26292000k495957j91192K887993J021385P95364L090k29759M664383P865867
$$ 626292000 623796043 623604851 626492844 627514229 628309593 628312683 628082924 632747307 640613174
3687.8F40613174q462486m654007R244614n851593j975556N226403L02276J155396
$$ 640613174 632150688 627496681 636741295 630889702 628914146 634140549 634442825 635598221
3695.5F35598221l7537p48176N61599L18413L135758L511657m213485l221016L888206
$$ 635598221 635560684 634812508 635374107 635692520 638828278 642339935 638126450 634905434 638793640
3704.1F38793640J435928l66897k4071K654915N252533o448822L022232N999603j2858886
$$ 638793640 640229568 639862671 639838600 642493515 647746048 641297226 644319458 650319061 637460175
3712.8F37460175K299194L559723m74472j65253K229157J971817l629380M58374O007386
$$ 637460175 639759369 643319092 642844620 642679367 644908524 646880341 643250961 643709335 649716721
3721.5F49716721l320389n513077M737244J032943r83963k820587k0370L991317J196290
$$ 649716721 646396332 640883255 645620499 646653442 645669479 642848892 642828522 646819839 648016129
3730.2F48016129N876388k411652p830200R449845J950531r523850l43017K133483
$$ 648016129 653892517 651480865 643650665 653100510 655051041 645527191 645184174 647317657
3737.9F47317657n92117J557007L749161m339371J083756J3086853k997284j9809037
$$ 647317657 646725540 648282547 652031708 647692337 648776093 661862946 658865662 639056625
3745.6F39056625P328110M782028O526108k018356j0792923J1111145m645157q170624
$$ 639056625 646384735 651166763 657692871 655674515 644881592 655992737 651347580 643176956
3753.3F43176956M658661M034042L877640n335769J547699O474304p002716l727341
$$ 643176956 647835617 651869659 655747299 650411530 651959229 658433533 651430817 647703476
3761F47703476L147888J651077O54602L596650k210312n045395K884826N101243R77249
$$ 647703476 650851364 652502441 653157043 656753693 654543381 649497986 652382812 657484055 658461304
3769.7F58461304q438187R84726K993011l61175N40390n3329N21774L14178K531586
$$ 658461304 650023117 651007843 654000854 653639679 654180069 654126740 654648514 654962692 657494278
3778.4F57494278O10962p033081J599045J896743L31726K794419k154389k147750J115875
$$ 657494278 658105240 651072159 652671204 654567947 654899673 657694092 655539703 653391953 654507828
3787.1F54507828J204605N02243q89740M49524K72827j50986n29937J345901M416504
$$ 654507828 655712433 656214676 655324936 655774460 656047287 655896301 655366364 656712265 661128769
3795.8F61128769l204269n018693J356278M427032Q050843m098511j2088394J302643
$$ 661128769 657924500 652905807 654262085 658689117 666739960 662641449 650553055 651855698
3803.5F51855698J884994M751969P138443p226792o695404L804321K142334O0120j53503
$$ 651855698 653740692 658492661 665631104 658404312 651708908 655513229 657655563 657715683 657562180
3812.2F57562180n98145R16061O324845M38766j5635605L942185N967865M788437L792953
$$ 657562180 656964035 657880096 664204941 664643707 649008102 652950287 658918152 663706589 667499542
3820.8F67499542j7170105l0899N457382K057267K425003K69165l610535n80139J687546
$$ 667499542 650329437 650298538 655755920 657813187 660238190 660507355 656896820 656316681 658004227
3829.5F58004227L995590K235870q838119J682129O927795o107101o99845Q135834
$$ 658004227 661999817 664235687 655397568 657079697 664007492 657900391 657200546 665336380
3837.2F65336380q661270l160477R493332n721893k185440O241073j900177m019165
$$ 665336380 656675110 653514633 663007965 657286072 655100632 661341705 659441528 655422363
3844.9F55422363J982117J384888n21698J660461q55331J577224O930695l526230K895813
$$ 655422363 657404480 658789368 658267670 659928131 659072800 660650024 667580719 664054489 666950302
3853.6F66950302j6472626j542129J1027069j204224k745132J888809K678375L105927
$$ 666950302 650477676 648935547 659962616 658758392 656013260 657902069 660580444 663686371
3861.3F63686371n582504M32357Q221131n475922p547989K829590M430847P285691
$$ 663686371 658103867 658536224 666757355 661281433 653733444 656563034 660993881 668279572
3869.1F68279572l578797j0790558J073532N287095N071487r117661p30056M121780
$$ 668279572 664700775 653910217 654983749 660270844 665342331 656224670 655494614 659616394
3876.8F59616394n05829J611023M664536m784699p640381N978623J951599K068405
$$ 659616394 659110565 660721588 665386124 660601425 652961044 658939667 660891266 662959671
3884.5F62959671N666351j4108810r47418L391723J353760N669098N96161p641754
$$ 662959671 668626022 654517212 653569794 656961517 658315277 663984375 664580536 656938782
3892.2F56938782N68313L036042k727204j52511J508636L184433L284683j0744018
$$ 656938782 657507095 660543137 657815933 657663422 659172058 662356491 665641174 654897156
3899.9F54897156L270111K661972n004273O509858k078400l375473J3275K88086K482758
$$ 654897156 658167267 660829239 655824966 662334824 660256424 656880951 656894226 657182312 659665070
3908.6F59665070J14517j17340l99399r0790M83017l45917Q88672K448425k206497
$$ 659665070 659779587 659662247 659262848 659172058 659655075 659309158 660197830 662646255 660439758
3917.3F60439758l984070L527833j60141m347229J996154K002335J506195j864548
$$ 660439758 656455688 659983521 659823380 655476151 657472305 659474640 660980835 659116287
3925F59116287l257293J471099J299897J258010j197662j113357K815475j256790j578217
$$ 659116287 655858994 657330093 658629990 659888000 658690338 657576981 660392456 659135666 657557449
3933.7F57557449J283341k97165o6986N59158o76193j113892k49786K357178K348327
$$ 657557449 658840790 658543625 658476639 659035797 658359604 657245712 656995926 659353104 661701431
3942.3F61701431m317550j594391K088775J070328J362915k099914N9738J010284k273636
$$ 661701431 657383881 655789490 657878265 658948593 660311508 658211594 658271332 659281616 657007980
3951F57007980Q51593L41721O8741L26538j55716M29916q13751l1891j21078M10309
$$ 657007980 657859573 658201294 658270035 658596573 658440857 658870773 658057022 658025131 657904053 658314362
3960.7F58314362J60064j393127N82352K73513o48651L6621O04248M25492q65479p73773
$$ 658314362 658474426 657081299 657663651 657937164 657288513 657325134 657929382 658354874 657489395 656715622
3970.3F56715622M87671R85718O41403M196n92728o51779m62265J45340P2174k72598
$$ 656715622 657203293 658189011 658830414 658834610 658241882 657590103 657127838 657273178 657345352 657072754
3980F57072754K68936Q2550q7128M93393O49872q98742q38089K55737J4725Q01925
$$ 657072754 657341690 657424240 657337112 657830505 658480377 657581635 656743546 656999283 657014008 657815933
3989.6F57815933k84424p34710k8611o9885R55963J13907l70865J47858M00238J73950
$$ 657815933 657531509 656796799 656768188 656698303 657654266 657768173 657397308 657545166 657945404 658119354
3999.2F58119354m78821
$$ 658119354 657640533
4000.2F57640533
$$ 657640533
##END=$$ End of the data block
