##TITLE=$$ Begin of the data block
##JCAMP-DX=5.00 $$ ACD/SpecManager v 10.08
##SPECTROMETER/DATA SYSTEM=Varian
##DATE=04 Dec 2012 13:51:34
##DATA TYPE=INFRARED SPECTRUM
##DATA CLASS=XYDATA
##ORIGIN=
##OWNER=
##NPOINTS=3735
##FIRSTX=399.26403809
##LASTX=4000.35498047
##MAXX=4000.35498047
##MINX=399.26403809
##MAXY=75.32975769
##MINY=34.24131393
##XFACTOR=1.0000000000
##YFACTOR=0.000000100000000
##FIRSTY=65.43884277
##DELTAX=0.96440572
##XUNITS=1/CM
##YUNITS=TRANSMITTANCE
##XYDATA=(X++(Y..Y))
399.3 654388428 651207275 643545837 639074707 638719902 637039337 629741821 624931717 618980446 610591774
407.9 610591774 612463417 620829468 620710793 620963364 625028000 624600945 626980515 627621536 625809364
416.6 625809364 636096344 649838181 647012024 638120346 628254509 622429924 616586113 615530319
424.3 615530319 619982872 623396416 623121262 621105919 620883827 620170441 614883842 613594246 617178116
433 617178116 617569962 620422401 621743202 618629265 621815529 623655815 623319931 623326340 622097702
441.7 622097702 619113274 614717216 615200005 614379272 613779259 618887787 621689262 620576744 618069038
450.4 618069038 620083504 620986099 620612144 622481499 624132423 628847237 628062057 623434181 624212189
459.1 624212189 620236855 618045311 621336136 620723572 617698860 618862000 621206970 621322021 619887085
467.7 619887085 618378639 618769226 620203438 620395050 617334099 615202141 613796577 613999481 612927818
476.4 612927818 608218918 608151970 608137932 607127533 604951248 602430878 607007675 605907021 602565689
485.1 602565689 604883385 604670525 606552811 609138908 609189835 606244164 602173920 603335915 602262764
493.8 602262764 599250641 600586395 600668678 599996910 602105560 601690903 598990440 595509186 591575928
502.5 591575928 591664200 592966766 593790627 592379036 589384689 587418823 587653198 589228821 588571968
511.1 588571968 587325363 586263008 585099678 583373070 582158432 580794144 578518181 578885307 577947922
519.8 577947922 576038628 574293137 573125763 574948807 576172562 574249268 570266266 570127678 571931343
528.5 571931343 573745079 574361420 573004913 573412857 574626312 576368332 576690598 575108452 577130966
537.2 577130966 580111885 580096283 579464264 581137199 584564018 585433311 584246254 584158974 583984032
545.9 583984032 585662117 587454224 585266876 581949120 580163383 580837288 582655525 584239845 583446236
554.5 583446236 580695953 579803886 579701042 580580864 580627365 578883209 578305969 577853050 576665154
563.2 576665154 574724083 573238144 571601944 569993973 568950615 567589989 567348289 565870857 564122925
571.9 564122925 563066826 562838097 562011871 559033394 558752518 559392929 560507011 561189003 561226578
580.6 561226578 563343201 565925713 568253365 568575363 569260292 571248970 572481384 571957474 572797203
589.3 572797203 576066170 576330414 576153336 577707329 578080215 576639786 575699348 577190552 578643837
597.9 578643837 579070358 578857040 579971046 581159973 580065994 578367729 577015762 576901169 578991623
606.6 578991623 581176338 580765343 580878525 581598701 580616837 579110489 578033905 579120255 581370735
615.3 581370735 583889351 585079231 586215897 587948570 587549896 588752403 591771088 593920288 594745865
624 594745865 595633583 597054138 597413139 599176750 601155167 601582298 602426147 603914642 605138397
632.7 605138397 605890503 606688194 607441292 607786865 607550774 608656235 610354195 611003418 612184944
641.3 612184944 612367020 611725006 611901245 612101860 613207130 614870834 614723511 614535446 615959244
650 615959244 615952377 615343246 615479202 615476494 616035271 616615753 617928047 618890648 617383804 616198807
659.7 616198807 617089119 618226318 618053856 618019218 619843636 621101418 620502892 618109779 610626450
668.3 610626450 614559975 618927612 620383682 620685081 620972786 620843163 621792526 623200722 623310890
677 623310890 622097664 621334076 622555428 624102631 624531517 625023727 626049805 626128044 626139183 627122078
686.7 627122078 627286530 627014389 627070541 627059250 627001457 627695389 628946953 628895988 628582687 627786102
696.3 627786102 626390076 625712585 624456520 623602753 623452988 622818794 621235771 619423676 619716072
705 619716072 620336685 619846306 619550819 619219856 619068718 619603844 620612526 621379547 622187233 622647285
714.6 622647285 622577095 623725319 625179138 625474319 625694771 626391716 627548981 629347382 631138153
723.3 631138153 633440475 635850067 637243958 638424873 639207573 641069183 643336487 644200287 645268478
732 645268478 646852264 648563232 649564438 650891495 652590332 652876282 653199844 654455719 656074371
740.7 656074371 657180405 656934891 656530533 657258911 657714157 656844635 655868530 655725250 655096436 654247818
750.3 654247818 654577484 653119354 650464706 649339142 648202591 646927567 646203842 646496353 646811371
759 646811371 646044159 646023483 645912628 644930649 645284500 646423874 646732941 646779785 647461929 649142685
768.6 649142685 650745163 651569672 653530197 656157227 657535934 658585358 659566879 659899597 661525269
777.3 661525269 664661484 666494751 667277451 668783340 671052399 672398376 672783966 673650131 674249420
786 674249420 674946213 676334076 677343903 678371201 680411987 681841736 682090836 682445984 683493652
794.7 683493652 684792099 684803772 685283508 686678543 688092422 689542999 690061646 690766144 691826782
803.4 691826782 692990723 693188400 692634201 692856598 693449097 694436035 695749817 697710571 698833160
812 698833160 698929977 698675995 698608017 698686523 697661972 698010559 699155502 699895706 699379120 698378677
821.7 698378677 699233704 699155502 698138580 696926193 695771255 694859695 694312286 694504318 694010925
830.4 694010925 692871399 691040421 689725037 688461075 686772614 685629654 685029602 684873734 683650360
839 683650360 682344742 681429672 680627441 679224014 677552414 676999207 675435181 674412231 674868317
847.7 674868317 674784851 674261093 673493576 672480698 671870804 671783218 670575714 669998703 670726471 671011887
857.4 671011887 671189194 671424713 671555023 670758514 671439667 673606720 674480362 675566483 677101135
866 677101135 678665695 680550079 682906647 685255280 686974564 688743591 690507889 691319351 691921616
874.7 691921616 693976135 696230469 697613373 697482147 696752319 696516571 696332932 695904083 694479141
883.4 694479141 693618393 692038269 689718552 688404694 687440796 686663208 684637985 682666473 681634445
892.1 681634445 680787964 679297333 676942139 675386047 674134903 673551483 673197250 672015839 670961761
900.8 670961761 669513550 667614288 666623764 666246338 664983521 663350296 661918640 660416794 658958817
909.4 658958817 656783752 653952637 651356659 649003220 647499161 645810318 642841110 640575562
917.2 640575562 638582573 636284828 633849907 631628914 630383949 628840370 627525215 626339264
924.9 626339264 625280495 625089722 624991646 625024376 624216232 623041992 623052444 623791733 624783630 625165977
934.5 625165977 625231400 626264572 627415581 627992668 628437500 628597260 628807678 629894600 631709518
943.2 631709518 632668724 632798462 633801804 634194298 633367805 632730598 631036530 628046494 625623589
951.9 625623589 624479370 623121796 620619507 617683334 615317993 612391472 608221626 604753456
959.6 604753456 601501541 597603035 592951508 588632431 585001488 580991478 576839104 572087975
967.3 572087975 566861687 561286240 555978394 550322151 544243584 538417320 531511154 524419975
975 524419975 518141327 512026596 505021553 497821426 490289993 483663788 477669792 470470810 464543724
983.7 464543724 459138184 454534798 449786949 445068436 441032562 436644936 433776436 430819969
991.4 430819969 428375511 426283493 424463387 422864418 421457634 420763397 419714737 419803963 419161148
1000.1 419161148 418669968 418353119 418175507 418261948 417077789 417028465 416225166 415009766 413707314
1008.8 413707314 412335587 410833931 409244919 408692169 406522865 404249458 401895828 401055260 400861969
1017.5 400861969 399766159 399339180 398759537 399038315 397862511 397814255 398088074 398085556 398676033 398374062
1027.1 398374062 399919090 399975853 400960693 402419205 402957497 403442116 403160248 404240990 403921852
1035.8 403921852 405118370 406210442 406381912 406858215 406353455 406416283 406275978 408014755 407845802
1044.5 407845802 407740402 408672791 408435745 409182091 409481773 410959854 411061172 411954651 414093742
1053.1 414093742 416621628 419645996 420976143 423175888 424900970 428126221 431044273 433739471
1060.9 433739471 436828346 439439430 443899918 447147827 450918655 453935356 456330566 457341881
1068.6 457341881 456264305 455202332 451945343 448942909 444563103 440913391 437778053 433844109
1076.3 433844109 431920738 429623489 429030037 428155174 427577019 427338638 427827988 428858719 430064812
1085 430064812 433798332 435041656 436666183 438705559 440763283 443582687 446147919 449199181 450130806
1093.6 450130806 452293701 454671822 456876450 458149185 458523903 459697075 460103569 462114716 462446365
1102.3 462446365 462565231 463208237 463861465 465116425 465190430 467551346 469057846 469849129 471152840
1111 471152840 472835884 475287476 476599388 477537537 477614708 478640862 479502258 480678406 481958771
1119.7 481958771 482394676 484231186 485418053 486456718 487433624 489109535 490914955 492602196 494115295
1128.4 494115295 494378548 496118011 497667961 498670082 498716316 498717728 499458847 498658905 497693367 496416931
1138 496416931 495502052 493756523 491317787 488680267 486276283 484916649 481924515 479715996 477234459
1146.7 477234459 475117645 473145065 469857750 468087616 465977058 464503059 462792130 461723938
1154.4 461723938 461182899 460239830 460239296 459772301 460370369 461038475 462666664 465071907 467778969 470199013
1164 470199013 471975555 475552940 479045067 483011475 487197838 491631126 495984116 500221024 505672379
1172.7 505672379 510545807 515014420 519361725 524224663 528500595 532171097 536470909 540625954
1180.4 540625954 544728928 548663368 552739716 556299629 559533730 562467232 564886322 567692299
1188.1 567692299 569924622 571104698 572527351 574633675 576064720 577096748 578288002 579245377
1195.9 579245377 580133324 580276642 580481949 581165771 581333885 581420288 581874084 582617226 583366470 583779984
1205.5 583779984 584033089 584909897 585727997 586228447 587251549 588163261 588911133 589863205 590755997
1214.2 590755997 591332970 592019577 592778511 593227921 593602600 593437653 593142624 593196831 592894936 592338486
1223.8 592338486 591901855 591512604 590762672 589791603 588992538 588001862 586686211 585826874 585295448
1232.5 585295448 584181480 583558655 583450890 582932014 582330513 581984749 581708183 580967026 580663528
1241.2 580663528 580890045 580969315 581071167 581489716 582231865 583140945 584120178 584531784 584979401 585845528
1250.8 585845528 586811905 587747536 588498192 589331360 589939842 590379753 591205902 592197533 592676353 593257790
1260.5 593257790 593985214 594476166 595455513 595950775 596048203 596774406 597792740 598919563 599734192
1269.2 599734192 600542107 601621132 602344284 602813377 603381882 604128609 604885330 605076942 605257568
1277.8 605257568 605866928 606480293 606829185 606853714 607259636 607992020 608556747 609025688 609631767 610335045
1287.5 610335045 610664215 610713158 610737381 611099930 611297722 611114922 611222076 611411667 611303101 611043777
1297.1 611043777 611058388 610926781 610666847 610696831 610528984 610049896 609704361 609722824 609656105 609231644
1306.8 609231644 608848572 609164467 609522362 608872757 608288574 608431587 608566513 608250694 607693863 607247925
1316.4 607247925 606746407 606219711 605823746 605277901 604968681 604963951 604467010 603833847 603304062 602509193
1326 602509193 602029991 601950455 601443443 600354271 599389801 598704567 598093452 597590332 597354660 597383957
1335.7 597383957 596828880 595789261 595673485 595477562 594584465 594767418 595431213 595929298 595888634 595382080
1345.3 595382080 595267372 595483360 595552940 596001015 596433945 595759392 594636879 594099960 594112358 593605156
1355 593605156 592551956 592107658 591911812 591623192 591524849 591146774 590344543 589645195 588502884 587858696
1364.6 587858696 587578278 586757889 586452904 586292763 585817528 585725822 585520668 585754509 585824127 584976807
1374.3 584976807 583592758 582985077 583148766 582617340 582725182 583564873 584454155 585090790 585588531
1382.9 585588531 586544571 587011337 587909584 589500046 590692825 591847687 593086548 594052277 594629898
1391.6 594629898 595012703 596037407 595953217 593826408 593453445 593593674 594455109 594081001 593011360
1400.3 593011360 593383026 593279953 593463058 594053688 593578262 592706642 592643394 592790375 592904396 592872276
1409.9 592872276 592581406 592018700 590864029 590630493 590386162 590178528 590469780 590284653 590944023
1418.6 590944023 588934593 589393806 591295547 592243156 593003693 591624413 591911087 593244209 593657684
1427.3 593657684 593925247 593967743 593324242 592527657 592830658 592394562 591946831 592877274 594262123 591567612
1437 591567612 589803085 591483727 591314545 591184616 591367302 591014824 590901489 590126419 590140266 590180893
1446.6 590180893 590245399 588195305 587379494 587756233 586843147 585739212 583825340 583966103 583880806
1455.3 583880806 583667793 581225815 577620125 580390701 580373344 582453003 582701988 583153267 585591316
1464 585591316 584489975 584508209 585491638 589613380 593774605 599728012 606670609 612128181 619763260
1472.6 619763260 623150749 628217697 632452354 635201797 637260170 640549164 644170303 647043991
1480.3 647043991 649909058 650703354 652439117 653784027 655139313 657670746 658288574 658626709 660048523
1489 660048523 661424713 659419174 659282074 660555344 660609283 661656876 662640152 658770294 659343567
1497.7 659343567 659864120 657819061 658899612 659129410 657477341 656969223 658196411 660454025 657949982
1506.4 657949982 649620667 649113693 650539932 649419327 649402847 648288727 644744339 644891052 644473190
1515.1 644473190 644496384 643502808 638661804 641787033 644993362 644626999 642749252 641073303 642644119
1523.7 642644119 644563522 643134155 642070923 642659912 641505432 640949326 641843109 642242737 643262787
1532.4 643262787 642761383 637792053 638412552 639249535 640045166 642733536 643274002 636838112 638706055
1541.1 638706055 638868179 637728500 639623299 640436249 639023857 640448914 641831360 643414917 644922409
1549.8 644922409 643281479 644429321 646536331 648557281 648809052 648702316 653283768 658269577 657707825
1558.5 657707825 655192947 649955978 654231949 657005081 658966827 660404053 659846268 660384750 662048721
1567.1 662048721 664066544 665840302 662063675 662347260 665026627 665591202 665699234 667502441 668708115
1575.8 668708115 662079773 663041229 665239105 665163498 664883499 664090424 663813477 663339157 662521896
1584.5 662521896 661632614 660690460 660291672 659122543 658220062 656775513 655691833 654247437 652844238
1593.2 652844238 651860123 649674454 648669281 647088623 645819702 644159393 642025070 640187607
1600.9 640187607 638264885 636969528 634424553 632628937 630763435 628961906 626528015 624626122
1608.6 624626122 622580261 618918381 617537766 614634514 612046661 609331932 608544731 608769226 597465706
1617.3 597465706 596504135 595221214 593231773 590725784 589880333 588452797 580577621 579085503 577606239
1626 577606239 577080078 573067131 568615074 567269135 564641495 562450256 559777985 559963837 560437698
1634.6 560437698 555388031 551426582 551041794 549537239 548268509 548366966 546798668 546894646 545817604
1643.3 545817604 546510582 548309746 545823326 545453758 543361702 544935226 545706520 548226814 553228073
1652 553228073 556288948 548161659 546320686 548879242 550223885 551676483 552808418 554300117 556086807
1660.7 556086807 558085175 560644798 560017586 562580376 564759865 566570816 569222450 572180367
1668.4 572180367 573452263 574053230 577938309 578699379 581286469 585459862 587446823 587040100 589145508
1677.1 589145508 592207184 594567947 597237206 597612228 600439529 605883522 608581009 604910965
1684.8 604910965 605469322 609929619 613125648 614892960 617368813 618663750 620266075 622387047
1692.5 622387047 624924660 628488159 632331200 630271988 631838608 635849724 641011658 643915710
1700.2 643915710 635279274 639786148 643636246 645203629 644447174 644512939 644276352 644367447 645589905
1708.9 645589905 645441208 645070114 645713806 646950607 648699799 648526840 647959442 651000977 655418625
1717.6 655418625 650623550 650019684 652255020 653758087 654897232 654836121 654039841 653479538 652661972
1726.3 652661972 651557312 650797272 651066055 648592682 644792328 644887161 646351624 642873154 629578438
1734.9 629578438 629123955 628801575 626105423 624536057 620577660 613619919 612775917 612926636 609705200
1743.6 609705200 608235092 609101105 611142082 613648376 616932907 621967888 628035049 635724983
1751.3 635724983 640896149 649179993 656975937 664202652 672129364 677480698 683945236 689629822
1759 689629822 694745483 700021973 703213501 706149902 709983139 713031769 715099335 718006363 720734711
1767.7 720734711 720079269 721803055 725572586 727294083 725566406 724003067 726987000 729390793
1775.4 729390793 728983536 730413895 731421890 732550888 733510895 732690353 733389740 734420624 735646515
1784.1 735646515 735312881 734773407 736299286 736896820 737374420 738812180 739987030 741340866 739096985
1792.8 739096985 737141418 739515076 740564651 739398804 740166931 742514572 742759323 741201477 742209015
1801.5 742209015 742080994 742134171 743099289 742819214 743176346 743796921 743438263 744296112 745750809 744175262
1811.1 744175262 743882370 744889221 744987564 745581589 745327454 745417862 745214081 745433731 746587372 746696243
1820.8 746696243 747381821 747232513 748025055 749881439 747241135 746132507 747775497 749611816 750224075
1829.4 750224075 746866913 747000275 748805923 749101791 749107895 748671188 748778458 749218826 748736420 749025421
1839.1 749025421 749407196 750126495 750373917 751627808 753105469 748064194 747957764 749685669 749811554
1847.8 749811554 749579773 749686813 750090637 750092392 750484238 750529022 750605087 750506744 750164795 750501785
1857.4 750501785 750499115 750511246 750588150 751033936 750893860 750669479 750916595 750967560 751540375 751413193
1867.1 751413193 751985855 751664658 749604950 750149078 751024170 751140289 750697861 750660934 750752258 750804977
1876.7 750804977 751015701 751034927 751114273 751050644 751285477 751268845 751337738 751397400 751337509 751508484 751199112
1887.3 751199112 752376709 753297577 751046295 750618668 751434097 751535873 752058182 752010880 750938873
1896 750938873 750951691 750923920 750831833 751110992 751195450 751204987 751329422 751609879 751302795 751028061 751104584
1906.6 751104584 751219330 751280060 751498337 751371536 750994873 751697769 751640244 751493759 751419220 751313095
1916.2 751313095 752694092 751355972 749788971 750711060 751297760 752115402 751704559 750510025 750973663
1924.9 750973663 751395035 750941467 750894547 750753937 750563965 750673676 750603561 750855026 750607147 750249557
1934.6 750249557 750041428 750064240 750252914 749891129 749798813 749671478 750666428 751364136 749296036 749226379
1944.2 749226379 750164642 749835587 749714127 750358276 750270844 749685059 749347610 749291763 749646988 749829712
1953.8 749829712 750024567 749994125 749928055 749805984 749350891 749469070 749522095 749294510 749223633 749309845
1963.5 749309845 749388351 749517670 750001068 749680862 749054718 749231339 749285660 749319687 749387283 748945084
1973.1 748945084 748644409 748766098 748973236 748959885 748670654 748643036 748630676 748572311 748574829 748388214 748160629
1983.7 748160629 748160858 748518524 748887482 749263763 749027710 748235855 748370209 748820267 748339691 748020554
1993.4 748020554 748205185 748034210 747873535 747663193 747655258 747854462 747449112 747155685 747126389 747375793
2003 747375793 747483902 747214890 747124481 746924820 746671219 746362991 746221161 746112137 746092682 746112823
2012.7 746112823 745990906 746170273 746164551 745938568 745551376 745447998 745193863 744795837 744890900 744621277
2022.3 744621277 744729614 744851913 744603119 744310303 743868179 743994751 744027786 743722229 743115082 742851868
2032 742851868 742875366 742705078 742837448 742709274 742648926 742542648 742348404 742300644 742284851 742168579 741912918
2042.6 741912918 742220535 742240067 742177887 741881180 741208496 741265564 741101303 740895081 741239014 741685410
2052.2 741685410 741625366 741341476 741181335 741023483 741244049 741036530 740770416 740772781 740654526 740667801
2061.9 740667801 740622940 740824051 740878143 740491257 740319595 740498276 740619583 740660477 740796738 741046143
2071.5 741046143 741186905 740804291 740635986 740621109 740377502 740290756 740332870 740209656 740111465 740580292
2081.1 740580292 740722733 740627899 740717392 740549545 740437546 740493240 740564117 740258789 740043488 740092697
2090.8 740092697 740249557 740383911 740390472 740600739 740410690 740176926 740129395 740063858 740094147 740304642
2100.4 740304642 740337677 739875412 740025406 740085144 740087967 740373001 740129623 739996948 740054245 740158997
2110.1 740158997 739712219 739574432 740085678 740030975 739978180 740004272 740094070 740025406 739811783 739761581 739703903
2120.7 739703903 739876556 740375748 740556030 740039978 739870834 739673767 739467926 739565582 739495163 739731674
2130.3 739731674 739674377 739708633 739991684 739962463 739914551 739825058 739575729 739013824 738806305 738920593
2140 738920593 739205170 739533768 739473419 739354858 739346313 739333572 739153061 739311981 739436493 739371033 739468155
2150.6 739468155 739462967 739432678 739279480 739302139 739041367 738899155 739413223 739839020 739970474 739672852
2160.2 739672852 739469910 739139481 738991241 739456711 739781265 739858322 739957352 740151367 739929352 739868240
2169.9 739868240 740158081 740408249 740293274 739878616 740022049 740049286 739949646 740074387 740542908 740734863
2179.5 740734863 740492477 740817261 740826721 740719528 740563812 740312271 740430679 740837708 741530457 741449051
2189.1 741449051 741097488 741021271 740975037 740724411 740657959 741226501 741197586 741040497 741127701 741122284 741184540
2199.8 741184540 741341400 741574478 741435547 741241074 741325150 741758194 741983871 741942368 742032089 742191849
2209.4 742191849 742233810 741845398 741832733 741926117 741672897 741418839 741506577 742007141 742347641 742474899
2219 742474899 742334671 742610092 742710876 742333298 742346649 742289124 742126083 741756744 741804581 742055588
2228.7 742055588 742228546 742696915 742755585 742491455 742144623 742215424 742201843 742015152 742072067 741989212
2238.3 741989212 742119904 742148056 742008591 741838074 741749191 741419144 741101379 741294098 741356964 741661224
2248 741661224 741989517 741974640 741584930 741526260 741882706 741644669 741525116 741696243 741859283 741490326
2257.6 741490326 741332321 741760101 741740952 741734314 741649857 741514435 741254425 741276932 741398239 741293869
2267.3 741293869 741601181 741658707 741726227 741298447 740879669 741297379 741380920 741246948 741296082 741559372
2276.9 741559372 741447830 741198730 741118774 741154099 741193161 740958786 740693054 740630035 741130981 740872879
2286.5 740872879 740586395 740684128 740373001 740507355 740464020 740958176 740834656 740171814 740255127 739932251
2296.2 739932251 740108719 740215988 740148087 739795532 739587479 739854126 739429092 739351044 739267044 739216766
2305.8 739216766 738767548 738379135 738523483 737937317 737855072 738035507 738022385 737081299 736732788 737553329
2315.5 737553329 737040100 736571045 736188812 735968018 736116257 735734558 735029602 734688110 735045929 735252380
2325.1 735252380 735787888 735620728 735296860 734681091 733361969 733259659 733687820 734813232 734788437
2333.8 734788437 733452301 732385254 732170181 733216095 733832626 733885040 732926636 732154999 732211838
2342.5 732211838 732367630 732281876 731824570 731866837 731715317 732576752 733937378 733852005 732650757 731941223
2352.1 731941223 731756363 731180191 729886169 729218216 730119934 729968109 728652191 728338013 728452072
2360.8 728452072 728715820 729450989 730124054 728620758 727008667 727211456 728206406 729648666 730268326
2369.5 730268326 729982224 729804153 730365143 730818100 731362457 732358475 732673187 732414780 732272797 732185822
2379.1 732185822 732034836 732693863 733492737 733555450 733759232 734236526 734576797 734316177 733738022 733375778
2388.8 733375778 733403549 733636627 733616486 733648071 733629150 733606644 733644638 733325272 732904282 732780685 732884827
2399.4 732884827 732787399 732477493 732221832 732295532 732541046 732298965 731687927 731610413 731793976 731420822
2409 731420822 731019440 730969391 731254425 731197205 730672379 730449066 730329208 730362015 730167465 729888382
2418.7 729888382 729996719 730003967 729871368 729721603 729651642 729583664 729617462 729331284 728902512 728840332 728651428
2429.3 728651428 728403091 728163681 728247223 728118668 727591476 727379227 727440186 727665100 727332993 727159805
2438.9 727159805 727387772 727132339 726700211 726220932 725994949 726007233 725881500 725650330 725763474 725712280
2448.6 725712280 725277634 725186386 725149689 725097046 724910812 724892883 724789200 724277344 724129410 724116745
2458.2 724116745 724080963 723666229 723092728 723125153 723636169 723771744 723180847 722807693 722641296 722360687
2467.8 722360687 722058868 722336731 722649918 722210464 722113647 721999817 721641617 721535416 721353226 720922165
2477.5 720922165 720800476 720844269 720413895 720476303 720676804 720450745 720084610 719853210 719891891 719686737
2487.1 719686737 719817657 719981003 719729767 719238358 719270859 719690399 719201813 718946152 718670273 718450699
2496.8 718450699 718742294 718212433 717932205 718392563 718508530 718196945 718167572 718105698 717783356 717693405
2506.4 717693405 717409058 717167587 716973419 716796341 716727524 716698608 716803741 716393509 716038589 716059875
2516.1 716059875 715907288 716123886 716459198 716332245 716204071 716128464 715951233 715523605 715190048 715389786
2525.7 715389786 715237885 714961319 714664001 714256973 714406433 714461899 714506760 714263000 713691025 713611069
2535.4 713611069 713571625 713474045 713405151 713415222 713242111 712841034 712545547 712311172 712155533 711998291
2545 711998291 711891708 711839676 711949158 711735382 711370163 711316452 711062469 710923843 710643234 710408707
2554.6 710408707 710573349 710548248 710509491 710345840 710058289 709899521 710019684 710187378 709827652 709261780
2564.3 709261780 708833313 708424149 708319931 708478775 708350525 708053131 707607880 707274780 707308960 707215500
2573.9 707215500 706932144 706755066 706978226 707115250 707040329 706766281 706206436 706146851 706095200 705787125
2583.6 705787125 705578384 705275955 705172501 705120316 704929047 705067444 705266800 704863815 704321289 704158783
2593.2 704158783 704338760 704238663 703969650 704009857 703632812 703504791 703451309 702810898 702734375 702767410
2602.9 702767410 702266693 701958466 702032242 701838379 701767807 701860886 701365814 701123657 701164093 700912018
2612.5 700912018 700524826 700213470 699946899 699501343 699281082 699039459 698608170 698688812 698756027 698303757
2622.1 698303757 698102798 697649078 696919098 696912613 696922531 696910324 696938171 696641769 696096497 695412598 695149078
2632.8 695149078 694978638 694821167 694653244 694413223 694335022 694156494 693831406 692979584 692220688 691975784
2642.4 691975784 691847839 691761780 691325150 691064529 691055069 691061554 691041489 690719223 690418015 689750137 689152985
2653 689152985 689160156 688599701 688083954 688213730 688121643 688236771 688008728 687269974 687070389 686814499
2662.6 686814499 686507416 686265106 685875168 685504532 685055084 684761963 684639206 684598999 684185104 683857956
2672.3 683857956 683931808 683535995 683572922 684130096 684012604 683200150 682362442 682134705 681853256 681250687
2681.9 681250687 681066208 681158829 681278458 681140289 680551376 680308685 680394592 680180740 679826508 679477768
2691.6 679477768 679240265 678925171 678590469 678618469 678731537 678734741 678706894 678432846 677763290 677343521
2701.2 677343521 677267990 676769485 676405716 676628418 676476974 676128540 676154251 675973053 675491714 674890976
2710.9 674890976 674335251 673899307 673673401 673862839 673714371 673301239 673211670 673021317 672644272 672413483
2720.5 672413483 672127075 671686172 671577759 671202698 670777359 670973816 670750809 670190964 669642868 669296265
2730.2 669296265 669282303 668963699 668698883 668533173 668333435 668560562 668795319 668419571 667757874 667322311
2739.8 667322311 667044296 666878586 666644821 666152878 665835953 666005859 666387787 666688232 666743317 666212082
2749.4 666212082 665403442 664956055 664574509 664060822 663721161 663672028 663660507 663422165 663292313 662938766
2759.1 662938766 662242050 662045059 662003403 661767349 661612701 661772079 661904221 661433563 661019592 660688553
2768.7 660688553 660367050 660458450 660437241 660315857 660337601 660159760 659605713 658893738 658238373 657732239
2778.4 657732239 657566299 657678452 657386093 656675262 656224594 655721588 655300674 655288162 655328217 655278854
2788 655278854 654908829 654526367 654311752 653751755 652926636 652672043 652536774 651840057 651192093 650523911
2797.7 650523911 650035706 649644928 649173050 648796539 648144150 647705994 647304993 646693649 646169052 645631104
2807.3 645631104 645067520 644463043 643800583 643097458 642777252 642210770 641168518 640435104 640050735
2816 640050735 639316826 637857742 636901932 636216164 635474472 634780655 633732033 632923050 631861649
2824.7 631861649 630643349 629285126 627960892 626881447 625036812 623398132 622336578 621062050
2832.4 621062050 619432640 617910805 616200676 613890610 611965218 609693260 606814995 603619423
2840.1 603619423 599718208 595478745 590584068 585041847 579331627 573165474 565867653 558247604
2847.8 558247604 550844421 542787437 535160561 528680115 523040848 519396896 517874222 517754250
2855.5 517754250 519383469 522340050 525978088 530542603 534973640 538938255 542914848 546636047
2863.2 546636047 549737778 551847496 553682823 555059090 555603867 555317764 554573364 554245110 554283180
2871.9 554283180 554678993 554386749 554010506 554758606 555296783 555284157 555177460 554940834 554334679 553926010
2881.6 553926010 553426819 552192307 551164131 550180740 548828201 547055130 545262222 543987923 542476883
2890.2 542476883 540731468 539374352 537781143 535804100 534355125 532666626 530261612 528014412
2897.9 528014412 526122284 524405365 522316093 520114250 517956886 515358658 512127190 508799095
2905.7 508799095 506006203 502690926 498936272 495245934 490860558 486053505 481265564 475905647
2913.4 475905647 469666138 463499832 457272644 450661507 444242630 437701569 431272812 425922432
2921.1 425922432 421833382 418033409 415169029 413680458 412891960 413131905 414023018 416218185 419227943
2929.8 419227943 422168083 425771255 430061264 434952774 440200539 445617523 451147194 457178307
2937.5 457178307 463036728 468256607 473589249 479174271 484512100 488959427 493243523 497478828
2945.2 497478828 500936356 503537292 506026611 508311691 509466133 510472794 511454010 512248192 513007698
2953.9 513007698 513651619 514700966 515759773 516832542 518056870 520188751 523210182 526104813
2961.6 526104813 529137840 531967850 534956512 538518410 542283020 546060333 549403839 553149681
2969.3 553149681 557545662 561082268 563883858 566821594 569758301 572743607 575414314 577362900
2977 577362900 579345779 582041206 584561386 586432838 587983055 589283371 590870972 592221184 593401985
2985.7 593401985 594771538 596043472 597531700 598540459 599505463 600430984 600511894 600462265 600586319
2994.4 600586319 601033478 600993042 600457802 600198746 599461479 598420029 597634544 597011719 596233253 595051956
3004 595051956 593820953 592915955 592324486 591520500 590924721 591152802 591451454 591785660 592322769 592920265
3013.7 592920265 593901863 595021935 596258202 597443619 598586540 599768867 600343513 600803299 601244240
3022.4 601244240 601622963 601970940 601960487 601983948 601993484 602297401 602365952 601965675 601805687 601580009
3032 601580009 601663017 601671143 600876274 600016861 599452972 598812141 598657417 598810577 598099213 597149506
3041.6 597149506 596497116 595993195 595403404 594686623 593914146 593026695 592536240 592328148 592103806 591358604
3051.3 591358604 590486832 589907341 589066391 588547783 588029785 587295761 586860008 586135406 584618073
3060 584618073 583505363 583307724 583031769 583014565 582482338 581766472 581640892 580750961 579558754 578529587
3069.6 578529587 577929878 577366295 576651459 576512070 575980034 575191231 574977036 574414597 573206329
3078.3 573206329 572730598 572591248 572028351 571491508 571006622 570777588 570035286 568979187 568106461
3087 568106461 567285881 567098541 567033958 566208763 564915619 564095192 563150940 562500191 562216721 561184692
3096.6 561184692 560696869 560259666 559452629 558777695 558163605 557815552 556992874 556112976 555636597 555321808
3106.2 555321808 554796982 553902206 552914085 552066879 551382561 550517616 549830856 549216042 548942490 548493118
3115.9 548493118 547420311 546944656 546040649 544584351 543915367 543522186 542385902 541302986 540879402
3124.6 540879402 540225143 539748039 539169044 538292046 537573357 536418114 535076942 534364471 533577385
3133.3 533577385 532358589 531880455 531446114 530790825 530158043 529588776 528919334 526927948 525489159
3141.9 525489159 524980049 524313164 523854370 523093529 522388000 521643639 520744743 519479027 518157654
3150.6 518157654 517438393 516872063 516301346 515482101 514841194 513849716 512438698 511588669 510992050
3159.3 510992050 510453415 509791031 508834763 507484016 506494370 505797844 504905167 504449310 503907852
3168 503907852 502846184 501498413 500357628 499594879 499225845 498780518 497632484 496740417 496213303
3176.6 496213303 495507393 494587898 493545723 492544060 491431389 490129738 489375229 489066696 488158188
3185.3 488158188 487421417 486528130 485375938 484795456 484140053 483426170 482296448 481004448 480217323
3194 480217323 479914970 479251671 477907600 477014046 476213074 475529289 474667931 473705063 473407898 472983894
3203.6 472983894 471908607 470579376 470026665 469380913 468431358 467666092 466827698 466497803 465886765
3212.3 465886765 464999619 464043732 463320503 462951012 462430344 462109871 461025810 459644508 458992081
3221 458992081 458235474 457052536 456259079 456203804 455872154 455051270 454256439 453728638 452909393 451815605
3230.7 451815605 450935783 450507774 450189514 449192505 448310165 447178917 446191711 445890465 445164871
3239.3 445164871 444550972 443902550 443127975 442684174 442486000 441848488 440789185 440065727 439300385
3248 439300385 438532791 437383347 436514053 436094017 435342636 434874344 434387856 433957214 433423195 432487411
3257.7 432487411 431506767 430727463 430259552 429567032 428654251 427852020 427497292 427086487 426523705 426128693
3267.3 426128693 425180283 424230003 424178391 423834267 422821693 422504005 421820488 420807152 420408173
3276 420408173 419735260 419098091 418394356 417798386 417098503 416737900 416871262 416314392 416092567 415508194
3285.6 415508194 414422455 414009781 413807411 413475571 412964439 412309647 411294289 410821152 410484390
3294.3 410484390 410026779 410149269 409724884 408563042 407644424 407525063 407150688 406746597 406872101
3303 406872101 406343880 405761795 405530739 405121269 404404106 403522034 402635231 402248039 402078781 401404228
3312.6 401404228 400726471 400006027 399446297 398586922 397815399 397878494 397465744 396886330 396361389 395573006
3322.3 395573006 395008659 394989204 394804077 394047127 393369904 392578354 391842270 390905876 390309563 390218544
3331.9 390218544 389413681 388401680 387528381 387198296 387257843 386854668 385781250 384746552 384401360
3340.6 384401360 383936462 383521652 382922325 381834641 381251831 380854759 380080490 379503784 379007721
3349.3 379007721 378162384 377243538 375976105 375368195 375379219 374530563 373565826 372840233 372374077 371850090
3358.9 371850090 371169891 370697212 369683266 368566322 368117027 367856178 367112961 365847244 365035019
3367.6 365035019 364992599 364437180 363587112 362840614 361814919 361306725 360740395 360159073 359611702 358688469
3377.2 358688469 358143082 357454796 356958084 356699944 356180458 355592384 355104446 354875870 354446068 354059601
3386.9 354059601 353467026 352763977 352259941 351862335 351755066 351037254 350144691 349970360 349784164 349068565
3396.5 349068565 348422203 348617363 348976898 348295670 347272110 347229652 347387733 347115173 346305275 345847321
3406.2 345847321 346107368 345897751 345818939 345806808 345348549 345005760 344876404 344646416 344343224 344321861
3415.8 344321861 344430122 344166718 343334351 342951813 342690010 342413139 342847557 343063469 342949371 342568016
3425.5 342568016 342681427 343063278 343109932 343503151 343577538 343384285 343379173 343655319 343736076 343570747
3435.1 343570747 343749313 344075317 344342117 344553680 344859238 345046082 345437393 345100136 344763222 345544548
3444.7 345544548 346467438 347757263 347614403 347678413 348607635 348580475 348716507 348485985 348975868 350154915
3454.4 350154915 350828667 350991287 351026573 351983871 352748833 353427048 353936653 353978233 354205208 354782715
3464 354782715 355335846 355809517 356968994 357838211 358599014 359047737 359304047 359865265 359945564 360525398
3473.7 360525398 361288223 362111702 362737465 363088608 364051857 365303612 366190224 366531830 366898308
3482.3 366898308 367003670 367976074 368912125 369537582 371200066 371944656 372108421 372399178 373214073
3491 373214073 374100761 374771423 376328545 377444458 377977676 378097115 378635712 379656868 380536575
3499.7 380536575 381434631 382304077 383910446 384746552 384394989 384240227 385069313 386802940 388742218
3508.4 388742218 389802322 390178528 391488266 391577530 391911812 393031845 393700905 395172386 396030006
3517.1 396030006 396984901 398188934 398915062 399764137 401356621 402903709 403168755 404116745 405010872
3525.7 405010872 405859489 406839714 408120270 409399757 410454254 411773643 412264595 413620567 414704056
3534.4 414704056 416111336 417677460 417866287 419171295 419889069 420833092 421611748 423038788 425296974
3543.1 425296974 426672668 428023415 427929611 429643860 430097580 430531158 432810936 434771690 437128181
3551.8 437128181 436155014 437343864 439522629 440722885 442739754 442920532 444672127 446457443 447334328
3560.5 447334328 447786446 449759026 451985245 452937851 458069687 459290848 458385277 459989090 459016953
3569.1 459016953 461609612 463399734 465157166 467051544 468870773 470576744 471798668 474089966
3576.9 474089966 475072556 477322731 479360085 480213127 481513748 483442421 485800285 486833496 491413422
3585.5 491413422 494156342 492773972 495315857 494387817 496489563 499585419 502217407 504138527
3593.2 504138527 504828415 507286072 506708183 509177780 512839622 514059486 517242393 518107910 518766785
3601.9 518766785 521166878 523147354 524820099 527362900 530432472 530307617 533860626 533658524 532467804
3610.6 532467804 540831909 543146439 539948616 543827248 542873306 545638466 549671364 549581985 552534180
3619.3 552534180 552747841 552918854 555623360 557683563 559498062 562343102 564660187 566034126 572277489
3628 572277489 574557610 564437637 566648293 570993271 576563187 578081589 576141701 577799110
3635.7 577799110 580528717 582998695 582994347 583242569 584837074 587180252 588242302 588393097 590059776
3644.4 590059776 592632561 598286514 597808304 595308914 602535133 603410912 599617119 596903496 600270805
3653 600270805 603242874 606819878 612104111 603928108 604173546 608952904 610358772 611774979 612234268
3661.7 612234268 614175491 614365845 614797554 616403084 616523399 620197449 622581062 622661934 624354668
3670.4 624354668 616600876 617178726 624962540 634271698 635500870 616925659 618588409 625759621
3678.1 625759621 629736557 627170181 626791420 629469376 631234741 632587128 632045288 631916313 637115059
3686.8 637115059 645121689 636824455 631638985 639961395 634215660 633100662 638298798 638104630
3694.5 638104630 639427185 640019760 638981743 639296341 639755821 642680664 646011581 641257248 638556213
3703.2 638556213 643003540 643567886 642688599 642956390 645195007 649125900 642449036 646442108 652784195
3711.9 652784195 640622253 642901764 646378784 646263046 646329422 648477097 650201950 646295776 646460266
3720.5 646460266 652775879 650858765 645501633 649773865 651015472 650585480 647817154 647151108 650453491
3729.2 650453491 650984650 656845703 654554062 646203537 655805969 657930832 649850159 649566574 649726105
3737.9 649726105 649644470 652490997 655819931 651382599 653206787 665081406 659408264 642363052
3745.6 642363052 649774323 655580902 662805176 658554687 646976166 658816223 656202316 647563858
3753.3 647563858 651161575 654728165 658450775 653498611 655055847 661916962 654690323 650983734
3761 650983734 654726944 655687561 656016388 659905548 657637482 652734528 655326843 660402222 662160187
3769.7 662160187 654212341 655174179 658107758 657666092 657603683 656993561 658010712 658660278 661591187
3778.4 661591187 662276382 653975143 655747452 658135071 658668823 661038818 658680496 657448044 657963257
3787.1 657963257 658523636 659924850 659664688 659631119 659499207 659624863 659087067 660195084 664846649
3795.8 664846649 662620621 658070831 659222946 662484283 668200836 664084167 654758453 655992737
3803.5 655992737 657167892 661809540 668623199 660960083 655370331 659126968 660893631 661139374
3811.2 661139374 661381989 660667343 661250839 667735977 667932892 653075562 657556076 663551102 667825241
3819.9 667825241 670515366 654634323 654588623 659452286 660862808 663418427 664680862 661190186
3827.6 661190186 659997330 660048065 663602066 666881790 657996826 660157089 668102112 662408600 661510315
3836.3 661510315 671141815 664031601 658020020 665084381 658766403 658687057 666056824 663572693 659447556
3844.9 659447556 661269836 662117538 662008743 663805237 662699814 664807129 671155930 667254105 671139374
3853.6 671139374 653564682 651989288 662851028 662309189 660245972 661492081 663138046 666380005
3861.3 666380005 661887207 662137451 670098114 664190674 656632385 659888535 665170517 673110580
3869.1 673110580 667178192 656310577 658635864 664643555 669640427 659315643 658875198 662679901
3876.8 662679901 661841125 664118881 669594498 666016006 657627792 661885452 662950668 665508652
3884.5 665508652 671232300 656657639 656568832 660945358 662377701 667334137 667287598 659392853 660400620
3893.2 660400620 663667603 661286774 662221069 663660660 665793839 668707733 659290237 664310303
3900.9 664310303 666555862 659417877 665249329 663432922 661463318 661265717 660568237 662812271 663047333
3909.6 663047333 663154068 662695770 662723541 663394547 663323975 664664841 667345505 664494476 659011383
3918.2 659011383 662512894 663399963 659732819 661758194 662961884 663770752 662019958 658899460 660230408
3926.9 660230408 661585464 662760239 661622238 661187973 664218445 662859344 660430984 660983124 661393051
3935.6 661393051 661917038 661984787 661244888 661076050 661170807 663248749 665269699 660992126 659435806
3944.3 659435806 661129150 662512741 664335861 662365723 662089691 662758179 661090927 662450409 662755966
3953 662755966 662024460 661910629 661774750 662110519 661185989 660919342 661224289 661883621 662062988 660766068
3962.6 660766068 661599121 662408829 661404572 660944977 660997849 661205444 660912170 660489655 661297989 662113876
3972.2 662113876 662318344 662243652 661794510 661233215 660610352 660877686 661094131 660721588 661166611 661502762
3981.9 661502762 661172943 661038208 661232300 661138000 661171036 661339035 661248856 661235275 660926208 661148758
3991.5 661148758 661084061 661003571 662137833 661952896 661261139 661445694 660927505 660311279 660789795
4000.2 660789795
##END=$$ End of the data block
