##TITLE=$$ Begin of the data block
##JCAMP-DX=5.00 $$ ACD/SpecManager v 10.08
##SPECTROMETER/DATA SYSTEM=Varian
##DATE=15 Jan 2013 11:10:38
##DATA TYPE=INFRARED SPECTRUM
##DATA CLASS=XYDATA
##ORIGIN=
##OWNER=
##NPOINTS=3735
##FIRSTX=399.26403809
##LASTX=4000.35498047
##MAXX=4000.35498047
##MINX=399.26403809
##MAXY=70.27482605
##MINY=16.09305382
##XFACTOR=1.0000000000
##YFACTOR=0.000000100000000
##FIRSTY=36.54492569
##DELTAX=0.96440572
##XUNITS=1/CM
##YUNITS=TRANSMITTANCE
##XYDATA=(X++(Y..Y))
399.3C65449257o038399k013702Q779640K003365p841111k324562P432213N639229
$$ 365449257 359410858 357397156 366176796 368180161 360339050 358014488 365446701 371085930
407C71085930O45523r271889p685623N034332M869385L826599l364181o285515J673584
$$ 371085930 371731453 362459564 354773941 359808273 364677658 368504257 365140076 358854561 360528145
415.7C60528145M892387J721344l424454J125603q107338k436981L861427L280640
$$ 360528145 365420532 367141876 363717422 364843025 356735687 354298706 358160133 361440773
423.4C61440773m01497o98852l057557m329223J126823J349488L111991q57963m718552
$$ 361440773 361039276 360340424 357282867 352953644 354080467 355429955 358541946 357683983 352965431
432.1C52965431L979378R06830j892662L29094k786141k718239L991204J331176k762374
$$ 352965431 356944809 357851639 355958977 356288071 353501930 350783691 354774895 356106071 353343697
440.7C53343697Q181037N26009o208649O68450k511521j679344K448159L478775L77159
$$ 353343697 361524734 362050743 355842094 356510544 353999023 352319679 354767838 358246613 358623772
449.4C58623772j615715o603661m942360P782898M801445J305389M23890k588616k725677
$$ 358623772 357008057 350404396 345462036 353244934 358046379 359351768 359775658 357187042 354461365
458.1C54461365r95331l10783q38242l083916l947448Q34274M0054J23062K007294
$$ 354461365 353466034 353155251 352317009 349233093 345285645 346119919 346159973 346283035 348290329
466.8C48290329K543755N74798o563492P86934K656632p612915j70555M305534k26059
$$ 348290329 350834084 351408882 344845390 345632324 348288956 340676041 340505486 344811020 344584961
475.5C44584961l449364K785263L626213l691749m173584K98004J936417j839066k022247
$$ 344584961 341135597 343920860 347547073 343855324 339681740 339979744 341916161 340077095 338054848
484.1C38054848j285706l663101k31857J905708K39029k85072m40255K606545J266746
$$ 338054848 336769142 333106041 332874184 334779892 335018921 334733849 334293594 336900139 338166885
492.8C38166885n25093J463089j018448j228866j066857q49685m11568l279381n27267
$$ 338166885 337641792 339104881 338086433 336857567 335790710 334941025 334529457 331250076 330722809
501.5C30722809K203941k35748j794396J571084L774757k922974k893524L33023j097641
$$ 330722809 332926750 332691002 330896606 332467690 336242447 333319473 330425949 330758972 329661331
510.2C29661331j004066J632080Q58116k777443j694717o46286j425591n47333N72014
$$ 329661331 328657265 330289345 331147461 328370018 326675301 326029015 324603424 324056091 324628105
518.9C24628105o37169q04558m96597j189804J567726n1040j938973J68114j088295
$$ 324628105 323990936 323186378 322689781 321499977 323067703 323016663 321077690 321245804 320157509
527.5C20157509j859512r32694J728020R61876j225701o14948l96671p0095M8866j82304
$$ 320157509 318297997 317365303 319093323 320055199 318829498 318214550 317817879 317747784 317796650 317614346
537.2C17614346K69413J206760q31986j941776J81599O48250L14846p32173o68717
$$ 317614346 317883759 319090519 318258533 316316757 316498356 317146606 317461452 316729279 316060562
545.9C16060562o80961j171647j792469j963195N17387o8359p37343o41251j017036
$$ 316060562 315379601 314207954 312415485 310452290 310969677 310901318 310163975 309522724 308505688
554.5C08505688R2601l11317m42696J42460P20024M61235l86104l91197o91986M6768
$$ 308505688 308598289 308286972 307844276 307986736 308706760 309167995 308781891 308390694 307698708 307745476
564.2C07745476O84318P48234L02277j101170o84471L59478J78280p69177p22580K19956
$$ 307745476 308429794 309178028 309480305 308379135 307694664 308054142 308232422 307463245 306740665 306960621
573.8C06960621r65996p98359J836071m78515j915646K12212n44110j063442J055641
$$ 306960621 305994625 305196266 307032337 306553822 304638176 304850388 304306278 303242836 304298477
582.5C04298477J598053j56631k12422J254483Q27941P45831M90837q38718m63372
$$ 304298477 305896530 305739899 305527477 306781960 307609901 308355732 308846569 308007851 307544479
591.2C07544479j28612m02031J010837K001877Q97427J72901Q5030m1294P0724o46152
$$ 307544479 307415867 307013836 308024673 310026550 310923977 311096878 311181908 311140614 311211338 310565186
600.8C10565186k18106O65646r99165j781196j81179M21486q40512l24497Q03986j690960
$$ 310565186 310347080 311012726 310013561 308232365 308051186 308472672 307632160 307307663 308111649 306420689
610.5C06420689k037144N19085J128387N4875k019711j404972m17824n28755R26609
$$ 306420689 304383545 304902630 306031017 306085892 304066181 302661209 302243385 301714630 302641239
619.2C02641239M86469m4593P8659K83127Q39595L80211R47514J781673J370354J257992
$$ 302641239 303127708 303083115 303161774 303444901 304284496 304664707 305612221 307393894 308764248 310022240
628.8C10022240J159706J088867K268066K120209P95651M50363M96483J373043K220649
$$ 310022240 311181946 312270813 314538879 316659088 317454739 317905102 318401585 319774628 321995277
637.5C21995277K281304J399307O27937J063996K024345J786308J011048P33948J45378
$$ 321995277 324276581 325675888 326303825 327367821 329392166 331178474 332189522 332923470 333068848
646.2C33068848J270752J561431O1226Q36106J012192K02751N16319n7373l34396Q1405
$$ 333068848 334339600 335901031 335962257 336798363 337810555 338013306 338529625 338472252 338137856 338219261
655.8C38219261r1019J57815R4337P439j6594J94549J74065k27852M10957k11715p46918
$$ 338219261 338128242 338286057 338380394 338387833 338371239 338565788 338739853 338512001 338922958 338711243 337964325
666.4C37964325o66313J711235K311897q47206p4348J375923R92202J108513J117974
$$ 337964325 337298012 339009247 341321144 340473938 340399590 341775513 342767715 343876228 344994202
675.1C44994202L56025l17878K66914J576347K341462J191177O55441J832390J770477
$$ 344994202 345350227 345032349 345299263 346875610 349217072 350408249 351063690 352896080 354666557
683.8C54666557J713867P44820L56522R05494J188508K521820J455192m20265j63460
$$ 354666557 356380424 357125244 357481766 358387260 359575768 362097588 363552780 363132515 362969055
692.4C62969055J110039J864777J778793P93075r92279o97288Q24928J043434O05545
$$ 362969055 364079094 365943871 367722664 368515739 367523460 366826172 367651100 368694534 369300079
701.1C69300079J223564J377793L84979Q92677J720047J474495O65436O63529R27696
$$ 369300079 370523643 371901436 372286415 373179092 374899139 376373634 377039070 377702599 378630295
709.8C78630295O38199P27501R51309J046409R62944R21517O96029J292420N13916
$$ 378630295 379268494 379995995 380947304 381993713 382956657 383878174 384574203 385866623 386380539
718.5C86380539p10983N68771J028595J239700R70192Q18520O70700J57394J567231
$$ 386380539 385669556 386238327 387266922 388506622 389476814 390295334 390966034 391123428 392690659
727.2C92690659J781196J517563P05986K14958R86634M67987P07130R18732J113701
$$ 392690659 394471855 395989418 396695404 396910362 397896996 398364983 399072113 399990845 401104546
735.8D01104546J572227J022186Q9341k75994J23749M34113P18803N66368P98912Q43163
$$ 401104546 402676773 403698959 403788300 403512306 403636055 404070168 404788971 405355339 406154251 406997414
745.5D06997414O05850J163406J074333P96700P31049o9085j91192R99794Q46328O62270
$$ 406997414 407603264 408766670 409841003 410637703 411368752 411299667 411108475 412108269 412954597 413616867
755.1D13616867J435089J796341J739349J313210J574516J597596J429214L04985J58005
$$ 413616867 415051956 416848297 418587646 419900856 421475372 423072968 424502182 424807167 424965172
763.8D24965172J517753J086235P60003L79524P43904L35808J22261P08656o41289
$$ 424965172 426482925 427569160 428329163 428708687 429452591 429788399 429910660 430619316 429978027
772.5D29978027l98750k21672l6430L7384K62565Q76313j75477m51736R2087J594353
$$ 429978027 429579277 429357605 429321175 429358559 429621124 430497437 430321960 429870224 429962311 431556664
782.1D31556664K30255j084519K87476Q88061J332779K76490O95571O12832Q3923k1820
$$ 431556664 431786919 430702400 430989876 431877937 433210716 433487206 434182777 434795609 434879532 434857712
791.8D34857712n62477q622l02543N84831j004066j780854m20608q20389m35448j652755
$$ 434857712 434295235 434286613 433984070 434568901 433564835 431783981 431363373 430542984 430107536 428454781
801.4D28454781k044068j588096j408997j779747k316856k251625k705651k035713
$$ 428454781 426410713 424822617 423413620 421633873 419317017 417065392 414359741 412324028
809.1D12324028j786194j099319j666222k565155j740150j523247j016922j763611
$$ 412324028 410537834 409438515 407772293 405207138 403466988 401943741 400926819 399163208
816.9C99163208j261063K01073k66876m73671L83530J575203J756019K038612K248650
$$ 399163208 397902145 398103218 397836342 397362671 397746201 399321404 401077423 403116035 405364685
825.5D05364685K134247K426796L497887L526649K576790L582687L298493K920456
$$ 405364685 407498932 409925728 413423615 416950264 419527054 423109741 426408234 429328690
833.3D29328690K927665L378678L761482J817284J559677K245712K576485J557350
$$ 429328690 432256355 435635033 439396515 441213799 442773476 445019188 447595673 449153023
841D49153023J953506K806168K574539K605133N43480R04388J382866J991577K825852
$$ 449153023 451106529 453912697 456487236 459092369 459635849 460540237 461923103 463914680 466740532
849.6D66740532J941757J066246L29514J692962J083565K036934K921562K022515K495536
$$ 466740532 468682289 469748535 470078049 471771011 472854576 474891510 477813072 479835587 482331123
858.3D82331123J738587J851768O55518R65576J542320J041184K29377n22422L87039
$$ 482331123 484069710 485921478 486576996 487542572 489084892 490126076 490355453 489833031 490220070
867D90220070q53272L7690l39127j281662j296387k042083n96161q46062j170158k006836
$$ 490220070 489366798 489404488 489065361 487783699 486487312 484445229 483849068 483003006 481832848 479826012
876.7D79826012j775971j530609j180687L45345l8834J75667j190109j218148j294670
$$ 479826012 478050041 476519432 475338745 475684090 475645256 475820923 474630814 473412666 472117996
885.3D72117996j664085j003342j539688o25801j060638l74947j02768k19421K53143
$$ 472117996 470453911 469450569 467910881 467285080 466224442 465849495 465746727 465527306 465780449
894D65780449j190987p89718j27907J53923l87955p68051j215858m21181Q59756o5002
$$ 465780449 464589462 463799744 463671837 463825760 463437805 462669754 461453896 461032715 461892471 461827469
903.7D61827469P65991J246491K655944K634087J273384J792946Q07648N28068q0108
$$ 461827469 462593460 463839951 466495895 469129982 470403366 472196312 473003960 473532028 473451920
912.3D73451920K6130n57365j042099q45413k416726k811775k755470k447319l412666
$$ 473451920 473478050 472920685 471878586 471033173 468616447 465804672 463049202 460601883 457189217
921D57189217l322831l034896l210183k844085l539505l029404l953285l741455l104134
$$ 457189217 453866386 450831490 447621307 444777222 441237717 438208313 434255028 430513573 427409439
929.7D27409439l300857k415200k794800k002105j193695r57680j136856j262360j129989
$$ 427409439 424108582 421693382 418898582 416896477 415702782 414745102 413608246 412345886 411215897
938.4D11215897j543885r71679j510086j743393j487122j512871q11767M63524M78477
$$ 411215897 409672012 408700333 407190247 405446854 403959732 402446861 401635094 402098618 402577095
947.1D02577095j570473j390381m77142k5558j36338q75854r62372j443405j148071
$$ 402577095 401006622 399616241 399139099 399113541 398977203 398101349 397138977 395695572 394547501
955.7C94547501j800003k496033k862854l436470k369728j912270k398605k249222
$$ 394547501 392747498 390251465 387388611 383952141 381582413 379670143 377271538 375022316
963.4C75022316j811447k144814k118988k038803k342720k137489k603493l053169
$$ 375022316 373210869 371066055 368947067 366908264 364565544 362428055 359824562 356771393
971.2C56771393l044472k717438k429580l049317m096794l646202k767067m124222
$$ 356771393 353726921 351009483 348579903 345530586 341433792 337787590 335020523 330896301
978.9C30896301n322799n313569n241127n088672n130558n434647n328979m939823
$$ 330896301 325573502 320259933 315018806 309930134 304799576 299364929 294035950 289096127
986.6B89096127m545575n020141n094624m161262m612637m303417l815384l999367
$$ 289096127 284550552 279530411 274435787 270274525 265661888 261358471 257543087 253543720
994.3B53543720m082680l688125k771626k707023k572708l257008l042774k456532
$$ 253543720 249461040 245772915 243001289 240294266 237721558 234464550 231421776 228965244
1002B28965244k312641k154102k017346j185321k202187k054958j287651j413784j890488
$$ 228965244 226652603 224498501 222481155 221295834 219093647 217038689 215751038 214337254 212446766
1010.7B12446766k450924j913013j759148j053791j665192j820850j877518k277794
$$ 212446766 209995842 208082829 206323681 205269890 203604698 201783848 199906330 197628536
1018.4A97628536k031612k509575j527710k475472k608547k055683k141323j313858
$$ 197628536 195596924 193087349 191559639 189084167 186475620 184419937 182278614 180964756
1026.1A80964756j503716r84363j425686r20963j073742n76382R5463r36565j68972
$$ 180964756 179461040 178476677 177050991 176130028 175056286 174479904 174575367 173638802 173469830
1034.8A73469830m84677O64177J372128J590633J241989R27754K334594Q97389R34
$$ 173469830 172985153 173649330 175021458 176612091 177854080 178781834 181116428 182013817 182014751
1043.5A82014751N5581J306724J071320m29783r44061j124249J13316r81102o30417
$$ 182014751 182070332 183377056 184448376 184018593 183074532 181950283 182063599 181082497 180452080
1052.2A80452080n05924j222935j247635r24110K90565n79319P03163M03729N92613
$$ 180452080 179946156 178723221 177475586 176551476 176842041 176262722 176965885 177369614 177962227
1060.9A77962227J360054J211758K653865J596413K036152K334270K506924J433106
$$ 177962227 179322281 180534039 183187904 184784317 186820469 189154739 191661663 193094769
1068.6A93094769O96220J244602N72510J334343M10080J458397R25522k25792N70011
$$ 193094769 193790989 195035591 195608101 196942444 197352524 198810921 199736443 199510651 200080662
1077.2B00080662j16406J146736J252385J563129J80054J449J961460J820755J695881
$$ 200080662 199964256 201110992 202363377 203926506 204106560 204108009 206069469 207890224 209586105
1085.9B09586105N57824J254863J461506J541271J324540P01465R59339R78756K151528
$$ 209586105 210143929 211398792 212860298 214401569 215726109 216427574 217386913 218365669 220517197
1094.6B20517197J136932J267147J636849J281223P89432K48433K000999J857395K011013
$$ 220517197 221654129 222921276 224558125 225839348 226628780 226877213 228878212 230735607 232746620
1103.3B32746620J495552Q19741O07624N48954K037124J582012J249009L14521M34590
$$ 232746620 234242172 235061913 235669537 236218491 238255615 239837627 241086636 241401157 241835747
1112B41835747Q47225K76451J148872J611405J722050R3784k21500L86505M56771L7747
$$ 241835747 242682972 242959423 244108295 245719700 247441750 247535534 247314034 247700539 248157310 248195057
1121.6B48195057r85909K19365P50217J160965J093235Q31947R04560J343308K537994
$$ 248195057 247209148 247428513 248178730 249339695 250432930 251264877 252169437 253512745 256050739
1130.3B56050739J787281J821289J780682J989803K788239K740574K105941J789074
$$ 256050739 257838020 259659309 261439991 263429794 266218033 268958607 271064548 272853622
1138B72853622K685605J675128J262188J547299J418285J687794J157589J065655O60133
$$ 272853622 275539227 277214355 278476543 280023842 281442127 283129921 284287510 285353165 286013298
1146.7B86013298M57630N84240M47006j24225k26155L76225n10235r97162p40013k86598
$$ 286013298 286470928 287055168 287502174 287377949 287151794 287528019 287017784 286020622 285280609 284994011
1156.3B84994011j31893m81091n67684j316853j114482l80917J47858M68597P02515
$$ 284994011 284862118 284381027 283813343 282496490 281382008 281001091 281148949 281617546 282320061
1165B82320061J263809J741543K311477K583962L080749K894669L116798L207264K943211
$$ 282320061 283583870 285325413 287636890 290220852 293301601 296196270 299313068 302520332 305463543
1173.7C05463543L466034L349628L068505L229599L175048K623787L243256L208351
$$ 305463543 308929577 312279205 315347710 318577309 321752357 324376144 327619400 330827751
1181.4C30827751K389679K297096K000428J630783J579818J992722J240044Q95538
$$ 330827751 333217430 335514526 337514954 339145737 340725555 342718277 343958321 344853859
1189.1C44853859R21097K46544l90358q11119k72599l50456j110229j485405j177636
$$ 344853859 345774956 346021500 345631142 344820023 344547424 344196968 343086739 341601334 340423698
1197.8C40423698j021003j218224r80301j116638j473770j691437j210060q25729j323967
$$ 340423698 339402695 338184471 337204170 336087532 334613762 332922325 331712265 330886536 329562569
1206.5C29562569j100731o55480n62133n73159n35507l54843n94177m97666k49786
$$ 329562569 328461838 327806358 327244225 326671066 326135559 325780716 325186539 324688873 324439087
1215.1C24439087m83399p65037n69382m28467o16149l15400j74980l59268o83594r00764
$$ 324439087 323955688 323190651 322621269 322192802 321576653 321261253 321086273 320727005 320043411 319142647
1224.8C19142647q79421r98593q44879r02691r45129q72994r82570p84741o32648n10407
$$ 319142647 318263226 317264633 316419754 315517063 314571934 313698940 312716370 311931629 311298981 310788574
1234.4C10788574p20176o85292k24933j71414l51581k54002J4877j40133l85665q39921
$$ 310788574 310068398 309383106 309158173 308986759 308635178 308381176 308396053 308255920 307870255 307030334
1244.1C07030334o28528j51329k4071j40800j121865p59430r0332k74849k23217l08704
$$ 307030334 306401806 306250477 306226406 306085606 304963741 304204311 304113979 303839130 303615913 303307209
1253.7C03307209l26328k22760Q9360l60241l08972n2433k81448K18754L25050Q11959
$$ 303307209 302980881 302758121 302847481 302487240 302178268 302125835 301844387 302063141 302388191 303200150
1263.4C03200150O96830J49155M37946R06773R66797M88052O25172Q17871J170235
$$ 303200150 303896980 304046135 304484081 305390854 306357651 306845703 307470875 308288746 309458981
1272C09458981J192855J052437J542511J376019J002636J263141J335259J015873J042804
$$ 309458981 310651836 311704273 313246784 314622803 315625439 316888580 318223839 319239712 320282516
1280.7C20282516J179123J749115K072792J818619J578942J521110J644554J402741
$$ 320282516 321461639 323210754 325283546 327102165 328681107 330202217 331846771 333249512
1288.4C33249512J736412J451950Q57735R68055J161499J144409R29261J058273Q57811
$$ 333249512 334985924 336437874 337295609 338263664 339425163 340569572 341498833 342557106 343414917
1297.1C43414917O86417M40139P06253N10407J99661O08788N8174K90184J79977j50566
$$ 343414917 344101334 344541473 345247726 345758133 345957794 346566582 346624756 346914940 347094917 346944351
1306.8C46944351l27720p11823k59552j01166m03099j575355j198883j98975n9395
$$ 346944351 346616631 345904808 345645256 345544090 345140991 343565636 342366753 342167778 342108383
1315.4C42108383K34528o2828O41403P98874O30684J061363Q63304O96945O33087Q51975
$$ 342108383 342342911 342280083 342921486 343720360 344351044 345412407 346275711 346972656 347605743 348457718
1325.1C48457718Q59985R11255K36778m39262l51563m8637l02391p74498l55873n69038
$$ 348457718 349317703 350228958 350465736 350026474 349674911 349626274 349323883 348549385 348193512 347624474
1334.7C47624474k70234j18675k49100K52686K0065O89316Q13179O22788K41699M04548
$$ 347624474 347354240 347235565 346986465 347239151 347259216 347948532 348761711 349384499 349626198 350030746
1344.4C50030746J272278J011963O35262K61917P63779O9351n35393j51444k47497
$$ 350030746 351303024 352314987 352950249 353212166 353975945 354045296 353509903 353358459 353110962
1353.1C53110962j95503q46749l24287p515j39809m65240n56145n47104q86307P8240
$$ 353110962 352915459 352068710 351744423 351736908 351597099 351131859 350575714 350028610 349142303 349220543
1362.7C49220543q25882m52347m70886j053810l99475o08368l24478o59981j87073
$$ 349220543 348394661 347942314 347471428 346417618 346018143 345409775 345085297 344425316 344238243
1371.4C44238243l31268q36106J0186k81601J02768r2812K7771l26271l72429m37889
$$ 344238243 343906975 343070869 343081055 342799454 342902222 342809410 342837181 342510910 342138481 341700592
1381C41700592j056328p53135j778527j824341j135597q15620k340660k027550o87866
$$ 341700592 340644264 339891129 338112602 336288261 335152664 334337044 331996384 329968834 329280968
1389.7C29280968j823693j945190k076073j726646k213726l215466j789169k326241
$$ 329280968 327457275 325512085 323436012 321709366 319495640 316280174 314491005 312164764
1397.4C12164764k286605l429528k599716j466999k026749j677932k040978l084831
$$ 312164764 309878159 306448631 303848915 302381916 300355167 298677235 296636257 293551426
1405.1B93551426k984753j699199j353169j825485j671677j875000j316852j189690
$$ 293551426 290566673 288867474 287514305 285688820 284017143 282142143 280825291 279635601
1412.8B79635601j201973r87930j430245j043949r75685n1842j172790j90697J261578
$$ 279635601 278433628 277445698 276015453 274971504 273995819 273943977 272771187 272580490 273842068
1421.5B73842068L22399M77276j41888J328964J114006J51787R88674M69017J636601
$$ 273842068 274164467 274641743 274499855 275828819 276942825 277094612 278083286 278552303 280188904
1430.2B80188904J274299J652165K059173K022782K126484J104183K478867J579799
$$ 280188904 281463203 283115368 285174541 287197323 289323807 290427990 292906857 294486656
1437.9B94486656K468472K002067J544457J772823J620865K752495J655597J835556
$$ 294486656 296955128 298957195 300501652 302274475 303895340 306647835 308303432 310138988
1445.6C10138988J443291J551857J427479J217556K307281J167679J866856J559105
$$ 310138988 311582279 313134136 314561615 315779171 318086452 319254131 321120987 322680092
1453.3C22680092K085876J775322J122895K934684r13391L814125K374001K397537
$$ 322680092 324765968 326541290 327664185 330598869 329685478 333499603 335873604 338271141
1461.1C38271141K129936K039070K632523Q98743L273163K259674K595863K532082
$$ 338271141 340401077 342440147 345072670 345971413 349244576 351504250 354100113 356632195
1468.8C56632195K576408L071098J224480L303680L868828M206619L386422K906074
$$ 356632195 359208603 362279701 363504181 366807861 370676689 374883308 378269730 381175804
1476.5C81175804L346901K645836K408905J850700K109032K197495J974372J727524
$$ 381175804 384522705 387168541 389577446 391428146 393537178 395734673 397709045 399436569
1484.2C99436569J342659J552391R03435M20113R16366p73697l71093M01344j54343
$$ 399436569 400779228 402331619 403235054 403655167 404571533 403797836 403426743 403828087 403673744
1492.9D03673744j280556j264648p57256m691810n6000j333198l394471n68008j958618
$$ 403673744 402393188 401128540 400371284 395679474 395623474 394290276 390895805 390327797 388369179
1501.6C88369179j826210r28421J70631j428070n148506l142281P92199K467956m64783
$$ 388369179 386542969 385614548 385785179 384357109 379208603 376066322 376858521 379326477 378861694
1510.2C78861694M58413j180382j941262k44178r72443p13539k682266j087876J303101
$$ 378861694 379320107 378139725 376198463 375954285 374981842 374268303 371586037 370498161 371801262
1518.9C71801262J457443p70531k443542O33507R17167K185402L48893M88243R60197
$$ 371801262 373258705 372488174 370044632 370678139 371595306 373780708 374129601 374617844 375578041
1527.6C75578041O90308J251220Q62046O93702L47634O69250o18896J281166J187897
$$ 375578041 376268349 377519569 378381615 379075317 379422951 380092201 379473305 380754471 381942368
1536.3C81942368Q58078J069641l753968M33770K395401J837844l28483Q95958J230697
$$ 381942368 382800446 383870087 380116119 380549889 382945290 384783134 384454651 385350609 386581306
1545C86581306j057586J319389L26195Q71696J4305n37185R52301j77689P56989k947579
$$ 386581306 385523720 386843109 387169304 388041000 388055305 387518120 388470421 388292732 389049721 386102142
1554.6C86102142r56916R05075J014633j692276j0915756J962547l6736J133728j502037
$$ 386102142 385145226 386050301 387064934 385372658 374456902 376419449 376382713 377516441 376014404
1563.3C76014404j954498l396568l575554k101898l509140j917763q380013j642761
$$ 376014404 374059906 370663338 367087784 364985886 361476746 359558983 351178970 349536209
1571C49536209k206306l842774l030319m100647k589798j3636169j114064l078193
$$ 349536209 347329903 343487129 340456810 336356163 333766365 320130196 319016132 315937939
1578.7C15937939m528656m120179n881271l655548o108856l809509n471135m683933
$$ 315937939 311409283 307289104 301407833 297752285 291643429 287833920 282362785 277678852
1586.4B77678852m707088n827427l524151n738335k663784n401630l660813l901767
$$ 277678852 272971764 267144337 263620186 257881851 255218067 249816437 246155624 242253857
1594.1B42253857m593926k930126n159760j966953m593944k052403l569565l254604
$$ 242253857 237659931 234729805 229570045 227603092 223009148 220956745 217387180 214132576
1601.9B14132576j780415l826789q56381l754826q12950k635650j338444j525555k683429
$$ 214132576 212352161 208525372 207668991 203914165 203101215 200465565 199127121 197601566 194918137
1610.5A94918137N50766k833691M97284j718617M84677K76832m907798J883926j649532
$$ 194918137 195468903 192635212 193132496 191413879 191898556 192175388 187267590 189151516 187501984
1619.2A87501984J322975j458836P44629K13528j288033J246014l87688K503109j725979
$$ 187501984 188824959 187366123 188110752 188324280 187036247 188282261 187894573 190397682 188671703
1627.9A88671703J672364O55517N57785J184311Q6022K596054m63848L233509j417809
$$ 188671703 190344067 190999584 191557369 192741680 192827702 195423756 194959908 198193417 196775608
1636.6A96775608L017654K073498J121426L006325J38626K783737O09550K110463J360473
$$ 196775608 199793262 201866760 202988186 205994511 206133137 208916874 209526424 211636887 212997360
1645.3B12997360p14416L823375Q9589M100532N03845K646313J784134R76028J955967
$$ 212997360 212282944 216106319 216195908 220296440 220800285 223446598 225230732 226206760 228162727
1653.9B28162727r02767M115982P28894L069477J582889J719093K152081J906700L964539
$$ 228162727 227259960 231375942 232104836 235174313 236757202 238476295 240628376 242535076 246499615
1662.6B46499615Q35018L930092J941318L209133L354931K565270M604664J743698
$$ 246499615 247334633 251264725 253206043 256415176 259770107 262335377 266940041 268683739
1670.3B68683739N269737L184948M823055L848324L524246M654007L670407N443267
$$ 268683739 273953476 277138424 281961479 285809803 289334049 293988056 297658463 303101730
1678C03101730L348770M797574L834114N097942N472984L050614R514579R20487O128464
$$ 303101730 306450500 311248074 315082188 320180130 325653114 328703728 338218307 339138794 345267258
1686.7C45267258N282592N137635N028953M493370N915337N193329N439186N140991
$$ 345267258 350549850 355687485 360716438 365209808 371125145 376318474 381757660 386898651
1694.4C86898651N748825K853584O737175O750451N232009M039078J813050Q238449
$$ 386898651 392647476 395501060 402238235 408988686 414220695 418259773 420072823 428311272
1702.1D28311272N659141M769211M432793M426346M033279L342743M675941L219033
$$ 428311272 433970413 438739624 443172417 447598763 451632042 454974785 459650726 462869759
1709.9D62869759K446174L141098L123169K781754J494331K520981M022636K811776
$$ 462869759 465315933 468457031 471580200 474361954 475856285 478377266 482399902 485211678
1717.6D85211678k654725L830986L774415K071418J908989J578446J845626K097588
$$ 485211678 482556953 486387939 490162354 492233772 494142761 495721207 497566833 499664421
1725.3D99664421K218590J820640J503106J951561K50892J198845L908386L252449
$$ 499664421 501883011 503703651 505206757 507158318 507409210 508608055 512516441 515768890
1733E15768890j197815j722068M651909M006042K744141L566932J321411o2904M234085
$$ 515768890 514571075 512849007 517500916 521506958 524251099 527818031 529139442 529076538 533310623
1741.7E33310623L180351J577797K652932L877601L496285L282165L397064K592621
$$ 533310623 536490974 538068771 540721703 544599304 548095589 551377754 554774818 557367439
1749.4E57367439N030251K436676K325058N269737L521195L940162L921509J255989
$$ 557367439 562397690 564834366 567159424 572429161 575950356 579890518 583812027 585068016
1757.1E85068016K798920L680076L074723L648529k92282J039657M363556K448082
$$ 585068016 587866936 591547012 594621735 598270264 597977982 599017639 603381195 605829277
1764.8F05829277K335548K434540K175102r12284K314911M295997J48354j070595K39792
$$ 605829277 608164825 610599365 612774467 611862183 614177094 618473091 618621445 617550850 617790642
1773.5F17790642M704666K284279j09863K635955J185341K240639J099777l62205J217079
$$ 617790642 622495308 624779587 624669724 627305679 628491020 630731659 631831436 631469231 632686310
1782.2F32686310J896705J712151n48172P86133K201042J944695J094131J655731O30036
$$ 632686310 634583015 636295166 635746994 636533127 638734169 640678864 641772995 643428726 644058762
1790.9F44058762Q7127j119919l83605M052658J421737J37558J576996J893540J153182
$$ 644058762 644145889 643025970 642642365 646695023 648116760 648254318 649831314 651724854 652878036
1799.5F52878036m49218K030029k87781O88629J949845J025162J329116O70243J039734
$$ 652878036 652428818 654458847 654171066 654859695 656809540 657834702 659163818 659834061 660873795
1808.2F60873795R44137J275711o97403O05088J457672O83593J563111J35269J014938
$$ 660873795 661817932 663093643 662396240 663001328 664459000 665142593 666705704 666840973 667855911
1816.9F67855911K42005O32705J123124J75857J184616q392J603699J015930k311936
$$ 667855911 668097916 668730621 669853745 670029602 671214218 671205826 672809525 673825455 671513519
1825.6F71513519M23279K281647K265243j18179k469940R86557K514725N49240L78494
$$ 671513519 671936798 674218445 676483688 676365509 673895569 674882126 677396851 677946091 678324585
1834.3F78324585J44424P2785K94952j99585J781769N81894J048508P71713J037903
$$ 678324585 678469009 678541794 678836746 678637161 680418930 681000824 682049332 682821045 683858948
1842.9F83858948J078949n009766K068482J841507J7623K72217Q39234J456680K78549
$$ 683858948 684937897 679928131 681996613 683838120 683855743 684127960 684967194 686423874 686702423
1851.6F86702423Q00858k28348M29764K517j74865O41784l49502P81173R5215O34995
$$ 686702423 687503281 687274933 687704697 687707214 687532349 688174133 687824631 688605804 688701019 689336014
1861.3F89336014N87539Q00705Q40531L1204P96127o44073J08871j340332p67975J380311
$$ 689336014 689923553 690724258 691564789 691595993 692392120 691748047 691856918 690516586 689748611 691128922
1870.9F91128922J129760J301117j00479N75028K21862K18277J16196P1945M05960
$$ 691128922 692258682 693559799 693459320 694034348 694256210 694474487 694590683 694662628 695068588
1879.6F95068588k42538P35168n2337L86428J1750P5912P30591j57394Q44955o09665
$$ 695068588 694826050 695561218 695508881 695895309 695907059 695982971 696713562 696556168 697401123 696791458
1889.2F96791458j253052M53492J171569N19104J48316J17874l45078J428605l9368
$$ 696791458 695538406 695991898 697163467 697682571 697830887 697948761 697603683 699032288 698992920
1897.9F98992920k96478J88675J08413M62494l64532M66308k63366L35617M65393O8664
$$ 698992920 698696442 698885117 698993530 699456024 699091492 699557800 699294434 699630051 700095444 700164108
1907.6G00164108M33350n35355m73785j46790Q32596k72293J44272K79312M38080J619263
$$ 700164108 700597458 700062103 699588318 699441528 700274124 700001831 700146103 700425415 700863495 702482758
1917.2G02482758j956788k25524R71221J78071K98233j128464m54788N68542J011505
$$ 702482758 700525970 700300446 701271667 701449738 701747971 700619507 700164719 700733261 701744766
1925.9G01744766P0114K98462L7842j27792m3183m76150N76782l65143p324n9128J14441
$$ 701744766 701814880 702113342 702151184 702023392 701980209 701504059 702080841 701715698 701708374 701649246 701763687
1936.5G01763687O69556l6698K30027l96500N18188q77990j450424R46350K94494q8272
$$ 701763687 702433243 702396545 702626572 702230072 702748260 701870270 700419846 701366196 701660690 701572418
1946.1G01572418K8687P89032P1411m8065j47171l43171J34583k49939k75803o88629
$$ 701572418 701601105 702390137 702461548 702413483 702266312 701923141 702057724 701807785 701531982 700843353
1955.8G00843353L44162L07083L48511M22363l51486J22299k37350k8992o67801O0730
$$ 700843353 701187515 701494598 701843109 702265472 701913986 702036285 701798935 701769943 701102142 701162872
1965.4G01162872L45078o75430J73263J56174K84042m91028R6131N9356k09045L29971
$$ 701162872 701507950 700832520 701005783 701161957 701445999 700954971 701051102 701110458 700901413 701231384
1975.1G01231384l32107N3863l15628L51181j44424l26615J42212l04641O56280k99148
$$ 701231384 700899277 700953140 700637512 700988693 700844269 700517654 700659866 700355225 701011505 700712357
1984.7G00712357q5984m3182l67127l72314m83475O68335q0261p24564l08227Q85086
$$ 700712357 700626373 700583191 700216064 699843750 699360275 700028610 699948349 699223785 698915558 699800644
1994.3F99800644K64587k25677P4997q15735K79999k19803k80075j72196j42517M40140
$$ 699800644 700065231 699839554 699914551 699098816 699378815 699159012 698878937 698706741 698564224 699004364
2004F99004364j64185J0224m20456K00272k42692k04544P0343p38754J20468k69775
$$ 699004364 698840179 698850403 698429947 698630219 698387527 698182983 698253326 697514572 697635040 697365265
2013.6F97365265O3019O561k77863k44522j63040q7051q33054j32141k52991K76795
$$ 697365265 697428284 697434845 697156982 696912460 696749420 696662369 695829315 695697174 695444183 695720978
2023.3F95720978J15967p6905P172o65360L38135l15628l3645K9296l67050l06625
$$ 695720978 695836945 695760040 695767212 695101852 695439987 695124359 695090714 695120010 694752960 694446335
2032.9F94446335n61295j3885n53971J41755j50986L2577K43760n77088k86255o14776
$$ 694446335 693885040 693871155 693317184 693458939 693307953 693340530 693584290 693007202 692720947 692106171
2042.6F92106171M12750n7297l70178k09808o1188M44641m47311J86080r9945j70211
$$ 692106171 692518921 692461624 692091446 691881638 691820450 692265091 691817780 692003860 691903915 691733704
2052.2F91733704k26136l04031j07346k41317J62429q46862J3656J13831N4245L81927
$$ 691733704 691507568 691203537 691096191 690854874 691017303 690170441 690184097 690297928 690352173 690734100
2061.9F90734100k92205M9667m69818J57776j45417p8811k4414l05252L22570m38995
$$ 690734100 690441895 690491562 690021744 690179520 690034103 689955292 689930878 689625626 689948196 689509201
2071.5F89509201L38821J03226r3689j73950m14276L6468o32629m7760M9515L47748
$$ 689509201 689848022 689951248 689857559 689683609 689269333 689305801 688673172 688625412 688674927 689022675
2081.1F89022675k48261m27475J37863l34778O0196o67801j73645J09101j20392j64719
$$ 689022675 688774414 688346939 688484802 688150024 688210220 687542419 687368774 687477875 687357483 687192764
2090.8F87192764k91748K47040l04337R2545l21045n56869m43192k05765J97907k82288
$$ 687192764 686901016 687148056 686843719 686936264 686615219 686058350 685615158 685409393 685607300 685325012
2100.4F85325012M55628k9221M58J1062j68762j1902m30984k07520q36334j12381j6174
$$ 685325012 685780640 685751419 685751877 685762939 685594177 685582275 685151291 684943771 684107437 683995056 683978882
2111F83978882j44730j83716m50592K15607k16293L45306k21634k87933k74964q56399
$$ 683978882 683834152 683650436 683199844 683415451 683199158 683544464 683322830 683034897 682759933 681903534
2120.7F81903534k9831j63879N61142L96347Q0490j04294l08838k86179n83572L43094
$$ 681903534 681873703 681709824 682270966 682667313 682747803 682643509 682334671 682048492 681464920 681808014
2130.3F81808014j99356j15204J67618P2860J10703j40533K00195j94626R0485l65677
$$ 681808014 681608658 681493454 681661072 681733932 681844635 681704102 681904297 681709671 681800156 681434479
2140F81434479j39618l5324l00446K82517j33286M24881J23520K04849n2490n43747
$$ 681434479 681294861 681259537 680959091 681241608 681108322 681533203 681656723 681861572 681809082 681265335
2149.6F81265335r1171j85623J18866l60032M28315J44500N0812M52957l47290K93961
$$ 681265335 681174164 680988541 681107407 680747375 681175690 681320190 681371002 681823959 681476669 681770630
2159.3F81770630j81885q7356m99573k13242M58374k52914O7978j2741P44323J57318
$$ 681770630 681588745 681501389 681001816 680788574 681246948 680994034 681062012 681049271 681793594 681950912
2168.9F81950912r7198K90527l1509k04086q65631L10440L04412J14441P6294J18866
$$ 681950912 681853714 682144241 682112732 681908646 681043015 681353455 681657867 681772308 681848602 681967468
2178.5F81967468L74832k07901K91520k83432j33286k18353k8916L16697j08490O69174
$$ 681967468 682342300 682134399 682425919 682142487 682009201 681790848 681761932 682078629 681970139 682639313
2188.2F82639313K15072L86277K9983n9280j42517l28522L16467n87387K3651m3182
$$ 682639313 682854385 683240662 683270645 683211365 683068848 682740326 683056793 682469406 682493057 682449875
2197.8F82449875K84119N54275l8757K16903k90222L56674k72522j92794O2790l43934
$$ 682449875 682733994 683288269 683249512 683466415 683176193 683532867 683260345 683067551 683130341 682786407
2207.5F82786407K89765K13241N75715j38245j22757L4714K10952K47880n61448M4327
$$ 682786407 683076172 683289413 683865128 683726883 683604126 683638840 683849792 684097672 683536224 683580551
2217.1F83580551N8975K29493k42310M6082M89654p3318O6986j62049K39258l75900
$$ 683580551 683639526 683869019 683626709 683672791 684162445 684089127 684156113 683994064 684233322 683857422
2226.8F83857422r3155J8768m39529M16717K63214L10059n5237j06964j79367R9259
$$ 683857422 683764267 683783035 683343506 683760223 684023437 684333496 684278259 684171295 683991928 684091187
2236.4F84091187R079l81852J99280n60837j39312J81198M02450J13373l67203L17002
$$ 684091187 684100266 683718414 683917694 683356857 683217545 683398743 683801193 683914566 683547363 683864365
2246F83864365j59226M85230P7285k04544N3025k62680R536k68325J24588k21482J42212
$$ 683864365 683705139 684190369 684267654 684063110 684116135 683853455 683862991 683594666 683719254 683497772 683639984
2256.7F83639984J33820m3412J01014m18549J81580l10974N5389K76337J66320j4801
$$ 683639984 683773804 683730392 683831406 683412857 683594437 683283463 683338852 683615189 683781509 683766708
2266.3F83766708m39758J96610k43149P7133j57394Q9035P7285l73077K52380n42831
$$ 683766708 683326950 683523560 683280411 683357544 683200150 683289185 683366470 682993393 683245773 682702942
2275.9F82702942l84903r1858N35278J99585j69143Q7204m53492K79541l17154j09786
$$ 682702942 682318039 682226181 682761459 682961044 682791901 682879105 682425613 682705154 682388000 682278214
2285.6F82278214j9455j25428j8234m96979J40763m86451K76566k18277m54865K08512
$$ 682278214 682258759 682133331 682115097 681618118 681758881 681272430 681548996 681330719 680875854 681084366
2295.2F81084366o57578K54975j08109J11389m5089k82898r5978n29480K56271j52282
$$ 681084366 680426788 680681763 680573654 680685043 680639954 680357056 680261078 679731598 679987869 679835587
2304.9F79835587j8311n28641l62777k99149o01120L85513l4256L59040o10428k99912
$$ 679835587 679817276 679288635 678925858 678626709 678025589 678411102 678376846 678735886 678125458 677825546
2314.5F77825546J24588m91562j25274n53894J25732p31888k46734l49961n03311N570
$$ 677825546 677950134 677458572 677333298 676779404 676905136 676173248 675926514 675576553 675073242 675078812
2324.2F75078812n30014R81292q9569M31214m24042j454697K08893M8904k42385j231842
$$ 675078812 674548798 675530090 675440521 675871735 675447693 673992996 674201889 674250793 674008408 672776566
2333.8F72776566L04870l99093n62897L82156m59137l5705M42123J179123j547318
$$ 672776566 673081436 672682343 672119446 672501602 672042465 672006760 672448883 673628006 672080688
2342.5F72080688j551589l72315k4414O27136j91498Q47931Q40988M03061m07943n71366
$$ 672080688 670529099 670156784 670132370 670759506 670568008 671415939 672256927 672659988 672252045 671680679
2352.1F71680679n16891o82144n42603m93698J174698j12534l64990k680664j283264
$$ 671680679 671163788 670481644 669939041 669445343 670620041 670507507 670142517 667461853 666178589
2360.8F66178589J223678l84216J874695j036682j294937j58844M98199O11649N4931
$$ 666178589 667402267 667018051 668892746 667856064 666561127 666402283 666900482 667512131 667567062
2369.5F67567062R22089j095810O93512K41394o68945k69470q54493N06668J97678
$$ 667567062 668489151 667393341 668086853 668328247 667659302 667389832 666535339 667042007 667239685
2378.2F67239685J69601j0528K95715J74713n79376m36935p68891n4092j47171l8452
$$ 667239685 667409286 667398758 667694473 667869186 667289810 666852875 666083984 666029892 665882721 665844269
2387.8F65844269K64816n9585p9270m78592k75039l52326j84860k21176p6523l94211
$$ 665844269 666109085 666049500 665970230 665491638 665216599 664864273 664679413 664458237 664381714 663987503
2397.4F63987503p58514o9504l22647j13983m17099j85318k39869p43026j20240m70886
$$ 663987503 663228989 663159485 662836838 662722855 662305756 662120438 661880569 661137543 661017303 660546417
2407.1F60546417l08914l94211j27563k37503l45536J06965n70145m19464p09992k74734
$$ 660546417 660237503 659843292 659715729 659478226 659132690 659239655 658669510 658250046 657540054 657265320
2416.7F57265320l12348p87353M6463L8834j70746n79605j51978k6321j60904m91867
$$ 657265320 656952972 656165619 656212082 656250916 656080170 655500565 655348587 655322266 655161362 654669495
2426.4F54669495q72422k87094m42810j05057k90069n03235m93698m30603k98386o65130
$$ 654669495 653797073 653509979 653067169 652962112 652672043 652168808 651675110 651244507 650946121 650280991
2436F50280991M8675l01056m41665n01175q14820l66745j67007L3340o52008k73361
$$ 650280991 650329666 650028610 649586945 649085770 648270950 647904205 647737198 647770538 647118530 646845169
2445.7F46845169p0114l74832o85425p30209J54190l62320m41361p47146l32642J58463
$$ 646845169 646775055 646400223 645714798 644984589 645138779 644776459 644335098 643587952 643255310 643413773
2455.3F43413773o31791m09927o97098m02755j20469l45993o76803n13344k66609r07860
$$ 643413773 642781982 642372055 641674957 641272202 641151733 640805740 640128937 639615593 639348984 638441124
2465F38441124l10211j78147k17933l48778n41801n69420q74749l14369m56238m58717
$$ 638441124 638130913 637952766 637734833 637386055 636844254 636274834 635400085 635085716 634629478 634170761
2474.6F34170761n63774m36783j56746m07066m40559p17698m12178q70018p12928k13700
$$ 634170761 633606987 633170204 633013458 632606392 632165833 631448135 631035957 630165939 629453011 629239311
2484.2F29239311j81007l64952r93538j24855m09546p40662n78575p47871m68674n24597
$$ 629239311 629058304 628693352 627699814 627574959 627165413 626424751 625846176 625098305 624629631 624105034
2493.9F24105034k28195o34880l94287j39771n01480r30672j117744k99492l07312
$$ 624105034 623876839 623241959 622847672 622707901 622206421 621275749 620158005 619858513 619551201
2502.6F19551201k13738n92117o94694n28260n65071k09389q51364k23312r6855q07648
$$ 619551201 619337463 618745346 618050652 617522392 616957321 616747932 615896568 615673256 615576401 614768753
2512.2F14768753l25737j91307q13751r02672k23503o72341o45980l13912n22995n35621
$$ 614768753 614443016 614251709 613437958 612535286 612311783 611639442 610993462 610679550 610156555 609620934
2521.9F09620934k35062o1264n25932l39470p14035p38373n34935l75595j09902p81479
$$ 609620934 609385872 609324608 608798676 608459206 607745171 607006798 606471863 606096268 605986366 605204887
2531.5F05204887m85229l87573j3733j70365p06710l48130p68013p53746o90078k75727
$$ 605204887 604719658 604332085 604318352 604147987 603441277 603093147 602325134 601571388 600881310 600605583
2541.1F00605583k40173l30544n12314q66127k43377m23699k79808o51321n34706k36740
$$ 600605583 600365410 600034866 599522552 598656425 598413048 597989349 597709541 597058220 596523514 596286774
2550.8E96286774p91474m64859p33490k3040P2441n11818o21872n27420l5172q43010
$$ 596286774 595495300 595030441 594296951 594273911 594346352 593834534 593212662 592685242 592650070 591807060
2560.4E91807060p63664o88553o05049k19421l89862j89782j24130j30043p36351l93562
$$ 591807060 591043396 590354843 589749794 589530373 589140511 588950729 588826599 588696556 587960205 587566643
2570.1E87566643m88739q85391n00718n96275k36015k83699k327m44374o30913M7340
$$ 587566643 587077904 586192513 585691795 585095520 584859505 584575806 584573479 584129105 583498192 583545532
2579.7E83545532l05481n15403r17359p99332p51876l76664j411l19519o09627p96738
$$ 583545532 583240051 582724648 581807289 581007957 580256081 579879417 579878006 579558487 578948860 578152122
2589.4E78152122r2506o03332q27752o52961n36003j3771o16684m17443k11754o4773
$$ 578152122 578059616 577456284 576628532 575975571 575439568 575425797 574809113 574391670 574179916 574115143
2599E74115143k57797p13463q28324j004638k51999m00963n61638m70390l80669k43568
$$ 574115143 573857346 573143883 572315559 571310921 571058922 570657959 570096321 569625931 569245262 569001694
2608.6E69001694p66526o54144n52444n59731p53746o40869o69479o29349m31938j178627
$$ 569001694 568235168 567581024 567028580 566468849 565715103 565074234 564404755 563775406 563343468 562164841
2618.3E62164841o58417Q1520j5373k29225o85234j155053q15277k24533p61032o64635
$$ 562164841 561506424 561587944 561572571 561343346 560658112 559503059 558687782 558463249 557702217 557037582
2627.9E57037582m78782n06439l03689k9602j49116q95271q52433r73701o04591p03812
$$ 557037582 556558800 556052361 555748672 555719070 555569954 554674683 553822250 552848549 552243958 551540146
2637.6E51540146q06351k5711m53758m51203l80363n27115n80902m09355n64957r74350
$$ 551540146 550733795 550708084 550254326 549803123 549422760 548895645 548314743 547905388 547340431 546366081
2647.2E46366081n78727p46651l41263k92282m01955k38762o60514o37627q53882m39453
$$ 546366081 545787354 545040703 544699440 544407158 544005203 543766441 543105927 542468300 541614418 541174965
2656.9E41174965l02658n34744o05469l73039k89383p27120p3128m07791l94211j61094
$$ 541174965 540872307 540337563 539732094 539359055 539069672 538342552 538269424 537861633 537467422 537306328
2666.5E37306328p82395q26683r24034m26216m07562O1264Q5525o66236m88396m88129
$$ 537306328 536523933 535697250 534773216 534347000 533939438 534000702 534086227 533419991 532931595 532443466
2676.1E32443466k64511l69072k26593m44450r46465r51881p40242Q5029q9798m92897
$$ 532443466 532178955 531809883 531583290 531138840 530192375 529240494 528500252 528585281 528495483 528002586
2685.8E28002586m42085j47629m04739p37457l77655m11721m03595p16095l86772j26304
$$ 528002586 527560501 527412872 527008133 526270676 525893021 525481300 525077705 524361610 523974838 523848534
2695.4E23848534j87951l52821o93321j01929o12030p54547k21672k08244l73841o23665
$$ 523848534 523660583 523307762 522614441 522512512 521900482 521145935 520924263 520716019 520342178 519718513
2705.1E19718513l85818m07143j39618m92706n59425l28942o26373l92647n36537k20337
$$ 519718513 519332695 518925552 518785934 518293228 517733803 517404861 516778488 516385841 515849304 515628967
2714.7E15628967o6147j55525m48303n16777q1139m36325k65541l29284m43268l46604
$$ 515628967 515562820 515407295 514958992 514442215 514361076 513924751 513659210 513329926 512886658 512540054
2724.4E12540054l92570n20744m37890L13301j26876n46112n09301m68292l95889k14844
$$ 512540054 512147484 511626740 511188850 511502151 511375275 510829163 510319862 509851570 509455681 509240837
2734E09240837J717m48075k81143l23524j93978l53698n43061K7695n3329J93176l70064
$$ 509240837 509242554 508794479 508513336 508189812 507995834 507642136 507099075 507126770 507073441 507266617 506896553
2744.6E06896553o74133k35138r3041p2250k81296r2277n26429p6866J31951o59523
$$ 506896553 506222420 505987282 505894241 505821991 505540695 505448418 504921989 504845123 504977074 504317551
2754.3E04317551p03049o82030n31158k45171N88455K22702p70759p35779k90604j52855
$$ 504317551 503614502 502932472 502401314 502156143 502744598 502967300 502196541 501460762 501170158 501017303
2763.9E01017303n05790m68636q43811l59306l10288n08155R6473n30243j84250n3520
$$ 501017303 500511513 500042877 499199066 498839760 498529472 498021317 498117790 497587547 497403297 497349777
2773.5D97349777m95872n63927o35910l76244n54428m61120n25093k93808k94228n84183
$$ 497349777 496853905 496289978 495654068 495277824 494723396 494262276 493737183 493443375 493149147 492564964
2783.2D92564964n12771o15998l01666l09181l19481m92516r49707j073494n27076
$$ 492564964 492052193 491436195 491134529 490825348 490505867 490013351 489063644 487990150 487463074
2791.9D87463074k79198o46133m88739p41425n23338n64156o84585n00603r47800p96470
$$ 487463074 487183876 486537743 486049004 485307579 484784241 484220085 483535500 483034897 482087097 481290627
2801.5D81290627r80263p98455o45980n80826m51737p48710n81894r80416o91108n36194
$$ 481290627 480310364 479511909 478865929 478285103 477833366 477084656 476502762 475522346 474831238 474295044
2811.2D74295044q56323p80449q04596p88269j124916p70378p83692p57217o47660
$$ 474295044 473438721 472658272 471853676 471065407 469940491 469170113 468386421 467629204 466981544
2819.8D66981544j195602j236343j026879p55920r89113r08890r80606p69844n90515
$$ 466981544 465785942 464549599 463522720 462766800 461777687 460868797 459888191 459118347 458527832
2828.5D58527832j188698p87658p47376j006508j484604j312561q56971j243325r65156
$$ 458527832 457339134 456551476 455804100 454797592 453312988 452000427 451143456 449900131 448934975
2837.2D48934975j278878j768646j986961j631737j418266j875725k095757k455711
$$ 448934975 447656097 445887451 443900490 442268753 440850487 438974762 436879005 434423294
2844.9D34423294k055244k097130k341500k607841k504425j917267j856956r36776
$$ 434423294 432368050 430270920 427929420 425321579 422817154 420899887 419042931 418106155
2852.6D18106155p78846o91262o10771o64520k11258m94804k23351k51312l43590n17235
$$ 418106155 417327309 416636047 416025276 415360756 415149498 414654694 414431343 414180031 413836441 413319206
2862.3D13319206n27038l41339q77114p85866j091957j265449j193810j093101o75583
$$ 413319206 412792168 412450829 411573715 410787849 409695892 408430443 407236633 406143532 405467949
2870.9D05467949l98140k64397q75816r94492r80796j059876r65004m97894k23885
$$ 405467949 405069809 404805412 403929596 402935104 401954308 400894432 399929428 399431534 399207649
2879.6C99207649j047706j283074j237373j030426p37915n09835p97004j286431j012420
$$ 399207649 398159943 396876869 395639496 394609070 393871155 393361320 392564316 391277885 390265465
2888.3C90265465j233483r80033j010056j212845r84955j288147j057853p58057n99709
$$ 390265465 389031982 388051949 387041893 385829048 384844093 383555946 382498093 381740036 381140327
2897C81140327r82322j326752j191559q98781q10165q98132l68576p88308r20143o86683
$$ 381140327 380158005 378831253 377639694 376740913 375930748 375032616 374664040 373875732 372955589 372268906
2906.6C72268906r08280p68852j064606j244659j200485j329575j892662j921768j748772
$$ 372268906 371360626 370591774 369527168 368282509 367082024 365752449 363859787 361938019 360189247
2915.3C60189247j248016j140671k051468j142769r80606j425247j183128p87659k72217
$$ 360189247 358941231 357800560 355749092 354606323 353625717 352200470 351017342 350229683 349957466
2924C49957466n80864Q4038l37753k46086N13153K7198L02506q1101O7177N85671N97000
$$ 349957466 349376602 349460640 349122887 348876801 349389954 349417152 349719658 349638557 349705734 350291405 350888405
2934.6C50888405J48620K17667R36127O56051Q52280N17960Q01620J344147N54504
$$ 350888405 351037025 351254692 352190819 352846870 353699150 354217110 355018730 356362877 356917381
2943.3C56917381N29709P79228R99794R23806P13501N96771O09588K35405K21825P90558
$$ 356917381 357447090 358226318 359226112 360149918 360863419 361460190 362069778 362305183 362527008 363317566
2952.9C63317566M81758P17392N83572P04537R21135M93164N13611P6523N32646O33011
$$ 363317566 363799324 364516716 365100288 365804825 366725960 367219124 367732735 367809258 368341904 368974915
2962.6C68974915O25457R16481N12429N90400L10288N81169J282806J493378J056328
$$ 368974915 369600372 370516853 371029282 371619682 371929970 372511139 373793945 375287323 376343651
2971.2C76343651L66592L23792O42357P82508L29361O50979R34486N38368K31056K42806
$$ 376343651 376710243 377034035 377676392 378458900 378788261 379439240 380373726 380912094 381143150 381385956
2980.9C81385956N34515R4605r0218j2741l2005Q6136L90625M44183K23274L09715
$$ 381385956 381920471 382015076 381924858 381912117 381880112 381966248 382356873 382801056 383024330 383334045
2990.5C83334045k42462j96762M8638j83487J4076j56403n70984n75866k1553k33040
$$ 383334045 383091583 382894821 382943459 382759972 382774048 382617645 382046661 381470795 381449242 381216202
3000.2C81216202n57747m68865n54618n34096o41747m59480p00417o16073j50757l07236
$$ 381216202 380658455 380189590 379634972 379100876 378459129 377999649 377299232 376683159 376532402 376225166
3009.8C76225166n91697o13594m40026r05266j096992r95331n66177l96233o72607
$$ 376225166 375633469 375019875 374579849 373674583 372577591 371582260 371016083 370619850 369947243
3018.5C69947243n52864p14875l34854p90634j411934r34105n73311l89862j102714
$$ 369947243 369394379 368679504 368344650 367554016 366142082 365207977 364634666 364244804 363142090
3027.2C63142090j043320o28853q41446r79614r98421p41424p91702n75562p66258
$$ 363142090 362098770 361469917 360628471 359648857 358650436 357909012 357117310 356541748 355775490
3035.9C55775490j085129q88634j048355j042404n53551n20515j047478j079979q57315
$$ 355775490 354690361 353801727 352753372 351710968 351157417 350636902 349589424 348509445 347652130
3044.5C47652130o49757j069527j051178o70128j083908q22067q58040q39424j077843
$$ 347652130 347002373 345932846 344881668 344211540 343127632 342305565 341447525 340608101 339530258
3053.2C39530258j201935l54004n24635q75473j355591j259536q02651p05910n74379
$$ 339530258 338328323 337974319 337449684 336574211 335218620 333959084 333156433 332450523 331876144
3061.9C31876144n22003k27279j004105j185074r94720r32312l77388p07055q37783
$$ 331876144 331354141 331126862 330122757 328937683 327942963 327010651 326633263 325926208 325088425
3070.6C25088425j094284j046524q05855m99077j06659o79893q27027n79452m68865
$$ 325088425 323994141 322947617 322141762 321642685 321536026 320856133 320029106 319449654 318980789
3079.2C18980789r53026j230011r14325o66237p02324r85279n35202m72889n01976
$$ 318980789 318027763 316797752 315883427 315217190 314514866 313529587 312994385 312521496 312019520
3087.9C12019520n73521n19829n82866j335564q91571p58553o69899o32572r75380
$$ 312019520 311445999 310926170 310343304 309007740 308116169 307357616 306687717 306055145 305079765
3096.6C05079765n49717o42166p38983q66222r99489r75208m42505m02050j075249
$$ 305079765 304530048 303887882 303148899 302282677 301283188 300307980 299865475 299463425 298388176
3105.3B98388176n97191l12271m48322r73187j044884q46519j028156o67496o58970
$$ 298388176 297790985 297478714 297030392 296057205 295012321 294165802 293137646 292470150 291811180
3114B91811180l33462o56871r06697l16086o78501j037788r52129o54126r86919j270828
$$ 291811180 291477718 290820847 289914150 289598064 288919563 287881775 286929646 286275520 285288601 284017773
3123.6B84017773q82607m26140n10788r39026n18321p53689j137142o08159l01170
$$ 284017773 283135166 282709026 282198238 281259212 280740891 279987202 278850060 278241901 277940731
3132.3B77940731j098328j303978n60836q04253o91166r28326j061191m77829o42109
$$ 277940731 276842403 275538425 274977589 274173336 273482170 272553844 271492653 271014824 270372715
3141B70372715j035728j180230o62937o91585m59042m82883j082039o01979o12144
$$ 270372715 269336987 268156757 267493820 266802235 266343193 265860310 264778271 264176292 263564148
3149.6B63564148p32212n39513n49392j094990q67481m99783j159592r41124j102886
$$ 263564148 262831936 262292423 261743031 260648041 259780560 259280777 258121185 257180061 256077175
3158.3B56077175p80582m94919o43234k08893q21724q07209r26094j186257o82411
$$ 256077175 255296593 254801674 254158440 253949547 253127823 252320614 251394520 250208263 249525852
3167B49525852p87315q84686o52446m97704n97477n48267j010418j108380q32729q34045
$$ 249525852 248738537 247853851 247201405 246703701 246106224 245557957 244547539 243439159 242606430 241772385
3176.6B41772385l47157l82976m52252q82091j113415o31580o16894n11799q84667
$$ 241772385 241425228 241042252 240590000 239707909 238594494 237962914 237346020 236834221 235949554
3185.3B35949554j242809p85141k00786k69490p86323j041298p70683n59216r84383
$$ 235949554 234706745 233921604 233720818 233451328 232665005 231623707 230853024 230293808 229309425
3194B29309425q87947n71060l55587o29997n72624o4392r08375j020680o54316n25055
$$ 229309425 228421478 227850418 227494831 226864834 226292210 226227818 225319443 224298763 223644447 223119392
3203.6B23119392k92244n22785m50783m81586o03104o61296m26445o20137o42032l59707
$$ 223119392 222827148 222304363 221853580 221371994 220768890 220107594 219681149 219061012 218418980 218059273
3213.3B18059273j008301n99308j28632p38430q86573j47915p8926p11308p01637q55828
$$ 218059273 217050972 216451664 216323032 215584602 214698029 214550114 214471188 213759880 213058243 212202415
3222.9B12202415j97353p1411q18195p57714p86667o65493m60262j09997k11906l57838
$$ 212202415 212005062 211933651 211115456 210357742 209571075 208905582 208445320 208335323 208123417 207765579
3232.6B07765579m46472q10337n74226n70355n53932p85217p19471k93122k94666j85146
$$ 207765579 207319107 206508770 205934544 205364189 204810257 204025040 203305569 203012447 202717781 202532635
3242.2B02532635m32911n48954o05297n69725o80237m03061O3152l32260k29645l86257
$$ 202532635 202099724 201550770 200945473 200375748 199695511 199292450 199355602 199023342 198793697 198407440
3251.9A98407440n15060m96159m19121m29439r63230k62547j16329l87363l60547m82273
$$ 198407440 197892380 197396221 196977100 196547661 195584431 195321884 195205555 194818192 194457645 193975372
3261.5A93975372k07824o35395p61891o13327k14863N4932k31476R5081j76582p97882
$$ 193975372 193767548 193132153 192370262 191756935 191542072 191597004 191365528 191460609 191284027 190486145
3271.2A90486145o99310k51904j69964m44450m36897k77996l90225m65145J6937o3820
$$ 190486145 189786835 189534931 189364967 188920517 188483620 188205624 187815399 187350254 187367191 187303371
3280.8A87303371l34281l49083m43745m38690n45082j86043o2390l7879M4860j23996
$$ 187303371 186969090 186620007 186176262 185737572 185192490 185006447 184944057 184906178 184951038 184827042
3290.4A84827042r0142n72433q42934m98619J68591J88465q40397o59447R8076q8196
$$ 184827042 184736900 184164467 183321533 182822914 182991505 183179970 182339573 181680126 181778202 181690006
3300.1A81690006k65770j55983j8577L929j89915k55451o14433p86705k09675k32639
$$ 181690006 181424236 181268253 181249676 181253605 181063690 180808239 180193806 179407101 179197426 178964787
3309.7A78964787k31991j04466m19559l54901j94931Q0643k84729r66320m01516k0161
$$ 178964787 178732796 178628330 178208771 177853870 177658939 177739582 177454853 176488533 176087017 176066856
3319.4A76066856j94759J19991k07691r80244p50370k39811j13143l97110o73428n07088
$$ 176066856 175872097 175992088 175784397 174804153 174053783 173813972 173700829 173303719 172630291 172123203
3329A72123203l80115k81849l70197n24998m52461j48735k6799n15957n60875k21996
$$ 172123203 171743088 171461239 171091042 170566044 170113583 169964848 169938049 169422092 168861217 168639221
3338.7A68639221j56383k41280n64995o29062m48132j72977J40838j91498n16491l43284
$$ 168639221 168482838 168241558 167676563 167047501 166599369 166426392 166567230 166375732 165859241 165515957
3348.3A65515957l16067j16367j52340k58522J28918j41640o13556m78516j37481n9739
$$ 165515957 165199890 165083523 164931183 164672661 164801579 164659939 164046383 163567867 163430386 163370647
3357.9A63370647p152K40593J16596N3558k05516k99797J02157n417P2060K9755l94516
$$ 163370647 163363495 163604088 163720684 163774242 163568726 163268929 163371086 163365669 163437729 163467484 163072968
3368.6A63072968l65448k76585J09730L37562n06897p10602J81485M22420J76792j08070
$$ 163072968 162707520 162430935 162540665 162878227 162371330 161660728 161842213 162264633 162441425 162333355
3378.2A62333355l40881o07186m54750M59233M40406J41640J58329j38855J77879J22281
$$ 162333355 161992474 161385288 160930538 161389771 161830177 161971817 162130146 161991291 162169170 162291451
3387.8A62291451l11471J79940L80783k40689j27525K09427j29280J53046J97277k41547
$$ 162291451 161979980 162159920 162540703 162300014 162172489 162381916 162252636 162405682 162602959 162361412
3397.5A62361412k07920l00159N6991J54667r8743J73130j11790M8504K98137L0957
$$ 162361412 162153492 161853333 161910324 162064991 161966248 162139378 162027588 162076092 162374229 162405186
3407.1A62405186L10440J08967M8275K26745n0373M6997K45323J26877K7428O15883
$$ 162405186 162715626 162824593 162872868 163099613 163049240 163096237 163341560 163468437 163495865 164111748
3416.8A64111748N11360o2065J98478J35479M34208M82560n9681Q6403M24900M14161
$$ 164111748 164623108 164561043 164759521 164895000 165329208 165811768 165752087 165838490 166263390 166677551
3426.4A66677551L4161P6465J85433J35746J89857K46048M70677N27592M73785K93980
$$ 166677551 166711712 166788177 166973610 167109356 167299213 167545261 168015938 168543530 169017315 169311295
3436.1A69311295J68190J70097P50675P83138J29662L30143p9937J92947P73774R45453
$$ 169311295 169479485 169649582 170400257 171183395 171313057 171643200 171563263 171756210 172529984 173475437
3445.7A73475437J272965k07711j72882P21016N41554L54557j62583M60892J258450
$$ 173475437 174748402 174540691 174367809 175088825 175630379 175984936 175822353 176283245 177541695
3454.4A77541695J070022L68119Q8748M21219N83935Q76598P30896K69337M9000N05257
$$ 177541695 178611717 178979836 179068584 179489803 180073738 180950336 181681232 181950569 181999569 182504826
3464A82504826O39534K80780P21035R03740M16317L99475J014347P25384P18403J080570
$$ 182504826 183144360 183425140 184146175 185049915 185466232 185865707 186880054 187605438 188323841 189404411
3473.7A89404411N82867M97246q20N96923J058274K40230O99787P31183N28831N52826
$$ 189404411 189987278 190484524 190483704 191080627 192138901 192379131 193078918 193810101 194338932 194891758
3483.3A94891758J002884J296768P02057R88960P10278N19447J059475O55842L67031
$$ 194891758 195894642 197191410 197893467 198882427 199592705 200112152 201171627 201827469 202194500
3492B02194500O37150Q41694J089344J000557M90360Q28953R38415O24199P55940R99565
$$ 202194500 202831650 203673344 204762688 205763245 206253605 207082558 208020973 208645172 209401112 210400677
3501.6B10400677J211090M53262K64454J187668J156196R17435J324959K68955k30751
$$ 210400677 211611767 212065029 212329483 213517151 214673347 215590782 216915741 217184696 216953945
3510.3B16953945J721287J595478O16779O64597J078949R85412Q61283J331749Q71372
$$ 216953945 218675232 220270710 220887489 221552086 222631035 223616447 224477730 225809479 226680851
3519B26680851J126022J243439J398907J271667k24209P25117J327934J394558J374493
$$ 226680851 227806873 229050312 230449219 231720886 231496677 232221794 233549728 234944286 236318779
3527.7B36318779J169701J338367Q44383R68285R57184J295986J017685J154995J536999
$$ 236318779 237488480 238826847 239671230 240639515 241596699 242892685 243910370 245065365 246602364
3536.4B46602364M19750J052761J660900J658859J184235R85966J299400J424656J388779
$$ 246602364 247022114 248074875 249735775 251394634 252578869 253564835 254864235 256288891 257677670
3545B57677670R47799K079926J679477J248017J219597J382789J906357R26209J854305
$$ 257677670 258625469 260705395 262384872 263632889 264852486 266235275 268141632 269067841 270922146
3553.7B70922146Q84533J248398K337226J374665J912365J286792J594124J275959
$$ 270922146 271806679 273055077 275392303 276766968 278679333 279966125 281560249 282836208
3561.4B82836208K036896K219257Q64373L260994J214409J119155K213231O38332K509556
$$ 282836208 284873104 287092361 287956734 291217728 292432137 293551292 295764523 296402855 298912411
3570.1B98912411J402187K133045K593804J898708J373901J511345K337056J229705
$$ 298912411 300314598 302447643 305041447 306940155 308314056 309825401 312162457 313392162
3577.8C13392162K352391K406025J796798K190266J620483J503182K120018L996010
$$ 313392162 315744553 318150578 319947376 322137642 323758125 325261307 327381325 331377335
3585.5C31377335J798629m15687J344604R56421L631668L141709K941208K620239J762581
$$ 331377335 333175964 332760277 334104881 335061302 338692970 341834679 344775887 347396126 349158707
3594.2C49158707K943687P7515K098083L834877J974106L025742J923217K122002K542915
$$ 349158707 352102394 352179909 354277992 358112869 360086975 363112717 365035934 367157936 369700851
3602.9C69700851J260910K758561M067917K960281N27077M121894K045136J31569O250038
$$ 369700851 370961761 373720322 377788239 380748520 381275597 385397491 387442627 387574196 393824234
3611.6C93824234K703209m49600L220749Q18061L970604L851929J959305L473015J237373
$$ 393824234 396527443 396077843 399298592 400116653 404087257 407939186 409898491 413371506 414608879
3620.3D14608879J814308L892288L682976K622643L055000L001022L738594O194573
$$ 414608879 416423187 420315475 423998451 426621094 429676094 432677116 436415710 442610283
3628D42610283J096458n320968M125671O105385N885315K591019N40733L370857M065971
$$ 442610283 443706741 438385773 442511444 448616829 454502144 457093163 457633896 461004753 465070724
3636.6D65070724K906762K014312L091469L793259L707008K440682J639099L679046
$$ 465070724 467977486 469991798 473083267 476876526 480583534 483024216 484663315 488342361
3644.4D88342361M728203N099945o55822j387215P939529L301278j861382P52907N696182
$$ 488342361 493070564 498170509 497514687 496127472 504067001 507368279 505506897 506259804 511955986
3653E11955986M992256M358826N688019m709435K535935N851173K349930K833366J451111
$$ 511955986 516948242 521307068 526995087 522285652 524821587 530672760 533022690 535856056 537307167
3661.7E37307167L261490K476273K019882K494507J559791M928551K422066J28440
$$ 537307167 540568657 543044930 545064812 547559319 549119110 554047661 556469727 556598167
3669.4E56598167J353264l971176M067536Q392982R012108J8234j5238571K487717
$$ 556598167 557951431 553980255 558047791 566440773 575452881 575471115 560232544 562720261
3677.1E62720261P281952M416847j363602J652680L444252K251853J723710J204910
$$ 562720261 570002213 574419060 573055458 574708138 578152390 580404243 582127953 583332863
3684.9E83332863J037369L682632O012878q147735k796211P570381m434166Q26111
$$ 583332863 584370232 588052864 594065742 585918007 583121796 590692177 586258011 587084122
3692.6E87084122N537681J160126J605797R43374p019Q80280K92397K817039L474998
$$ 587084122 592621803 593781929 595387726 596331100 596324081 597204361 597496758 600313797 603788795
3701.3F03788795m495086j271706N160752K162094N56564L07617J908417L590736n857658
$$ 603788795 599293709 598022003 603182755 605344849 605901413 606209030 608117447 611708183 605850525
3709.9F05850525K865333M343415j0142632N059967M373856m85115O06270K254676
$$ 605850525 608715858 613059273 602916641 607976608 612350464 611865349 612471619 614726295
3717.7F14726295J942521k376480R00421N125427l534660l605881M626198N02853k86827
$$ 614726295 616668816 614292336 615192757 620318184 616783524 613177643 617803841 618306694 618019867
3726.3F18019867j767273K38037L413506J211013O182328k094040p989693Q713760
$$ 618019867 616252594 616490631 619904137 621115150 627297478 625203438 617213745 625927505
3734F25927505P91359q843421J218223K895966L02086J832885L392983l105698L040352
$$ 625927505 626718864 617875443 619093666 621989632 622291718 624124603 627517586 624411888 627452240
3742.7F27452240J1695061j0634423j5861396R937858N195313N484161k245788r514237
$$ 627452240 639147301 628512878 612651482 622589340 627784653 633268814 631023026 621508789
3750.4F21508789J0209198n340729o672897O639099M711266L170166m847298K066383
$$ 621508789 631717987 626377258 619704361 626343460 631054726 634224892 629377594 631443977
3758.2F31443977M874497p573738j138916M064483J534577L49846K646522l428497
$$ 631443977 636318474 628744736 627605820 631670303 633204880 633554726 636201248 632772751
3765.9F32772751l926392M214134M874268J40533q896026J745758L762970Q91571J243019
$$ 632772751 628846359 633060493 637934761 638075294 629179268 630925026 634687996 635579567 636822586
3774.5F36822586n84106N31730j83372K170448J95618o605377K950019J899949O22520
$$ 636822586 636238480 636770210 636586838 638757286 638952904 632347527 635297546 637197495 637820015
3783.2F37820015K003365k886506q51974J516876P04155J98479J61094Q46825N6839
$$ 637820015 639823380 636936874 636084900 637601776 638305931 638504410 638665504 639512329 639569168
3791.9F39569168M17023K26135J173935K842026l713150m029808J573257L008919N490265
$$ 639569168 639986191 640212326 641386261 644228287 640515137 636485329 638058586 641067505 646557770
3800.6F46557770m895630r332466L327255K365532M628372N704270q926430m716416
$$ 646557770 641662140 632329674 635656929 638022461 642650833 648355103 639428673 634712257
3808.3F34712257M592286K103004R13467Q01087o73065Q43582M342880k256927j1987839
$$ 634712257 639304543 641407547 642321014 643122101 642449036 643292618 647635498 645378571 633390732
3817F33390732M887581N841636L613663N69000j5534820K595520N467605K052613L206024
$$ 633390732 638278313 644119949 647733612 648302612 632767792 635363312 640830917 642883530 646089554
3825.7F46089554l13416m919967k84577K610169L506622N14297p866630K140083O699295
$$ 646089554 645776138 640856171 640571594 643181763 646688385 647202682 639336052 641476135 648175430
3834.3F48175430m858322K89231Q445968r340668n417251P295303l655090N9433N908737
$$ 648175430 643317108 643606339 652052307 642711639 637294388 644589691 640934601 640994034 646902771
3843F46902771k078934l591156K276230J662674L76968J521836j268463J485748N046005
$$ 646902771 644823837 641232681 643508911 645171585 645548553 647070389 645801926 647287674 652333679
3851.7F52333679o155929J129760j3437576O77300J0126304o64139j125183J963959
$$ 652333679 646177750 647307510 633869934 634547234 644673538 644009399 642884216 644848175
3859.4F44848175J789398K082749n342484M71497N841751n526123m418411M028472
$$ 644848175 646637573 648720322 643377838 643849335 649691086 644164963 639746552 643775024
3867.1F43775024M280472M461289n911103q584442L104859N832443K177887j0483627
$$ 643775024 648055496 652516785 646605682 638021240 641126099 646958542 649136429 638652802
3874.8F38652802J347503M844361P1411K429351L912659n209350o649933M507522R48410
$$ 638652802 640000305 644844666 644916077 647345428 651258087 646048737 639398804 643906326 644854736
3883.5F44854736J292725M485474j1595803J672554N094605N89676K977218j305313
$$ 644854736 646147461 650632935 639037132 640709686 645804291 646393967 649371185 648065872
3891.2F48065872p007904J102371K720948j300736Q91495Q99429K146607J472091q775253
$$ 648065872 641057968 642160339 644881287 643580551 644472046 645371475 647518082 648990173 640214920
3899.9F40214920M490356J389313m460449L884888l043747J16729O20957M24347J836166
$$ 640214920 644705276 646094589 641634140 645519028 642475281 642592010 643212967 643637314 645473480
3908.6F45473480j40686K89078p34940K3728M42276k78321N91813J361847k708207
$$ 645473480 645332794 645621872 644886932 644910660 645352936 645074615 645666428 647028275 644320068
3917.3F44320068l454055L728256K61230l160019K380982J913528J95084j936417j710281
$$ 644320068 640866013 644594269 644855499 641695480 644076462 645989990 646185074 644248657 642538376
3926F42538376J292496J028213N84869q65173j25351J749802k736588j621933K178574
$$ 642538376 643830872 644859085 645443954 644578781 644453430 646203232 643466644 641844711 644023285
3934.6F44023285K09885l77427k55050p09229l85971N69992K069855L65677l245239
$$ 644023285 644233170 643855743 643600693 642891464 642505493 643075485 645145340 645511017 642265778
3943.3F42265778p88727Q58154O68106M07562j688690J178360J296387j451645J476975
$$ 642265778 641477051 642335205 643003311 643410873 641722183 642900543 644196930 642745285 644222260
3952F44222260L3111p14569N60532j6022K19803r14994j91650J42975K10876k45514
$$ 644222260 644255371 643540802 644101334 644085312 644305115 643390121 643198471 643341446 643552322 643306808
3961.6F43306808j525650L58353P82089L01209r2697l3875O60706l45459n93872O82296
$$ 643306808 641781158 642139511 642921600 643222809 643130112 643096237 643756943 643411484 642817612 643499908
3971.3F43499908K73743p95669j64795q5907J2054M16794O43005K97165q01773n08880
$$ 643499908 643773651 642977982 642813187 642727280 642739334 643156128 643799133 644096298 643294525 642785645
3980.9F42785645j66703N9891J29547k823j03531J7777M2572m31519M18320K58789
$$ 642785645 642618942 642678833 642808380 642805557 642702026 642719803 642762375 642330856 642749176 643007965
3990.6F43007965j88522j17111K19650N24826l28903k29l83377O6070M63867R7046
$$ 643007965 642819443 642702332 642921982 643446808 643117905 643117676 642734299 642800369 643264236 643361282
4000.2F43361282
$$ 643361282
##END=$$ End of the data block
