##TITLE=$$ Begin of the data block
##JCAMP-DX=5.00 $$ ACD/SpecManager v 10.08
##SPECTROMETER/DATA SYSTEM=Varian
##DATE=15 Jan 2013 11:10:34
##DATA TYPE=INFRARED SPECTRUM
##DATA CLASS=XYDATA
##ORIGIN=
##OWNER=
##NPOINTS=3735
##FIRSTX=399.26403809
##LASTX=4000.35498047
##MAXX=4000.35498047
##MINX=399.26403809
##MAXY=70.38643646
##MINY=16.20321655
##XFACTOR=1.0000000000
##YFACTOR=0.000000100000000
##FIRSTY=37.09418869
##DELTAX=0.96440572
##XUNITS=1/CM
##YUNITS=TRANSMITTANCE
##XYDATA=(X++(Y..Y))
399.3C70941887J70898m553299k256469J381988m282532j82685N601692J646957j04523
$$ 370941887 371112785 366559486 364303017 365685005 361402473 361219788 366821480 368468437 368363914
407.9C68363914K477456L231582p17277p891922p473679M05579N009804m83475n42755
$$ 368363914 370841370 374072952 373355675 365463753 357990074 358395653 363405457 362921982 362379227
416.6C62379227K356147j44920M822273o216507m131240n38674q99467L658180Q7509
$$ 362379227 364735374 364590454 369412727 363196220 359064980 358526306 357626839 361285019 361372528
425.3C61372528m026298k78588L337479N045395k76871o155663m158210J98288K450676
$$ 361372528 357346230 357067642 360405121 365450516 365173645 359017982 354859772 355058060 357508736
434C57508736J460876J223259K62985l837356J133041J859017k781144K838288K824211
$$ 357508736 358969612 360192871 360455856 356618500 357751541 359610558 356829414 359667702 362491913
442.7C62491913k178078j026306R64622K426682p50923m022598k209015N21545l935432
$$ 362491913 360313835 359287529 360252151 362678833 361927910 357905312 355696297 356217842 352282410
451.3C52282410j488304O630058J164131k482605q44154L677215K200814n686722j927147
$$ 352282410 350794106 357424164 358588295 356105690 355261536 358938751 361139565 355452843 353525696
460C53525696K42576J858521O99348k235145k529030l213654j987266M763985N645065
$$ 353525696 353768272 355626793 356326141 354090996 351561966 348348312 346361046 351125031 356770096
468.7C56770096k262078k274322J388245n697670q211289J798973L072586j598053
$$ 356770096 354508018 352233696 353621941 347924271 339712982 341511955 344584541 342986488
476.4C42986488k916031J253586K151757j121254j61782o69403k138519j858940K13241
$$ 342986488 340070457 341324043 343475800 342354546 342192764 341523361 339384842 337525902 337739143
485.1C37739143J418381k1248M13666q51479r4871O9275l75481J612663k064247l60794
$$ 337739143 339157524 339136276 339549942 338698463 338603592 338672867 338297386 339910049 337845802 337485008
494.7C37485008K035141n19371j273880j466560J199798n1841k041893J460571o5346
$$ 337485008 339520149 339000778 337726898 336260338 337460136 337408295 335366402 336826973 336761627
503.4C36761627l623199j888466K301330L091507N13688j972161m241676r94377K261810
$$ 336761627 333138428 331249962 333551292 336642799 337156487 335184326 330942650 329948273 332210083
512.1C32210083j430435j346893L00865k430268r29641J397361J667519N09911m127160
$$ 332210083 330779648 329432755 329733620 327303352 326373711 327771072 329438591 329948502 325821342
520.8C25821342l691139J442757K023582k070579k364655j447830l52554P26356m35524
$$ 325821342 322130203 323572960 325596542 323525963 321161308 319713478 319360924 320087280 319651756
529.5C19651756k6798J354351k29378j927890J10359L51886j068248n61333M27742
$$ 319651756 319624958 320979309 320749931 318822041 318932400 319284286 318216038 317654705 318082447
538.1C18082447J294975p44400j817836j042614m24405M95778J72443o94008j228752
$$ 318082447 319377422 318633022 316815186 315772572 315348167 315843945 316016388 315322380 314093628
546.8C14093628k28100m44908n760O9179j147537O03275J0662j682739j298179l72715
$$ 314093628 313865528 313420620 313414860 313484039 312336502 312939777 312950439 311267700 309969521 309596806
556.5C09596806o62899j378231n93167m69265L06606N73674P82718L30067j04027Q23250
$$ 309596806 308933907 307555676 306962509 306493244 306799850 307373524 308156242 308486309 308382282 309205532
566.1C09205532M82559J07174j414795m56543R00994p66354l03535r23348j93252K288322
$$ 309205532 309688091 309795265 308380470 307923927 308824921 308058567 307755032 306831684 306638432 308926754
575.8C08926754J186295o98281j150989j583577k317428J51539K504043O98243j15223
$$ 308926754 310113049 309414768 308263779 306680202 304362774 304514313 307018356 307716599 307601376
584.4C07601376O77814M8466P1640L07121K09732j29070j605263m76665K355098J631203
$$ 307601376 308279190 308327656 308399296 308706417 308916149 308787079 307181816 306705151 309060249 310691452
594.1C10691452o10542j08185J354656O13403L52021j087857k293663K78874N95989
$$ 310691452 310080910 309972725 311327381 311940784 312292805 311204948 308911285 309190159 309786148
602.8C09786148o05698K94266M75064l45574p94067r72653q01449p59201o06918n43938
$$ 309786148 309180450 309474716 309949780 309604206 308810139 307837486 307036037 306276836 305669918 305125980
612.4C05125980L4218J96095j735478n72414J088161l39927j32408q6174J34239K50892
$$ 305125980 305160198 305356293 303620815 303048401 304136562 303796635 303664227 303578053 303712292 303963184
622C03963184J37158J002445K8934L17059K459335J748505P92160J893787J748162
$$ 303963184 304100342 305102787 305131721 305448780 307908115 309656620 310448780 312342567 314090729
630.7C14090729N48744O63128J496277J582260J813183J775589J438217J232567N86624
$$ 314090729 314639473 315302601 316798878 318381138 320194321 321969910 323408127 324640694 325227318
639.4C25227318K078399K069931L75634J339187J582528J54266j02310J435966J763649
$$ 325227318 327305717 329375648 329751282 331090469 332672997 332827263 332724953 334160919 335924568
648.1C35924568J088753n7106l07770K155151J962891O5117r15337j159935p2555R74312
$$ 335924568 337013321 336956215 336648445 338803596 340766487 340831604 339916267 338756332 338683777 339658089
657.7C39658089J573562J09139p93762M61692j25770j539078j116218M94461Q41293
$$ 339658089 341231651 341340790 340547028 341008720 340882950 339343872 338227654 338722115 339563408
666.4C39563408k027893k601662N310860J140404q5221J103478J110153L94516P76367
$$ 339563408 337535515 334933853 340244713 341385117 341299896 342403374 343513527 343908043 344684410
675.1C44684410J387329J093140J247749K193299J066741k57186J154060J909065J222458
$$ 344684410 346071739 347164879 348412628 350605927 351672668 351415482 352569542 354478607 355701065
683.8C55701065R20372O74553P52068J109161J971168J244011q8043R79080J685257
$$ 355701065 356621437 357295990 358048058 359157219 361128387 362372398 362284355 363263435 364948692
692.4C64948692J397019J011657J344910M42658j507874l91846J004029J186371J111450
$$ 364948692 366345711 367357368 368702278 369144936 367637062 367245216 368249245 369435616 370547066
701.1C70547066N97877R47800K001877J653404L35884O05126Q81156P92160O40030
$$ 370547066 371144943 372092743 374094620 375748024 376083908 376689034 377570190 378362350 379002380
709.8C79002380N93262J204529R75265N50995J088791J698761J081581P90940Q34999
$$ 379002380 379595642 380800171 381775436 382326431 383415222 385113983 386195564 386986504 387821503
718.5C87821503P68318K8000p63626Q93020O62957K21405J199646J447448K216873
$$ 387821503 388589821 388617821 387854195 388747215 389410172 389631577 390831223 392278671 394495544
727.2C94495544J714745J117630N53932L51143Q73604L95698r4604O92825J798897
$$ 394495544 396210289 397327919 397881851 398232994 399106598 399502296 399407692 400100517 401899414
735.8D01899414Q77419O77528P37381K34909n3215k04926J477051J656838N16166k00615
$$ 401899414 402776833 403454361 404191742 404426651 404373436 404168510 405645561 407302399 407818565 407617950
745.5D07617950M46969J419525J259651J368599K92587P629K06795Q69713J391563
$$ 407617950 408064919 409484444 410744095 412112694 412405281 412412910 412619705 413489418 414880981
754.2D14880981K54403J126899K103577J798096J236114P07360O82487J272964J814118
$$ 414880981 415135384 416262283 418365860 420163956 421400070 422107430 422789917 424062881 425876999
762.8D25876999J300316L77235M30107J830712R02748r2011L57361L11966J65749p54280
$$ 425876999 427177315 427554550 427984657 429815369 430718117 430626106 430983467 431295433 431461182 430706902
772.5D30706902o44722o67000q3466K29225J58348J110192K58026K65541N20782j53045
$$ 430706902 430062180 429395180 429311714 429540939 429699287 430809479 431067505 431333046 431853828 431700783
782.1D31700783l94173O64368J344185j48850l6087J210480J225510m46663l11699
$$ 431700783 431306610 431970978 433315163 433166313 433130226 434340706 435566216 435119553 434807854
790.8D34807854K23541m46777N08575J26114j9951m12598j710205j448326k64930l09945
$$ 434807854 435031395 434584618 435093193 435219307 435199356 434786758 433076553 431628227 431363297 431053352
800.5D31053352j751098j772728j296807j331100k721787k285728j210861k029915
$$ 431053352 429302254 427529526 426232719 424901619 422179832 419894104 418683243 416653328
808.2D16653328k205010k962226k113648j515350j597443j239662j802788j918335
$$ 416653328 414448318 411486092 409372444 407857094 406259651 405019989 403217201 401298866
815.9D01298866k051315l26386N34707l37601n25284k31934J426697J856079J796456
$$ 401298866 399247551 398921165 399455872 399118271 398592987 398361053 399787750 401643829 403440285
824.6D03440285J949196K019081L263435M107781L370780K654000L587608K666931
$$ 403440285 405389481 407408562 410671997 414779778 418150558 420804558 424392166 427059097
832.3D27059097J659088L365593M345322K737465K159347K804566J691627K116166
$$ 427059097 428718185 432083778 436429100 439166565 441325912 444130478 445822105 447938271
840D47938271K333030K784691K399101J208725K057305J500587J889153J401443J411514
$$ 447938271 450271301 453055992 455455093 456663818 458721123 460221710 462110863 463512306 464923820
848.7D64923820K149125J549949J202469P00874K062607J630745J908341K710952K197342
$$ 464923820 467072945 468622894 469825363 470526237 472588844 474219589 476127930 478838882 481036224
857.4D81036224K254029J679344J402893M20685J600837J711464R55964J64947o70280
$$ 481036224 483290253 484969597 486372490 486793175 488394012 490105476 491061440 491226387 490556107
866D90556107K78015n87464L9063r14307r48524j91307j444359j085396k051315k198372
$$ 490556107 490834122 490246658 490285721 489371414 488422890 488231583 486787224 485701828 483650513 481452141
875.7D81452141j837883m32549n31578j179580k44980r15833r82246j607247j006965
$$ 481452141 479614258 479181709 478650131 477470551 477225571 476309738 475327492 473720245 472713280
884.4D72713280j049919q09250l59116j156387j034699j714248k00196k85453k72599
$$ 472713280 471663361 470854111 470494995 469338608 468303909 466589661 466389465 466104012 465831413
893D65831413k16713j090278J38282j40953P95174o32248j552772n72777p18651p6332
$$ 465831413 465614700 464524422 464662704 464521751 465316925 464684677 463131905 462559128 461840477 461764145
902.7D61764145l22571J623688J989746J865196K075615J263313J553460O41937P53059
$$ 461764145 461441574 463065262 465055008 466920204 468995819 470259132 471812592 472454529 473207588
911.4D73207588M91905M82102m76914j444015j429825k539520k444878k826919k796898
$$ 473207588 473699493 474181595 473704681 472260666 470830841 468291321 465846443 463019524 460222626
920D60222626l047905k884941l116913k943115k153588l628044l369522m106941m215775
$$ 460222626 457174721 454289780 451172867 448229752 446076164 442448120 439078598 434971657 430755882
928.7D30755882l122177l365478k431069j970100j679306j791916j770973j376458
$$ 430755882 427633705 424268227 421837158 419867058 418187752 416395836 414624863 413248405
936.4D13248405j108436j192360j392937r46159j677780j682091j058388o18973m71191
$$ 413248405 412139969 410947609 409554672 408608513 406930733 405248642 404190254 403571281 403100090
945.1D03100090q25348j076012j154327j43318j78871P629n2528q85811r25331j793518
$$ 403100090 402274742 401198730 400044403 399901085 399722214 399729843 399677315 398791504 397866173 396072655
954.8C96072655j894150j667976j549492k293969l341865l154450k698822k169342
$$ 396072655 394178505 392510529 390961037 388667068 385325203 382170753 379471931 377302589
962.5C77302589k156601j973075j996231j974793k427673k758255k111626k120628
$$ 377302589 375145988 373172913 371176682 369201889 366774216 364015961 361904335 359783707
970.2C59783707k154541l303414l587265k697105k883949k935601l726959m537811
$$ 359783707 357629166 354325752 350738487 348041382 345157433 342221832 338494873 333957062
977.9C33957062m293938m009781m658432n149345m742165n261402n888061n567551
$$ 333957062 329663124 325653343 320994911 315845566 311103401 305841999 299953938 294386387
985.6B94386387n264321m849395m998760m872361m441051m402237l958817m127922
$$ 294386387 289122066 284272671 279273911 274401550 269960499 265558262 261599445 257471523
993.3B57471523l411331l394318l423786l043689l457203k882443l659992k836227
$$ 257471523 254060192 250665874 247242088 244198399 240741196 237858753 234198761 231362534
1001.1B31362534k092648k221298j665306k620983k461091k299194j450939j417103
$$ 231362534 229269886 227048588 225383282 222762299 220301208 218002014 216551075 215133972
1008.8B15133972j382580j005592k071247j576119j609630j919117k223873k068138
$$ 215133972 213751392 212745800 210674553 209098434 207488804 205569687 203345814 201277676
1016.5B01277676k149830j805039j586837k490960j815376k856369j980171j446991
$$ 201277676 199127846 197322807 195735970 193245010 191429634 188573265 186593094 185146103
1024.2A85146103k157517j023101j214276j229648j911965j175403j620598j048851
$$ 185146103 182988586 181965485 180751209 179521561 177609596 176434193 174813595 173764744
1031.9A73764744l6869o46420Q54130j81522M19273R31740J215477J516132Q25634
$$ 173764744 173727875 173081455 173935585 173754063 174173336 175105076 176320553 177836685 178662319
1040.6A78662319K280140J473961M77009j74046J004734N92938r94473k38342r37061
$$ 178662319 180942459 182416420 182893429 182719383 183724117 184317055 183322582 183084240 182147179
1049.3A82147179l74585n88588j172314j801414k94476R9335j609459O60953R6360
$$ 182147179 181772594 181184006 180011692 178210278 177915802 178015137 176405678 177066631 177162991
1058A77162991j12496J36585Q59185K133598J887264K050762O61583K180310K344837
$$ 177162991 177050495 177187080 178046265 180179863 182067127 184117889 184779472 186959782 189304619
1066.6A89304619K238159K372360O72703Q28953R12227J357117K71607P54966J221199
$$ 189304619 191542778 193915138 194587841 195416794 196329021 197686138 197957745 198712711 199933910
1075.3A99933910O43235P80487p63N52730L22323R49879J085777J051254J041890N43155
$$ 199933910 200577145 201357632 201356869 201909599 202231922 203181801 204267578 205318832 206360722 206903877
1085B06903877J238995J031341J303368O90937J629467K021980J392022J430511P98798
$$ 206903877 208142872 209174213 210477581 211168518 212797985 214819965 216211987 217642498 218441296
1093.6B18441296K259807J811981R00078O18191J201267J602650J163559J879940L48244
$$ 218441296 220701103 222513084 223413162 224031353 225232620 226835270 227998829 229878769 230227013
1102.3B30227013M87442J442852K072582K355251J554661J318188R460L64933R71184
$$ 230227013 230714455 232157307 234229889 236585140 238139801 239457989 239467449 239832382 240803566
1111B40803566R45892P51572J449528J974010N59979P52353M27494J36357p3605J61114
$$ 240803566 241749458 242501030 243950558 245924568 246484547 247236900 247664394 247800751 247727146 247888260
1120.6B47888260N35450p4577O52713J57891q9341N4493J089936K541408K126160J828861
$$ 247888260 248423710 248349133 249001846 249159737 249070396 249124889 250214825 252756233 254882393 256711254
1130.3B56711254J325188J310730J756592K642421K638436K802429K432403J339722
$$ 256711254 258036442 259347172 261103764 263746185 266384621 269187050 271619453 272959175
1138B72959175K028713K250653K995643K051888N04207R23024J023273P96795K70100
$$ 272959175 274987888 277238541 280234184 282286072 282790279 283713303 284736576 285533371 285803471
1146.7B85803471N77087L06931J91879K15969l44544o3800k50340j3199m30145p31907
$$ 285803471 286380558 286687489 286879368 287095337 286750793 286686993 286436653 286423454 285993309 285261402
1156.3B85261402m16393q20580n89237p96013p19795r7885J33057Q6555R42211J891003
$$ 285261402 284845009 284024429 283435192 282639179 281919384 281821499 281954556 282041111 282983322 284874325
1166B84874325J694336J878109K100429K593575L179149L478566K746734K613259L542423
$$ 284874325 286568661 288446770 290547199 293140774 296319923 299798489 302545223 305158482 308700905
1174.6C08700905L854790L132553K292652K971210L229637L661042K947769J902695
$$ 308700905 312555695 315688248 317980900 320952110 324181747 327842789 330790558 332693253
1182.4C32693253K395134K191467J862907J285057J406174J585846J266556P83996
$$ 332693253 335088387 337279854 339142761 340427818 341833992 343419838 344686394 345470390
1190.1C45470390M92058J83678r72252p79877k55508m56009q13751j106186j053429
$$ 345470390 345962448 346146126 345173874 344393997 344138489 343682480 342868729 341762543 340709114
1198.8C40709114j126022j266365j763802j688080j275749j618195j596260p27310
$$ 340709114 339583092 338316727 336552925 334864845 333589096 331970901 330374641 329647331
1206.5C29647331l31383j101226q57087j02691m67949m86298m66270o96755q51593
$$ 329647331 329315948 328214722 327357635 327254944 326786995 326300697 325834427 325137672 324286079
1215.1C24286079p87201l84902k11449n24979o98356k92969j58577l73306r47781j061230
$$ 324286079 323498878 323113976 322902527 322377548 321679192 321386223 321227646 320854340 319906559 318845329
1224.8C18845329p10239q58002p86323p73163o72264n74227o34823r94854j321220
$$ 318845329 318135090 317277088 316490765 315717602 315045338 314471111 313836288 312841434 311520214
1233.5C11520214p53708o79836l13816j66245n44548k34642l48167k63806j16081k56843
$$ 311520214 310766506 310086670 309772854 309606609 309062061 308827419 308479252 308215446 308099365 307842522
1243.1C07842522m77276m33464o56319q07285l37715n32036q9016p6065m03271k09389
$$ 307842522 307365246 306931782 306275463 305468178 305130463 304598427 304509411 304433346 304030075 303820686
1252.8C03820686k62241j4114k79389r6493j72958k79751j01108k44427K77023L67546
$$ 303820686 303558445 303544331 303264942 303168449 302995491 302715740 302614632 302370205 302647228 303014774
1262.4C03014774L93448K55757O57367P78847M43172Q00210O17752Q22010Q71791R68400
$$ 303014774 303408222 303663979 304321346 305100193 305543365 306343575 306961327 307783337 308655128 309623528
1272C09623528J197223J245918J320897Q17432R28020J561432J668129J051083R91993
$$ 309623528 310820751 312066669 313387566 314204998 315133018 316694450 318362579 319413662 320405655
1280.7C20405655J573944J887436J709328J547508J755447J645966J492767J258621
$$ 320405655 321979599 323867035 325576363 327123871 328879318 330525284 332018051 333276672
1288.4C33276672J243325J330146J514817J218223R19609J179810J053123J187973
$$ 333276672 334519997 335850143 337364960 338583183 339502792 340682602 341735725 342923698
1296.2C42923698J114922Q42590M68369M72069L93905L2502K08663n3291L471J25046
$$ 342923698 344038620 344881210 345349579 345821648 346215553 346248055 346456718 346403427 346406898 346531944
1305.8C46531944K88544o1684o92978l05595j92184m24767q56705q23173q69980o96716
$$ 346531944 346820488 346758804 346065826 345760231 345568047 345143280 344286575 343463402 342593422 341896706
1315.4C41896706k5940N28259J058960O63643P50084O39152N55878J141014Q68988
$$ 341896706 341870766 342399025 343457985 344121628 344871712 345510864 346066742 347207756 348076744
1324.1C48076744Q68187O98280M98391N28488M08058m10576q71963n39933m74777P6828
$$ 348076744 348944931 349643211 350141602 350670090 351078148 350667572 349795609 349255676 348780899 348857727
1333.8C48857727k11449n80482m66232k42310L42636K21596L82271P58247Q07266M36592
$$ 348857727 348646278 348065796 347599564 347357254 347699890 347921486 348303757 349062004 349869270 350305862
1343.4C50305862M90418N43480L98712Q28438M86755N58510J50185l1319J35536j79252
$$ 350305862 350796280 351339760 351738472 352566910 353053665 353612175 353762360 353731041 353866577 353687325
1353.1C53687325k79198r83353p26852j79100R3422m13247l62892k98576r18503m46892
$$ 353687325 353408127 352424774 351697922 351518822 351612244 351198997 350836105 350537529 349619026 349172134
1362.7C49172134j167183l61328n16472o87980k75765q66203m22211o60705l35922
$$ 349172134 348004951 347643623 347127151 346439171 346163406 345297203 344874992 344214287 343878365
1371.4C43878365l19405k55585j87568l32489L50227n36118M3946j84746k51846k68326
$$ 343878365 343558960 343303375 343115807 342783318 343133545 342597427 342641373 342456627 342204781 341936455
1381C41936455j263275q55370j483993j350937j236687j334305k405319j861305q20122
$$ 341936455 340673180 339817810 338333817 336982880 335746193 334411888 332006569 330145264 329325142
1389.7C29325142j775589j766586k209092j560669k310314l826027j638202j957779
$$ 329325142 327549553 325782967 323573875 322013206 319702892 315876865 314238663 312280884
1397.4C12280884j685238l291302k945728j421185k045326j994934k277203k877235
$$ 312280884 310595646 307304344 304358616 302937431 300892105 298897171 296619968 293742733
1405.1B93742733k708244j581440j474724k076206j830540j784706j208420j447716
$$ 293742733 291034489 289453049 287978325 285902119 284071579 282286873 281078453 279630737
1412.8B79630737j089687o90804j303138q48999j075898k90050j577778J04675J493664
$$ 279630737 278541050 277850246 276547108 275698109 274622211 274332161 272754383 272859058 274352722
1421.5B74352722K03896P49988O1455P11403Q83751M59347R95025J48831J727218J915608
$$ 274352722 274556618 275306606 275368061 276079464 276963215 277422562 278417587 278566418 280293636 282209244
1431.2B82209244K039375J697140J328773J905136J619530K768231J124992K509460
$$ 282209244 284248619 285945759 287274532 289179668 290799198 293567429 294692421 297201881
1438.9B97201881J781712J761703K337151J463070K266102J277637J824532J740036
$$ 297201881 298983593 300745296 303082447 304545517 306811619 308089256 309913788 311653824
1446.6C11653824J763153J420307J161671K178478J277790K271423J476708J891708
$$ 311653824 313416977 314837284 315998955 318177433 319455223 321726646 323203354 325095062
1454.3C25095062J587410K73247K251167P82204M443436J711616K297440K393646K017174
$$ 325095062 326682472 326955719 329206886 329989090 334432526 336144142 338441582 340835228 342852402
1463C42852402K570572P00912L298073K517548K892913K737389K566948L215370J576538
$$ 342852402 345422974 346123886 349421959 351939507 354832420 357569809 360136757 363352127 364928665
1471.7C64928665K844582L457947M313850L339767K779618L069801K550163K674599
$$ 364928665 367773247 371231194 375545044 378884811 381664429 384734230 387284393 389958992
1479.4C89958992K003555J964646K041664K013054J812820J442070J705704P59163
$$ 389958992 391962547 393927193 395968857 397981911 399794731 401236801 402942505 403701668
1487.1D03701668M65469J584206o87561j533203M02145m0359j302109j140671r29947
$$ 403701668 404167137 405751343 405063782 403530579 403932724 403892365 402590256 401449585 400519638
1495.8D00519638m690819M5662j366653l404541r11942j725387j515503j488076j53732
$$ 400519638 395828819 395874481 394507828 391103287 390191345 388465958 386950455 385462379 385308647
1504.5C85308647j281128o555176j609687K838821J799660j138115K0790j584549j805229
$$ 385308647 384027519 377472343 375862656 378701477 380501137 379363022 379383812 377799263 375994034
1513.1C75994034j6480n52520p15599k633400n31579J165238J415520j621628k362251
$$ 375994034 375977554 375425034 374709435 372076035 371544456 372709694 374125214 372503586 370141335
1521.8C70141335J499633N98297J624718j78375J059379J642724P27081Q33931R65156
$$ 370141335 371640968 372239265 373863983 373685608 374744987 376387711 377114792 377948723 378913879
1530.5C78913879J238747N11589L92075j042595J221275R86443J004791K152939k205849
$$ 378913879 380152626 380664215 381056290 380013695 381234970 382221413 383226204 385379143 383173294
1539.2C83173294M3221J303978Q99467r1553M87747P61185n22079J558113J63460N19943
$$ 383173294 383216515 384520493 385419960 385328407 385816154 386577339 386055260 387613373 387776833 388296776
1548.8C88296776J17111k13699J004371r117P33414k302399m05044R09843P07855p254181
$$ 388296776 388413887 388200188 389204559 389195442 389928856 387626457 387221413 388131256 388839111 381584930
1558.5C81584930j3690071Q711663J108474P73697k083854j921273l443527l581848
$$ 381584930 367894859 376606522 377714996 378488693 376404839 374483566 371040039 367458191
1566.2C67458191j391373l189735k318688r065475j551056j939163m151726l318710
$$ 367458191 366066818 362877083 360558395 351492920 349941864 348002701 343850975 340532265
1573.9C40532265l908463k553482j2927437j219616l523845m813557m218311n625000
$$ 340532265 336623802 334070320 321142883 319923267 316399422 311585865 307367554 301742554
1581.6C01742554l710652o193447l761272n820809m711876m517612n564346l185559
$$ 301742554 298031902 291838455 288077183 282256374 277544498 273026886 267462540 264276981
1589.3B64276981n700836k865162n357799l306866m267254n009136k599945m987278
$$ 264276981 258576145 255710983 250353184 247046318 242779064 237769928 235169983 230182705
1597B30182705j891441m777337k308902l617001l272209j650810l761750q65879l692150
$$ 230182705 228291264 223513927 221205025 217588024 214315815 212665005 208903255 208037376 204345226
1605.7B04345226q40225k971344j363563j173935k797051M95319k729339K27814k142773
$$ 204345226 203505001 200533657 199170094 197996159 195199108 195694427 192965088 193192902 191050129
1614.4A91050129K70595L95318m592972J836662j408787J628380j402016O42128l75290
$$ 191050129 191320724 191716042 187123070 188959732 187550945 189179325 187777309 188419437 188044147
1623.1A88044147j177654K064076m79012K282791j224441J368084K05440Q43582J348744
$$ 188044147 186866493 188930569 188451557 190734348 189509907 190877991 191083431 191927013 193275757
1631.7A93275757L0670K860661Q7947L642960k213573K549305J662120Q68626L080044
$$ 193275757 193306427 196167088 196255035 199897995 197684422 200233727 201895847 202764473 205844517
1640.4B05844517O04305K876701K32392K352333J780186r01680L751316l07160M146977
$$ 205844517 206448822 209325523 209557915 211910248 213690434 212788754 216540070 216232910 220379887
1649.1B20379887R06047L148690J975479j186047K348213p72934M505768J018238K803879
$$ 220379887 221285934 224434624 226410103 225224056 227572269 226799335 231305103 232323341 235127220
1657.8B35127220J603794K024384K326908J784859L562107N71174M415646K785664
$$ 235127220 236731014 238755398 241082306 242867165 246429272 247000446 251416092 254201756
1665.5B54201756L359947L161144K648411M130077J410523N400409L479710M779110
$$ 254201756 257561703 260722847 263371258 267501335 268911858 274312267 277791977 282571087
1673.2B82571087L778324L530579M087772L715515N727196L569717M996167L739223
$$ 282571087 286349411 289879990 293967762 297683277 303410473 306980190 311976357 315715580
1680.9C15715580N156422N715599Q95538P587547M342575O790009N076714M836998
$$ 315715580 320872002 326587601 327483139 335070686 339413261 346203270 351279984 356116982
1688.6C56116982M966201M608040N999870N197602N534439N014381N333901L974838
$$ 356116982 361083183 365691223 371691093 376888695 382423134 387437515 392771416 396746254
1696.4C96746254O651764O382522N655251M653168P19604Q017769N578652M710464
$$ 396746254 403398018 409780540 415435791 420088959 420808563 428826332 434404984 439115448
1704.1D39115448M320107M113426L836975L939705M808769K936478K946662L533440
$$ 439115448 443435555 447548981 451385956 455325661 460134430 463070908 466017570 469551010
1711.8D69551010L053436K991372J474723K009125M203758L519822k378693L027115
$$ 469551010 472604446 475595818 477070541 479079666 483283424 486803246 484424553 487451668
1719.5D87451668L353119K274475K438431J590766J205140K125969K253418J511535
$$ 487451668 490804787 493079262 495517693 497108459 498313599 500439568 502692986 504204521
1727.2E04204521J829643K303772L35389R35287L678284L479843j582146k575226N384140
$$ 504204521 506034164 508337936 508673325 509608612 513286896 516766739 515184593 512609367 517993507
1735.9E17993507M707985K698517L162613J297875l16086M262275L319703J691627
$$ 517993507 522701492 525400009 528562622 529860497 529544411 533806686 537126389 538818016
1743.6E38818016K892036L966713L554192L576088L723373K118225M420167J885452
$$ 538818016 541710052 545676765 549230957 552807045 556530418 558648643 563068810 564954262
1751.3E64954262K321281N750008M061088L729821L254242J320953L062477L999367
$$ 564954262 567275543 573025551 577086639 580816460 584070702 585391655 588454132 592453499
1759E92453499L023796L298645J52130Q38966M296608K580643J994515K275009K008514
$$ 592453499 595477295 598775940 598928070 599767036 604063644 606644287 608638802 610913811 612922325
1767.7F12922325r90410K651100M626236L96767j065750k83623M726448K734261l32298
$$ 612922325 611931915 614583015 619209251 619606018 618540268 618256645 622983093 625717354 625385056
1776.4F25385056K658424J565094K101555O76079o56701J408883K004165J869278k73590
$$ 625385056 628043480 629608574 631710129 632386208 631729507 633138390 635142555 637011833 636738243
1785.1F36738243P14455K149353J864700J163330J816406O49262P5378j505661l10058
$$ 636738243 637452698 639602051 641466751 642630081 644446487 645095749 645171127 643665466 643355408
1793.8F43355408M425583J422042J73264J673431J655274J052933m53492K023850m8523
$$ 643355408 647780991 649203033 649376297 651049728 652705002 653757935 653304443 655328293 655279770
1802.4F55279770Q24203J742554O48880J268082N75866J023484J228103J249390p03506
$$ 655279770 656103973 657846527 658495407 659763489 660339355 661362839 662590942 663840332 663136826
1811.1F63136826J134872J806564J80054J053543J17111R23462J93405P24259J468124
$$ 663136826 664271698 666078262 666258316 667311859 667428970 668352432 668545837 669270096 670738220
1819.8F70738220O23169J297989j15204J470108J005249k378845L76358K226486K067261
$$ 670738220 671361389 672659378 672544174 674014282 675019531 672640686 673017044 675243530 677310791
1828.5F77310791m60739k545090J247559K493591L39279L87726N65720M32205M19617
$$ 677310791 676850052 674304962 675552521 678046112 678385391 678773117 679338837 679771042 680190659
1837.2F80190659k87705J645050P63550J095123O70395J064377O99997n662232K369080
$$ 680190659 679902954 681548004 682311554 683406677 684077072 685141449 685841446 680179214 682548294
1845.8F82548294K321472J77002J04218O37130J443558K35520P54242n6763L55911
$$ 682548294 684869766 685046768 685150986 685788116 687231674 687467194 688221436 688164673 688520584
1854.5F88520584J15585P8965P75146j17493O02341k68020L15399M34265Q17718Q37403
$$ 688520584 688636169 688715134 689490280 689372787 689975128 689707108 690022507 690456772 691274490 692111893
1864.2F92111893K7847M95453n94711P34329j190872j031342J440506J270676J253509
$$ 692111893 692139740 692635193 692040482 692774811 691583939 690552597 691993103 693263779 694517288
1872.8F94517288j29165N63430J94702J13526L9062K80152M04968m16565N94406j38778
$$ 694517288 694388123 694951553 695146255 695259781 695298843 695578995 695983963 695567398 696161804 696023026
1882.5F96023026O49490J55945O8359Q44421r0332R46045q37173j527023O72988J048584
$$ 696023026 696672516 696828461 696896820 697741241 697650909 698596954 697759781 696232758 696905746 697954330
1892.1F97954330K80533M34494M64402o97327J210785L55987l74603j91879J27868
$$ 697954330 698234863 698669357 699133759 698436432 699647217 700003204 699628601 699436722 699564590
1900.8F99564590O36216j72959N13993k93198K28729O59485J92490j91651m91790j23749
$$ 699564590 700200806 700027847 700541840 700248642 700477371 701136856 701329346 701137695 700645905 700522156
1910.4G00522156l88413J034622N6305J96686K22626L46374J752320j713867m80194
$$ 700522156 700133743 701168365 701224670 701421356 701643982 701990356 703742676 702028809 701548615
1919.1G01548615O57196L80096J38397j473541P0190L64380O49491M11682M32663m8828
$$ 701548615 702205811 702585907 702724304 701250763 701320953 701685333 702334824 702746506 703179169 703130341
1928.8G03130341n4322K26670n36881L41187k98615m2801J00022K49176L85284k4490
$$ 703130341 703076019 703302689 702765808 703106995 702808380 702765579 702865601 703114777 703500061 703475571
1938.4G03475571L88794n03312M78440q99811j658936R14689M86297K4338j55640N97763
$$ 703475571 703864365 703361053 703839493 702939682 701280746 702195435 702681732 702706070 702550430 703148193
1948.1G03148193J68839Q4457k97928m72641J68000j07651q5831p65915L39585K50549
$$ 703148193 703317032 703401489 703103561 702630920 702798920 702691269 702605438 701839523 702179108 702429657
1957.7G02429657P4387M57000k47039j52054o19889N24521n2643k40325L60488n55648
$$ 702429657 702504044 702961044 702714005 702561951 701942062 702466583 702413940 702173615 702534103 701978455
1967.3G01978455Q7814N5237K48413l00751J07346J75552k43530K62069l85589o1569
$$ 701978455 702066269 702121506 702369919 702069168 702176514 702352066 702108536 702370605 701985016 701923447
1977G01923447k81067k4491O2638K62756K02484l49197K54974o25686j70289J14136
$$ 701923447 701642380 701617889 701680527 701943283 702145767 701796570 702051544 701425858 701255569 701369705
1986.6G01369705J55029p2021m03290N74417m62265p49588j25198P11441L24326k71073
$$ 701369705 701524734 701452713 701049423 701623840 701161575 700411987 700286789 700998230 701322556 701051483
1996.3G01051483j76620q32215K19269j91803l45917J4649M6539J84555j94397P6523
$$ 701051483 700874863 700042648 700261917 700070114 699724197 699738846 699785385 699969940 699775543 699852066
2005.9F99852066k40021K89154l56216n94559k79159l35617K10266n19257Q5449L02735
$$ 699852066 699612045 699901199 699544983 698950424 698671265 698335648 698545914 698026657 698112106 698414841
2015.6F98414841J03988m88968j94931K50397p23038j60675o36367p4234k1897j45035
$$ 698414841 698518829 698029861 697834930 698085327 697362289 697201614 696565247 696491013 696469116 696324081
2025.2F96324081L33710m46167n8060o13937K15378K53754m74396l28522o34308J24970
$$ 696324081 696657791 696211624 696153564 695539627 695755005 696008759 695534363 695205841 694571533 694696503
2034.9F94696503p096K15989r7046Q7890p6599n52597j87225o55289K54746k31171
$$ 694696503 694689407 694905396 694808350 694896240 694819641 694267044 694079819 693424530 693679276 693448105
2044.5F93448105j48850r9182n44815J20621l6011K80075m55703p1869p7973l40271
$$ 693448105 693299255 693200073 692655258 692775879 692739868 693019943 692564240 692492371 692414398 692074127
2054.1F92074127R0409k71073J31455k15454J17874k68021K136L60184j48315q088
$$ 692074127 692164536 691893463 692024918 691809464 691927338 691659317 691661453 692021637 691873322 691865234
2063.8F91865234o69326J11084j80359P2479N1956p35855n7220J10855N49850n05371
$$ 691865234 691195908 691306992 691126633 691199112 691251068 690515213 690457993 690568848 691118698 690613327
2073.4F90613327k21100J64032j43661l2959n60608N6839j16730M64096n2795n12467
$$ 690613327 690392227 690556259 690412598 690379639 689819031 689875870 689759140 690223236 690170441 689657974
2083.1F89657974l3188k55584Q9416n21698q2168l27607l05786j91803J03684P95212
$$ 689657974 689624786 689369202 689458618 688936920 688854752 688527145 688221359 688029556 688133240 688928452
2092.7F88928452m51813j74561o04782l07236l8986o36215j36261q9645N42907j65329
$$ 688928452 688476639 688302078 687697296 687390060 687351074 686714859 686578598 686488953 687031860 686866531
2102.4F86866531j56173k64283j38015L19671k62298o8436r00726k18048j39771l30047
$$ 686866531 686710358 686446075 686308060 686627731 686365433 686296997 685396271 685178223 685038452 684708405
2112F84708405r2164k22396L90548l42636O7139k15988j60141k63977o47660K67029
$$ 684708405 684616241 684393845 684784393 684441757 684508896 684292908 684132767 683868790 683221130 683488159
2121.6F83488159j15967M77524N5313K518J33820j41373R9487o34994k17743o01197
$$ 683488159 683372192 683849716 683905029 683907547 684041367 683899994 683999481 683364487 683146744 682545547
2131.3F82545547l82232J78222M10996K07062k64664L39813k56347j31531l27835j8692
$$ 682545547 682163315 682341537 682752533 682959595 682694931 683034744 682778397 682646866 682319031 682300339
2140.9F82300339l6087l82767L48740p3319P99027M10232J18485K6931o62536j3275
$$ 682300339 682264252 681881485 682230225 682156906 682955933 683366165 683484650 683511581 682849045 682835770
2150.6F82835770m07639l25317r2621L51181q2550P6980N93033k07672J34201k65121
$$ 682835770 682428131 682102814 682010193 682361374 682278824 682355804 682948837 682741165 682875366 682610245
2160.2F82610245j79444l47519k61230J28632J20468L52249k77329N96238M44564J23444
$$ 682610245 682430801 682083282 681822052 681950684 682071152 682423401 682146072 682742310 683186874 683310318
2169.9F83310318J9608j02997n3864q06732M00085J01166j93939J02615L15171N16128
$$ 683310318 683329926 683226929 683173065 682366333 682766418 682867584 682673645 682776260 683091431 683607559
2179.5F83607559l59726J64948k74506q087J57166M4631L34015l01437K59018J64490
$$ 683607559 683247833 683412781 683138275 683130188 683287354 683331985 683666000 683364563 683623581 683788071
2189.1F83788071L12500J08642l8833q2779m07257O1264j06202J92338k55433m8980
$$ 683788071 684100571 684209213 684170380 684087601 683680344 683741608 683635406 683827744 683572311 683523331
2198.8F83523331L58963O25686M52500o19202N1956j30996J57928J7929k92206J08490
$$ 683523331 683882294 684507980 684960480 684341278 684393234 684262238 684420166 684438095 684145889 684254379
2208.4F84254379m1809L93906n5771M21829j678o1112K23313n21088L9215j30539L51715
$$ 684254379 684212570 684606476 684550705 684972534 684970856 684909744 685133057 684611969 684651184 684520645 684872360
2219F84872360L1204j21460L31345N38178O36291o15387k15073l49807m13132j71280
$$ 684872360 684903564 684782104 685113449 685651627 686287918 685672531 685457458 685107651 684694519 684523239
2228.7F84523239j32370M34418K32620L23715p1487J51749l42408k31170L17154r9945
$$ 684523239 684390869 684825287 685057907 685381622 685310135 685461884 685119476 684888306 685205460 685105515
2238.3F85105515l6011o58035K24761L08762K13394J18180m49677j7242l08457M87824
$$ 685105515 685069504 684411469 684636230 684944992 685158386 685276566 684826889 684809647 684501190 684989014
2248F84989014J04828j9074J20850l17993Q6593j87073J52359l66439n6076L43093
$$ 684989014 685093842 685074768 685195618 684877625 684964218 684777145 684929504 684563065 684506989 684850082
2257.6F84850082J84174m349l74679K37808m88587j64337k1972J18255L96424j48240
$$ 684850082 685034256 685029907 684655228 684893036 684404449 684240112 684218140 684336395 684732819 684584579
2267.3F84584579Q40m21067L20664p3776k36283m9896l10211K21329k63291k0141l18757
$$ 684584579 684585419 684164352 684485016 684411240 684174957 684125061 683814850 684036179 683772888 683752747 683433990
2277.9F83433990L18146L86353k00882R689j66626L57056o88400j82953L2043k48031
$$ 683433990 683752136 684138489 683937607 683947296 683780670 684137726 683449326 683266373 683298416 683050385
2287.5F83050385K69165l55454q9569o53839J36490l968m05502j3809m28162O03638
$$ 683050385 683319550 682964096 682874527 682220688 682357178 682353210 681947708 681933899 681505737 682109375
2297.2F82109375M5319K8686k78091k71073K81754m12064l15552o41403K49329k04773
$$ 682109375 682154694 682183380 681905289 681634216 681915970 681503906 681188354 680546951 680796280 680591507
2306.8F80591507l65906l1891p98492k28195J07879M83780p75909r9945L21884o65131
$$ 680591507 680225601 680193710 679395218 679167023 679274902 679758682 678982773 678882828 679204712 678539581
2316.4F78539581k12478m88205J96762n44052m26026k91824k74887j08032n40162P33338
$$ 678539581 678327103 677838898 678035660 677491608 677065582 676773758 676498871 676390839 675850677 676584015
2326.1F76584015j68381J05438r14230r80453O41021j08795k16904q26110O01501L8452
$$ 676584015 676415634 676521072 675606842 674626389 675267410 675158615 674941711 674115601 674717102 674755554
2335.7F74755554k53830j39084j050262m44946o30570M05731j74408p11898q78220
$$ 674755554 674501724 674362640 673312378 672867432 672236862 672642593 672468185 671756287 670878067
2344.4F70878067L53012Q52280m26865M42276Q95844P06634p26242n18188n77088m01687
$$ 670878067 671231079 672083359 671656494 672098770 672994614 673701248 672975006 672456818 671879730 671478043
2354.1F71478043K67105j864929M348L1128N24063p79190j138992O34003q96149O84814
$$ 671478043 671745148 669880219 669884567 669915695 670439758 669660568 668521576 669155579 668259430 668944244
2363.7F68944244o61850j23748m05045j59607J395874P00455K72293j091995P84607
$$ 668944244 668282394 668158646 667753601 667593994 668989868 669690323 669962616 668870621 669655228
2372.4F69655228m36020j205826J19400r8038J74485m10157K76108J66321O2866R7351
$$ 669655228 669219208 668013382 668132782 668034744 668209229 667799072 668075180 668241501 668304367 668401718
2382F68401718j99356j99280n04837R2545l68118j65482R4833l26080k09656k30713
$$ 668401718 668202362 668003082 667498245 667590790 667222672 667057190 667152023 666825943 666616287 666385574
2391.7F66385574r1552o46058j94396q2093k28500l30658n19638m1275m72412j07422
$$ 666385574 666294022 665647964 665453568 665371475 665142975 664812317 664292679 664251404 663778992 663671570
2401.3F63671570j63574r2926l34168r23080k66419l32718j64184m53186l39508j31760
$$ 663671570 663507996 663415070 663080902 662157822 661891403 661558685 661394501 660941315 660601807 660470047
2410.9F60470047j16119j70060o18896r8801m59289m16260n76935n18188j02158l67737
$$ 660470047 660353928 660183868 659564972 659466171 659006882 658590622 658013687 657495499 657393341 657025604
2420.6F57025604k7160m19541k72522m46090k37427o9199n93948k27204m85305l99399
$$ 657025604 656998444 656578903 656306381 655860291 655622864 655553665 654959717 654732513 654247208 653847809
2430.2F53847809n85098r0332l586m82331l31268p79800l69644n21012k41089m00619
$$ 653847809 653262711 653172379 653168793 652686462 652355194 651575394 651205750 650684738 650443649 650043030
2439.9F50043030o10047l3035n15137j65710l55759l80401l00598m32206l53088m21600
$$ 650043030 649432983 649399948 648884811 648719101 648363342 647982941 647682343 647250137 646897049 646475449
2449.5F46475449k63901o33011l81088q78678m07562K38571n44128l83988n43747m94003
$$ 646475449 646211548 645578537 645197449 644318771 643911209 644149780 643605652 643221664 642677917 642183914
2459.2F42183914m98581k97546n19638o34995l63083p40623j83373j84097k02980o55594
$$ 642183914 641685333 641387787 640868149 640233154 639870071 639129448 638946075 638761978 638558998 637903404
2468.8F37903404p24334k73171l75137j53160j000519o08406k59209l14941o3057m66576
$$ 637903404 637179070 636905899 636530762 636377602 635377083 634768677 634509468 634194527 634131470 633664894
2478.5F33664894m91562q06198l08418o14624p76520l48129l55873k24228j016999
$$ 633664894 633173332 632367134 632058716 631444092 630667572 630319443 629963570 629739342 628722343
2487.1F28722343o13861k74200n45197n85785k23655j09024r95331p41997n23491k95028
$$ 628722343 628108482 627834282 627289085 626703300 626479645 626370621 625375290 624633293 624109802 623814774
2496.8F23814774l68653p31773o66771j93787J67580q00629o40678o56510p40509m45022
$$ 623814774 623446121 622714348 622047577 621853790 622021370 621220741 620580063 619923553 619183044 618738022
2506.4F18738022o93970k84004o85959n64461k22969o48918o89850m10385n27382o32553
$$ 618738022 618044052 617760048 617074089 616509628 616286659 615637741 614947891 614537506 614010124 613377571
2516.1F13377571k38609n55229n73388n14946j69296j13601m95682k31133n30205m88777
$$ 613377571 613138962 612583733 612010345 611495399 611326103 611212502 610716820 610485687 609955482 609466705
2525.7F09466705p68242p56263n54161n39589j67046m43993l41682n90057l25165o0654
$$ 609466705 608698463 607942200 607388039 606848450 606681404 606237411 605895729 605305672 604980507 604919853
2535.4F04919853j58500k41471r99527r16710r09462l70712k15034n44167m27780m89502
$$ 604919853 604761353 604519882 603520355 602603645 601694183 601323471 601108437 600564270 600136490 599646988
2545E99646988l0289k06756m43383p00950q05397r84001o30990k0942n13993k288j72119
$$ 599646988 599616699 599409943 598966560 598265610 597460213 596476212 595845222 595824280 595310287 595307999 595135880
2555.6E95135880m84200n70412o80732k76795o01654m01153p86248o38046k88773m47273
$$ 595135880 594651680 594081268 593400536 593123741 592522087 592120934 591334686 590696640 590407867 589960594
2565.2E89960594j20125j12991n5199o56967m26025o03218j096115m61960l37525l97720
$$ 589960594 589840469 589727478 589672279 589015312 588589287 587986069 586889954 586427994 586090469 585692749
2574.9E85692749o42929k73819j28593j68686l22838m99611n26695q68111l17802n66140
$$ 585692749 585049820 584776001 584647408 584478722 584155884 583656273 583129578 582261467 581943665 581377525
2584.5E81377525m71992j19400k52114k50282o19621l37715o56777p35702r24492p93495
$$ 581377525 580905533 580786133 580534019 580283737 579664116 579326401 578669624 577933922 577009430 576215935
2594.2E76215935j09978l92303l87154m07867R4642k57950q74138q37249q59452n88455
$$ 576215935 576105957 575713654 575326500 574918633 575013275 574755325 573881187 573043938 572184486 571596031
2603.8E71596031o80923k30332m97017n19371k71873k21787k09198j002235o39305
$$ 571596031 570915108 570684776 570187759 569668388 569396515 569174728 568965530 567963295 567323990
2612.5E67323990o99082o52465o87218o45180j81465q58040m27971k52609j45454m10805
$$ 567323990 566624908 565972443 565285225 564640045 564458580 563600540 563172569 562919960 562774506 562363701
2622.1E62363701j134186p39860o01311n80216j010818p23648j82419l63388o91643
$$ 562363701 561229515 560489655 559888344 559308128 558297310 557573662 557391243 557027855 556336212
2630.8E56336212k24647P0610j072541p29103k66304m85763j012154j191330l64113
$$ 556336212 556111565 556182175 555109634 554380531 554114227 553628464 552616310 551424980 551060867
2639.5E51060867l58009r0256k42119o14738o85654m92553m90952q78601m30107o26602
$$ 551060867 550702858 550612602 550370483 549755745 549070091 548577538 548086586 547207985 546777878 546151276
2649.1E46151276m52309l81088n14946k55394n28527o22940q27217m15687m67072p09648
$$ 546151276 545698967 545317879 544802933 544547539 544019012 543396072 542568855 542153168 541686096 540976448
2658.8E40976448q12225p28455K5253r6473k60430n24063k39677l70865q52089o15883
$$ 540976448 540164223 539435768 539461021 539364548 539104118 538580055 538340378 537969513 537117424 536501541
2668.4E36501541p41501l41110n18074l15933n8823l10783k01836n36079k88620m62990
$$ 536501541 535760040 535418930 534900856 534584923 534526100 534215317 534013481 533477402 533188782 532725792
2678.1E32725792p91588p07741n07354l08075l65410k77519l26310k95448m40483j52092
$$ 532725792 531934204 531226463 530719109 530411034 530045624 529768105 529441795 529146347 528705864 528553772
2687.7E28553772m77867j018601n96923k62299l72963j005898k16293J16501m45862
$$ 528553772 528075905 527057304 526460381 526198082 525825119 524819221 524602928 524719429 524273567
2696.4E24273567k26974l63198o02150p45277l30124l68423k89574j87569l02887k57339
$$ 524273567 524046593 523683395 523081245 522335968 522005844 521637421 521347847 521160278 520857391 520600052
2706E20600052n94292j14555m23813n43747n51109q31642m77715o67877p9460j8692
$$ 520600052 520005760 519891205 519467392 518923645 518372536 517540894 517063179 516395302 516315842 516297150
2715.7E16297150l91846o37093k72255K16752n44205n60608o17600k97088O2294J23596
$$ 516297150 515905304 515268211 514995956 515212708 514668503 514107895 513490295 513193207 513255501 513379097
2725.3E13379097k99301q74367j15700k91443m24957l42636k80456l59383m82597K059
$$ 513379097 513079796 512205429 512089729 511798286 511373329 511030693 510750237 510390854 509908257 509910316
2735E09910316j09519O2408o33202l92608J95274m03023l68766o96335k32163j77803
$$ 509910316 509800797 509863205 509230003 508837395 509032669 508629646 508260880 507564545 507332382 507154579
2744.6E07154579l75671k66800l0441J75094n92613j34583j11961m31366n46265o89277
$$ 507154579 506778908 506512108 506481667 506656761 506064148 505929565 505817604 505386238 504839973 504150696
2754.3E04150696j61782q0375J5983k03170j00327n15747p46918L4294J3886n39398
$$ 504150696 503988914 503908539 503924522 503721352 503621025 503105278 502358360 502392654 502406540 501867142
2763.9E01867142r53942k02293l7384k57072l64495n88569l73765p34291k62413p7743
$$ 501867142 500913200 500710907 500673523 500416451 500051956 499463387 499089622 498355331 498092918 498015175
2773.5D98015175m34570l83721m81987o53000o95572l68728n00679j32141l69721q59413
$$ 498015175 497580605 497196884 496714897 496061897 495366325 494997597 494496918 494364777 493995056 493135643
2783.2D93135643k77061k94228n21698m89388k80761n57900p34482p73696o05240n52216
$$ 493135643 492858582 492564354 492042656 491553268 491272507 490714607 489980125 489206429 488601189 488048973
2792.8D88048973r15108l02887m88052o56013n85366p72934n52330q50486q16269q45490
$$ 488048973 487133865 486830978 486342926 485686913 485101547 484328613 483776283 482925797 482109528 481264038
2802.5D81264038o95190q69332r49020l60642l02620k14385o58188j376458j573410
$$ 481264038 480568848 479699516 478750496 478389854 478087234 477872849 477214661 475838203 474264793
2811.2D74264793q05206m52423m57878n54466j183358o07948q02460r53216q18138
$$ 474264793 473459587 473007164 472549286 471994820 470811462 470203514 469401054 468447838 467629700
2819.8D67629700j376496r32350m80270n48897j108017j026459j164055j203117p68509
$$ 467629700 466253204 465320854 464840584 464291687 463183670 462157211 460993156 459790039 459021530
2828.5D59021530j107902q56057p91359q42247j365356j373405p24678j179276j247826
$$ 459021530 457913628 457057571 456266212 455423965 454058609 452685204 451960526 450781250 449533424
2837.2D49533424j321182j472053j678048j752433j977234k074318j955071k413673
$$ 449533424 448212242 446740189 445062141 443309708 441332474 439258156 437303085 434889412
2844.9D34889412k079582k074127j870118k124633k766419k283668j881714j180992
$$ 434889412 432809830 430735703 428865585 426740952 423974533 421690865 419809151 418628159
2852.6D18628159j302147o13671J61133k72102l25737p81441p52907k89268K76870
$$ 418628159 417326012 416712341 416873474 416601372 416275635 415494194 414741287 414452019 414728889
2861.3D14728889k79998q42743q12302j020775o18591j086235r34563p47757j213493
$$ 414728889 414448891 413606148 412793846 411773071 411154480 410068245 409133682 408385925 407172432
2870D07172432j078224m87557k19001j076813p05910p36618j103516q73680q10623
$$ 407172432 406094208 405606651 405387650 404310837 403604927 402868309 401764793 400891113 400080490
2878.7D00080490m39300j125985p87811m38881r75113j020698j415901j200257r37462
$$ 400080490 399641190 398515205 397727394 397288513 396313400 395292702 393876801 392676544 391739082
2887.3C91739082j120681j102028p51191r27619j104737j057968j221428j097526j280861
$$ 391739082 390618401 389516373 388765182 387837563 386732826 385674858 384453430 383355904 382075043
2896C82075043n48630n99022j473923j106910r78966n76782m04740p23419q92830r75761
$$ 382075043 381526413 380927391 379453468 378346558 377367592 376790810 376386070 375662651 374769821 373794060
2905.7C73794060j029930j235428j197090j062775j002121j331062j287232j198311
$$ 373794060 372764130 371528702 370331612 369268837 368266716 366935654 365648422 364450111
2913.4C64450111j230049j268615j689644j515999j427841j228905j531296j809349
$$ 364450111 363220062 361951447 360261803 358745804 357317963 356089058 354557762 352748413
2921.1C52748413p65839n75943p52410m59366j31111o4927j37214K42615M07562k74658
$$ 352748413 351982574 351406631 350654221 350194855 350063744 349998817 349861603 350104218 350511780 350237122
2930.7C50237122m15421M56123K53487K43645Q80775J032982R97849N49354O56357
$$ 350237122 349821701 350277824 350531311 350774956 351655731 352688713 353686562 354235916 354892273
2939.4C54892273O13975K83127O27861J135063J106377N76821N44776P08962P88193
$$ 354892273 355506248 355789375 356417236 357552299 358658676 359235497 359780273 360489235 361277428
2948.1C61277428Q21380Q15735O13938M51087M35791K7504K71569O13327O86798J171493
$$ 361277428 362098808 362914543 363528481 363979568 364415359 364442863 364714432 365327759 366014557 367186050
2957.7C67186050Q82645K18201L73955N02090O00395P58591L53432N67474R37729Q95538
$$ 367186050 368068695 368286896 368660851 369162941 369763336 370521927 370875359 371442833 372380562 373276100
2967.4C73276100O06575N47714J241417R92508O91223P82967Q74443O67725p8812M76723
$$ 373276100 373882675 374430389 375671806 376664314 377355537 378138504 379012947 379680672 379601860 380078583
2977C80078583R75609N07927Q8615L79944P28149J38664k07061q7090K18125K27737
$$ 380078583 381054192 381562119 381650734 382030678 382758827 382897491 382690430 382603340 382821465 383049202
2986.7C83049202J22833k6550Q6555M09394L43475O15654p7324p99103l53431k17247
$$ 383049202 383172035 383145485 383232040 383641434 383984909 384600563 384523239 383724136 383370705 383153458
2996.3C83153458n09835l03077O1378p05032p51190k43607l36685m56543o77490n89295
$$ 383153458 382643623 382340546 382401924 381696892 380945702 380702095 380365410 379908867 379231377 378642082
3006C78642082l18985j46751n05829m82254o54259r35516p31850p45010j92414q01696
$$ 378642082 378323097 378176346 377670517 377188263 376534004 375598488 374866638 374121628 373929214 373127518
3015.6C73127518j106568m14581o27289j074066j218414l06206l25966p60841o97556
$$ 373127518 372020950 371606369 370979080 369905014 368686600 368380394 368054428 367293587 366596031
3024.3C66596031q34656q85238j131630n56946n46455j107331j226387j019897n57938
$$ 366596031 365761375 364876137 363744507 363187561 362641106 361533775 360307388 359287491 358729553
3033C58729553m75273p13692j222000q33168n43060p90749r06868r12285r30213j094056
$$ 358729553 358254280 357540588 356318588 355485420 354942360 354151611 353244743 352332458 351402245 350308189
3042.6C50308189o48422q95080q78563p48291j083794j050415j453095p69424k36893
$$ 350308189 349659767 348764687 347886124 347137833 346054039 345003624 343550529 342781105 342544212
3051.3C42544212o42967j068725j006127n85861r71718r87320q06656p77244j037560
$$ 342544212 341901245 340832520 339826393 339240532 338268814 337281494 336474838 335697594 334660034
3060C34660034j159820j041489p27806k63329p23419o33507p87925r25560r56879j110916
$$ 334660034 333500214 332458725 331730919 331467590 330744171 330110664 329322739 328397179 327440300 326329384
3069.6C26329384m08096q83790j007957p09953n17159k92129p79724q07267q90236
$$ 326329384 325921288 325037498 324029541 323319588 322802429 322510300 321730576 320923309 320033073
3078.3C20033073p63664p40032p30515o41880m52842n46265j120930n75962p01122
$$ 320033073 319269409 318529377 317798862 317156982 316704140 316157875 315036945 314460983 313759861
3087C13759861q26626o86550r56573q81920q99620l83625o95248p79324p31525r37901
$$ 313759861 312933235 312246685 311290112 310408192 309508572 309124947 308429699 307650375 306918850 305980949
3096.6C05980949l33824o56681q10489q64087q11252n60990q11500p39060p68127o25534
$$ 305980949 305647125 304990444 304179955 303315868 302504616 301943626 301132126 300393066 299624939 298999405
3106.2B98999405n99785j080036j145344o30932m34646m29745q86211j385441o14033
$$ 298999405 298399620 297319584 296174240 295543308 295108662 294678917 293792706 292407265 291793232
3114.9B91793232l16887o79264q06751p10221n99632n89065q69828j469612j119327
$$ 291793232 291476345 290797081 289990330 289280109 288680477 288091412 287221584 285751972 284632645
3123.6B84632645p57275l89805m85954o99482n68581j259861q90197p63264r30977
$$ 284632645 283875370 283485565 282999611 282300129 281731548 280471687 279581490 278818226 277887249
3132.3B77887249p71732q99659n85556q34293o54621n29575m26159m31271j227741
$$ 277887249 277115517 276215858 275630302 274796009 274141388 273611813 273185654 272754383 271526642
3141B71526642j367760j059208o69441r08985q20141o67381q80261p14664p26147m52137
$$ 271526642 270158882 269099674 268430233 267521248 266701107 266033726 265153465 264438801 263712654 263260517
3150.6B63260517o25191p24983n81913n96657p64503r69830p01751p80487p92542j097984
$$ 263260517 262635326 261910343 261328430 260731773 259967270 258997440 258295689 257515202 256722660 255624676
3160.3B55624676o78368m14963j118183p23514p24564n34782n90973j224671r68265
$$ 255624676 254946308 254531345 253413162 252689648 251965084 251430302 250839329 249614658 248646393
3168.9B48646393n25570m86660j173668q93116n46474q88501o92520n82676p60593
$$ 248646393 248120823 247634163 246460495 245567379 245020905 244132404 243439884 242857208 242096615
3177.6B42096615q27561n21144q69332q65841j92909l79486r17378j009006o02512
$$ 242096615 241269054 240747910 239878578 239012737 238819828 238440342 237522964 236513958 235911446
3186.3B35911446m84085o06289p46098o99158o97174p01618n91068q32558q62865o68240
$$ 235911446 235427361 234821072 234074974 233375816 232678642 231977024 231385956 230553398 229690533 229022293
3195.9B29022293l27034r11617j263886o30054o57120l55549l51009l40309j58768
$$ 229022293 228695259 227783642 226519756 225889702 225232582 224877033 224526024 224185715 224026947
3204.6B24026947o37646r73758q71811m40617o60210p36980o93741n83610j48430m09813
$$ 224026947 223389301 222415543 221543732 221103115 220442905 219705925 219012184 218428574 218280144 217870331
3214.3B17870331m46110l57952m74815o43177p70493r12151o61183k87056n57728l45001
$$ 217870331 217424221 217066269 216591454 215948277 215177784 214265633 213604450 213317394 212759666 212414665
3223.9B12414665l57399m56791m03213o86341q97388q78124j14060o1111k74468n54924
$$ 212414665 212057266 211600475 211197262 210510921 209613533 208735409 208621349 208560238 208285770 207730846
3233.5B07730846j115379q25043l60889J56765k89726j020260o57616o3743k08016
$$ 207730846 206615467 205790424 205429535 205586300 205296574 204276314 203618698 203554955 203346939
3242.2B03346939n85422m28238n08099m09527n98068o95953j56823j83239n82275p58438
$$ 203346939 202761517 202333279 201825180 201415653 200817585 200121632 199964809 199781570 199199295 198440857
3251.9A98440857l56312n07545o15750k80761k85359k59342n60513m37030j77479j57776
$$ 198440857 198084545 197577000 196961250 196680489 196395130 196135788 195575275 195138245 194960766 194802990
3261.5A94802990m53625n00526k51484p36961o15063k46067J1635j10283m24214k82345
$$ 194802990 194349365 193848839 193597355 192860394 192245331 191999264 192010899 191900616 191476402 191194057
3271.2A91194057m20608m8504l01151o72817j98060l42273n78728n53341k55508k72656
$$ 191194057 190773449 190724945 190423794 189750977 189552917 189210644 188631916 188078575 187823067 187550411
3280.8A87550411n68027l30258p9422j97220O3973j3847o57978j13488Q8749m04091
$$ 187550411 186982384 186652126 186572704 186375484 186439457 186425610 185767632 185654144 185742893 185338802
3290.4A85338802o31561n88741J3504L1738R8476k54840p99923n36709n42946l17936
$$ 185338802 184707241 184118500 184132004 184163742 184262218 184007378 183207455 182670746 182127800 181809864
3300.1A81809864k73514r3937J76049k61155l12786l55911l05672o5517j44215k55851
$$ 181809864 181536350 181442413 181618462 181357307 181044521 180688610 180382938 180317421 180173206 179917355
3309.7A79917355m95606l66325k12612l55168o1722m3239j96400j72157p06520r39331
$$ 179917355 179421749 179055424 178842812 178487644 178425922 178382683 178186283 178014126 177307606 176368275
3319.4A76368275m10443k3384j05152m04129l62854j1654k75345o99043n24445o39171
$$ 176368275 175957832 175934448 175829296 175425167 175062313 175050659 174775314 174076271 173551826 172912655
3329A72912655m46072j54781n21069n00641q46710r13372n5370m1828l76644m10271
$$ 172912655 172466583 172311802 171790733 171290092 170443382 169530010 169474640 169432812 169056168 168645897
3338.7A68645897l52650o7405n6420m02374m84200l87630m21467m38099p1449L62263
$$ 168645897 168293247 168225842 168169422 167767048 167282848 166895218 166473751 166035652 165964203 166326466
3348.3A66326466r8820m86164j74752m14295o79130j17855K96478L47824J24283l66497
$$ 166326466 166227646 165741482 165566730 165152435 164473305 164355450 164651928 164999752 165124035 164757538
3357.9A64757538j37501j83582q22411n31883K13852L53603J28441K62947L8338k16732
$$ 164757538 164620037 164436455 163614044 163082161 163296013 163649616 163778057 164041004 164079342 163862610
3367.6A63862610l42159p22447j01566J94282l6659J42002o3400l10059j45130n5923
$$ 163862610 163520451 162798004 162696438 162890720 162854061 162996063 162932663 162622604 162477474 162421551
3377.2A62421551l38440r766K40002M9496M367j05953O8093k29874o7310L43246J68247
$$ 162421551 162083111 162073345 162313347 162362843 162367210 162261257 162329350 162099476 162032166 162375412 162543659
3387.8A62543659K74182k25048j83163M45194J24817o6567K24839p6084m59271l0956
$$ 162543659 162817841 162592793 162409630 162854824 162979641 162913074 163137913 163061829 162602558 162571602
3397.5A62571602N7297k17419q0166K65007M78973J75934k53544k19516J83868K27242
$$ 162571602 162628899 162411480 162331314 162596321 163075294 163251228 162997684 162778168 162962036 163189278
3407.1A63189278Q4152O3286J24016K08339J08223K39678J25064l10859k53639M08134
$$ 163189278 163273430 163336716 163460732 163669071 163777294 164016972 164142036 163831177 163577538 163985672
3416.8A63985672P58400L65143O1054k02007K16865R74083M80385j59836L5553L42045
$$ 163985672 164744072 165109215 165170269 164968262 165185127 166159210 166639595 166479759 166515312 166857357
3426.4A66857357L06454J63707O28758P99026j27449j67999L11298J86310P6924K61612
$$ 166857357 167163811 167327518 167956276 168755302 168627853 168459854 168771152 168957462 169034386 169295998
3436.1A69295998P10296L82023M00334K97451L0231R05838P35054K17266P3338N62915
$$ 169295998 170006294 170388317 170788651 171086102 171116333 172022171 172757225 172974491 173047829 173610744
3445.7A73610744N90401n53436O51379R71717J33896L61691J038227J120395M98391
$$ 173610744 174201145 173647709 174299088 175270805 175404701 175766392 176804619 177925014 178423405
3454.4A78423405P89795N61981K26021L9272r3956Q01048R75723Q77724L70827J31950
$$ 178423405 179213200 179775181 180001202 180040474 179946518 180747566 181723289 182601013 182971840 183103790
3464A83103790N14221O04172P62482P73849R99089M74643J97621L90949L88050J068077
$$ 183103790 183618011 184222183 184984665 185758514 186757603 187232246 187429867 187820816 188208866 189276943
3473.7A89276943J001568L61233K85950Q81938J115799R48487Q05778N76630P26967
$$ 189276943 190278511 190639744 190925694 191807632 192923431 193871918 194677696 195254326 195981293
3482.3A95981293M65450O85520M86298K08130R05380P64198O57139Q16536Q90369R25293
$$ 195981293 196446743 197132263 197618561 197826691 198732071 199496269 200153408 200969944 201860313 202785606
3492B02785606J054001J031094R10873R27067K70691O07014J006145O37608N37986
$$ 202785606 203839607 204870701 205781574 206708641 206979332 207586346 208592491 209230099 209768085
3500.7B09768085Q56209J419354R86614M77371M12369O83365R43127J411438J361503
$$ 209768085 210624294 212043648 213030262 213507633 213920002 214603367 215546494 216957932 218319435
3509.4B18319435N52216J049766P60556R04331J105118R16233J419029Q04767Q29125
$$ 218319435 218871651 219921417 220681973 221586304 222691422 223607655 225026684 225831451 226660576
3518B26660576Q61626R02805J159668Q34656P91568O32248J236210J095467R22527
$$ 226660576 227522202 228425007 229584675 230419331 231210899 231843147 233079357 234174824 235097351
3526.7B35097351J380272J368027R96532R07231J290988J168557J391468J080322J376915
$$ 235097351 236477623 237845650 238842182 239749413 241040401 242208958 243600426 244680748 246057663
3535.4B46057663J064854N53379K006035J259250J179981J591168J453857J450463
$$ 246057663 247122517 247675896 249681931 250941181 252121162 253712330 255166187 256616650
3543.1B56616650J064663J456337Q73260J580067J252422J404076K213630J615334
$$ 256616650 257681313 259137650 260010910 261590977 262843399 264247475 266461105 268076439
3550.8B68076439J437435M14352J900521J966343J526184J595745N45635J735668J592751
$$ 268076439 269513874 269928226 271828747 273795090 275321274 276917019 277462654 279198322 280791073
3559.5B80791073J378593J349755K535686K251530O75258L373490J496734P6962J192722
$$ 280791073 282169666 283519421 286055107 288306637 288981895 292355385 293852119 293929081 295121803
3568.2B95121803J788559L743229J743775J311721J864205K509269K096062J309605
$$ 295121803 296910362 300653591 302397366 303709087 305573292 308082561 310178623 311488228
3575.9C11488228J941624J487598K376690J509914J475601K442666K428360K267341
$$ 311488228 313429852 314917450 317294140 318804054 320279655 322722321 325150681 327418022
3583.6C27418022J532974L747445K065124n38521K000427J606522L287048K535553
$$ 327418022 328950996 332698441 334763565 334225044 336225471 337831993 341119041 343654594
3591.3C43654594K241059K191810K327195L165741Q5868K043839L355217J938820L006973
$$ 343654594 345895653 348087463 350414658 353580399 353666267 355710106 359065323 361004143 364011116
3600C64011116K163773K410278L044357J822014K008057L275261L039283R40018L184548
$$ 364011116 366174889 368585167 371629524 373451538 375459595 378734856 381774139 382714157 385898705
3608.7C85898705J098098J328621O818848K795372n75791L314820J205139M448280
$$ 385898705 386996803 388325424 395144272 397939644 397363853 400678673 401883812 406332092
3616.4D06332092M316902Q11348K196389J273231K788162M690514L875961K610512
$$ 406332092 410648994 411460342 413656731 414929962 417718124 422408638 426284599 428895111
3624.1D28895111L175125L143311L051872O217842J009865o699219N209465O172447
$$ 428895111 432070236 435213547 438265419 444483261 445493126 438793907 444003372 450175819
3631.8D50175819N868111K343483l7918M227333N080566L325844J545792K719688L722039
$$ 450175819 456043930 458387413 458349495 462576828 467657394 470983238 472529030 475248718 478970757
3640.5D78970757L365783K919083J939850K777939M477996O176262p2822k605324O724815
$$ 478970757 482336540 485255623 487195473 489973412 494451408 500627670 500554848 497949524 504674339
3649.2E04674339L262291j576080M18816P173957O153832L640404N126419m421730
$$ 504674339 507936630 506360550 506779366 513953323 520107155 523747559 528873978 524452248
3656.9E24452248K557678N827026J960259K510414J812973L338089K016334K449990
$$ 524452248 527009926 532836952 534797211 537307625 539120598 542458687 544475021 546925011
3664.6E46925011L185959J567153M829789K254753l15514K95372l788872M506722P891884
$$ 546925011 550110970 551678123 556507912 558762665 558447151 558742523 554953651 559460373 567352257
3673.3E67352257Q945389n0660j5461464L402901P565651N241852r44710P58362L004456
$$ 567352257 576297646 576246986 560785522 564188423 571754074 576995926 576051216 576809578 579814034
3682E79814034K332115J670723J101150J251297L834496O135864p531967k630692P215309
$$ 579814034 582146149 583816872 584918022 586169319 590003815 596139679 588607712 585977020 593192329
3690.6E93192329m985046P19414N662956J582031J712303Q43316K1743P91474L21350
$$ 593192329 588207283 588926697 594589653 596171684 597883987 598727303 598749046 599540520 599861870
3699.3E99861870K772026L281555n215340j659889N284767K193528R66186Q69370K236137
$$ 599861870 602633896 605915451 600700111 599040222 604324989 606518517 607484703 608354073 610590210
3708F10590210L321152o265221L196831L340187j1744423N326118N330506O77681J089477
$$ 610590210 613911362 607646141 610842972 614183159 602438736 607764854 613095360 613773041 614862518
3716.7F14862518K202301J217118k556610J467628M873734l691826k979355M518890
$$ 614862518 617064819 618281937 615725327 617192955 622066689 618374863 615395508 619914398
3724.4F19914398N42717l56140k544327Q22335M546508J226082M576645l396988o334266
$$ 619914398 620457115 620100975 617556648 618378983 622925491 624151573 628728218 625331230 618996964
3733.1F18996964R493331J711464q860855n42679K135392Q54873K174950K812576k822342
$$ 618996964 628490295 630201759 621340904 620798225 622933617 623788490 625963440 628776016 625953674
3741.8F25953674L518753J1394501j1527481j6459579J1026229O717263O156768l309402
$$ 625953674 629472427 640866928 629339447 612879868 623906097 630623360 636780128 633470726
3749.5F33470726j1788025R233551m556846n737954O687546N410423L615342m952355
$$ 633470726 621682701 630916252 626359406 620621452 627308998 632719421 636334763 631382408
3757.2F31382408J822128M350090p479324k81753M578323J143990n26009K824669k644310
$$ 631382408 633204536 637554626 630075302 629793549 634371872 635515862 634989853 637814522 635170212
3765.9F35170212m262238M043427M750442k50435p960395K441177L079414n98030Q91609
$$ 635170212 630907974 634951401 639701843 639451408 631491013 633932190 637011604 636413574 637305183
3774.5F37305183K03095J165733K55242K117729j33133o793594L176269K530289Q91037
$$ 637305183 637508278 638674011 638929253 641046982 640913849 634120255 637296524 639826813 640717850
3783.2F40717850J134567l795395j89056J770019P55158L62091k99301O84967M730
$$ 640717850 641852417 638057022 637867966 639637985 640393143 640755234 640455933 641140900 641145630
3791.9F41145630J47934j02539J256103L294449l919144l953514K632103M046860N090256
$$ 641145630 641293564 641191025 642447128 645741577 641822433 637868919 640501022 644547882 649638138
3800.6F49638138p535553r085541M407311K865943N014573N154419r768143m072609
$$ 649638138 642102585 633017044 637424355 640290298 645304871 650459290 640691147 636618538
3808.3F36618538M854088K331924K31781K95716M1961J426468N273743k390518j3264275
$$ 636618538 641472626 643804550 644036331 644332047 644374008 645800476 651074219 648683701 635419426
3817F35419426M849586N860367M369812N87387j6176338K335320N541458J751633K532272
$$ 635419426 640269012 646129379 650499191 651086578 634910240 637245560 642787018 644538651 647070923
3825.7F47070923P0343m609375k69394J717224L271790J663894p481308K801056O748734
$$ 647070923 647141266 642531891 642262497 643979721 647251511 648915405 641434097 644235153 650983887
3834.3F50983887m557038R3003O997070r483643n165214P682762l983002J00556O447372
$$ 650983887 646426849 646519852 653516922 644033279 638868065 646550827 642567825 642668381 649115753
3843F49115753k651443l478928K563858J704941R1400Q60062j085739K123184N237579
$$ 649115753 646464310 642985382 645549240 647254181 647345581 648205643 647119904 649243088 654480667
3851.7F54480667o088333Q07877j4070473Q81691J0314483l66973j294480K190857
$$ 654480667 648392334 649200211 635129738 636011429 646325912 645958939 644664459 646855316
3859.4F46855316J902008J682968m114685Q03757M962463o481552n304107M244918
$$ 646855316 648757324 650440292 646325607 647129364 652091827 645610275 640306168 644551086
3867.1F44551086N143280M530335q689728p484856M748574N530090K220307r117432
$$ 644551086 649694366 654224701 645534973 638050117 642798691 648328781 650549088 641431656
3874.8F41431656J770553M439011j31225K283248L098374o173248n956879O016846
$$ 641431656 643202209 647641220 647509995 649793243 652891617 646718369 640761490 646778336
3882.6F46778336J746292R60846L467788j2933960J627274M926224J105804L721237
$$ 646778336 648524628 649485474 652953262 640019302 641646576 646572800 647678604 651399841
3890.3F51399841j256408p749558J201019L905487r17282O10733P24564J820908J530304
$$ 651399841 650143433 642393875 643594894 647500381 646583099 647193832 647918396 649739304 651269608
3898.9F51269608r193116M202042J484833n044480L970108k781448p72476O90994R48334
$$ 651269608 642076492 646278534 647763367 642718887 646688995 643907547 643135071 643826065 644774399
3907.6F44774399J965790M5852L27988j54190P26242J58005q50602K26136J193390
$$ 644774399 646740189 646786041 647114029 646959839 647686081 647844086 646993484 647219620 648413010
3916.3F48413010k996140l477249M149094m08783l991089K585296K302170J462860
$$ 648413010 645416870 641939621 646088715 645679932 641688843 644274139 646576309 648039169
3924F48039169j223373k666626J068039J673431J331711j012649r32465J304016j992111
$$ 648039169 646815796 644149170 645217209 646890640 648222351 647209702 646277237 647581253 645589142
3932.7F45589142r86862J469040k21940m56390j93405j91345m5243N34745J832351
$$ 645589142 644602280 646071320 645849380 645392990 645199585 645008240 644962997 645497742 647330093
3941.4F47330093j69296l927078j54266J919326J518860Q58307k473907K71606L73993
$$ 647330093 647160797 643233719 643079453 644998779 646517639 647375946 644902039 645173645 645547638
3950.1F45547638j907730J388244j50604l47061Q87451J84555k52990j045304O51551
$$ 645547638 643639908 645028152 644877548 644530487 645417938 645602493 645349503 644304199 644955750
3958.7F44955750L61251J04828M9820j274032j70823M53644j88446p61795O24390Q69293
$$ 644955750 645317001 645421829 645471649 644197617 644026794 644480438 644291992 643530197 644154587 645023880
3968.4F45023880m08478k10647M22439L20587n40237K42996L85742n98755l92608O15310
$$ 645023880 644615402 644404755 644827194 645147781 644607544 644850540 645236282 644637527 644244919 644860229
3978F44860229O61088k99759k10495j10398o8435l13492J58462O77948J45645k71682
$$ 644860229 645521317 645221558 645011063 644900665 644832230 644518738 644677200 645355148 645500793 645229111
3987.7F45229111k81220P34101k93351r92126J41907O91452J49154j081924p2098L58963
$$ 645229111 644947891 645681992 645388641 644396515 644538422 645229874 645379028 644297104 644225006 644583969
3997.3F44583969N10712L15704L49503
$$ 644583969 645094681 645410385 645759888
4000.2F45759888
$$ 645759888
##END=$$ End of the data block
