##TITLE=$$ Begin of the data block
##JCAMP-DX=5.00 $$ ACD/SpecManager v 10.08
##SPECTROMETER/DATA SYSTEM=Varian
##DATE=15 Jan 2013 11:10:24
##DATA TYPE=INFRARED SPECTRUM
##DATA CLASS=XYDATA
##ORIGIN=
##OWNER=
##NPOINTS=3735
##FIRSTX=399.26403809
##LASTX=4000.35498047
##MAXX=4000.35498047
##MINX=399.26403809
##MAXY=70.66930389
##MINY=16.32924080
##XFACTOR=1.0000000000
##YFACTOR=0.000000100000000
##FIRSTY=37.56534576
##DELTAX=0.96440572
##XUNITS=1/CM
##YUNITS=TRANSMITTANCE
##XYDATA=(X++(Y..Y))
399.3C75653458j1124916j536828M178048J423721M448357k071152r425278k916183
$$ 375653458 364528542 362991714 367169762 368593483 373041840 370970688 361545410 358629227
407C58629227O739883j25847l406944L390198m61617Q91800J883888N12314j123771
$$ 358629227 365369110 365243263 361836319 365226517 364764900 365656700 367540588 368052902 366929131
415.7C66929131l286820j928863r338875p89528R471054K884026k122460j881599K832260
$$ 366929131 363642311 361713448 352374573 351585045 361056099 363940125 361817665 359936066 362768326
424.3C62768326M013328N63202r465980o813202j454582j807557J019631J848907J841812
$$ 362768326 366781654 367344856 357878876 351065674 349611092 347803535 348823166 350672073 352513885
433C52513885J317406q41636O16569L992271O28396J938858K054138l803139j959381
$$ 352513885 353831291 352989655 353606224 357598495 358226891 360165749 362219887 358416748 356457367
441.7C56457367K584152N124054j292343l236427j631584m585419M081268M363022
$$ 356457367 359041519 364165573 362873230 359636803 358005219 353419800 357501068 361864090
449.4C61864090k500877m446068m94766R58251l674354L439369N412827M183082k79426
$$ 361864090 359363213 354917145 354422379 355380630 351706276 355145645 360558472 364741554 364462128
458.1C64462128q180428k231254k688294m44069J874619k9946j92642r01604k693367
$$ 364462128 356281700 354050446 351362152 350918083 352792702 352762756 352570114 351668510 348975143
466.8C48975143j485061J727333k316399k198028k40670j222763L063660L586273k298279
$$ 348975143 347490082 349217415 346901016 344702988 344462318 343239555 346303215 349889488 347591209
475.5C47591209o461715J444282L011132j149559m27933J49193j580162o972619k277946
$$ 347591209 341129494 342573776 345584908 344435349 344007416 344156609 342576447 335603828 333325882
484.1C33325882M270668J656303L188706j126023k010803L425217O45180l684311k327538
$$ 333325882 337596550 339252853 342441559 341315536 339304733 342729950 343375130 339690819 337363281
492.8C37363281J145592L82614q84743P39746R30634J79596k074814k111778k908478
$$ 337363281 338508873 338891487 338006744 338746490 339677124 339856720 337781906 335670128 332761650
501.5C32761650j960869N026779J66245l480377j666031k79465L728981J364937k006111
$$ 332761650 330800781 335827560 335993805 332513428 330847397 330567932 334296913 335661850 333655739
510.2C33655739k137108j878967l62702L06549O93550J607972m29268n027199j757050
$$ 333655739 331518631 329639664 329276962 329583511 330277061 331885033 331455765 326428566 324671516
518.9C24671516J873742J02691j459350j143723k18773j997871k129708J88904J682587
$$ 324671516 326545258 326647949 325188599 324044876 323826103 321828232 319698524 319887428 321570015
527.5C21570015P10678j422844L41568O11534j045456m40826J241188M95796j621628
$$ 321570015 322280693 320857849 321199417 321810951 320765495 320324669 321565857 322061653 320440025
536.2C20440025j22986R67408k96212j938457j768608r7790P99770m14028j837845
$$ 320440025 320317039 321284447 320988235 319049778 317281170 317183380 317983150 317569122 315731277
544.9C15731277j31149j062374m7550J695728j665287r74235m34075r16843M58832
$$ 315731277 315600128 314537754 314490204 316185932 314520645 313546410 313112335 312195492 312654324
553.6C12654324j176739j395760L06530L3436r03454j241760o03333R20887J608754
$$ 312654324 311477585 310081825 310388355 310421791 309518337 308276577 307673244 308594131 310202885
562.3C10202885P04040o42719q23822J20125k2335p09305n8460N08861R15146Q92983
$$ 310202885 310906925 310264206 309440384 309560509 309538174 308828869 308770409 309279270 310194416 311087399
571.9C11087399q62370j403370l36113o1798m86145o26831J45225J50433r29165l27282
$$ 311087399 310225029 308821659 308485546 308423748 307937603 307310772 307455997 307606430 306677265 306349983
581.5C06349983Q23422K4852l5858J497860J186314J12343p27787n91030M82978N51777
$$ 306349983 307173405 307198257 307162399 308660259 309846573 309958916 309231129 308640099 309123077 309674854
591.2C09674854j2607R6760J41201N26199J854019J087589Q21743N5142j897717l40519
$$ 309674854 309662247 309759007 309900208 310426407 312280426 313368015 314189758 314244900 312347183 312006664
600.8C12006664n19523l58429J411705J21479j120472p80907n08652r34295j65024
$$ 312006664 311487141 311128712 312540417 312661896 311541424 310760517 310251865 309317570 309152546
609.5C09152546j548958k121124R47647M76627r10511j772079j128025P28302Q00228
$$ 309152546 307603588 305482464 306430111 306906738 305996227 304224148 303096123 303824425 304624653
618.2C04624653j83811r74732J063366J131306J032638J406784k46810L14922M99782
$$ 304624653 304440842 303466110 304529476 305660782 306693420 308100204 307853394 308168316 308668098
626.9C08668098N03464J836109K773915J656665N84431Q94566Q79345J987171K210102
$$ 308668098 309171562 311007671 313781586 315438251 316022682 316917248 317796593 319783764 321993866
635.5C21993866J715698J257286J106453J615906R92737J515121J887055J016884J012764
$$ 321993866 323709564 324966850 326073303 327689209 328681946 330197067 332084122 333101006 334113770
644.2C34113770J099586Q44116R10301R46579R3308Q36525J917381R27658J92719n13497
$$ 334113770 335213356 336057472 336967773 337914352 338007660 338844185 340761566 341689224 341881943 341368446
653.9C41368446O19545J524315l32451r23195j316413j526J461754J36871p69577j259346
$$ 341368446 341987991 343512306 343179855 342256660 340940247 340938721 342400475 342537346 341767769 340508423
663.5C40508423k14272O98624J91612k70157j818008J036644J291695J466980J565437
$$ 340508423 340294151 340992775 341184387 340914230 339096222 340132866 341424561 342891541 344456978
672.2C44456978Q67309Q06466N32112M58107J303177J307792J354637J351586J354522
$$ 344456978 345324287 346130753 346662865 347120972 348424149 349731941 351086578 352438164 353792686
680.9C53792686J735383O25457J565132K285119J792J026917J681900M35524Q78830
$$ 353792686 355528069 356153526 357718658 360003777 360005569 361032486 362714386 363149910 364028740
689.6C64028740N11246l43056P55234K410736J255798M20532Q02346L92379j48429
$$ 364028740 364539986 364196930 364952164 367362900 368618698 369039230 369841576 370233955 370085526
698.2C70085526m87175N41496J127777J840515J823082P60994J532898J728706P88460
$$ 370085526 369598351 370139847 371267624 373108139 374931221 375692215 377225113 378953819 379742279
706.9C79742279J63727M95338N4207J22070J433602Q20198N98602J805077K038574
$$ 379742279 379906006 380401344 380455551 380577621 382011223 382831421 383430023 385235100 387273674
715.6C87273674P31316O98433K00119m93203R61457O32171J028862J352425Q72002
$$ 387273674 388004990 388703423 388903542 388410339 389371796 390003967 391032829 392385254 393257256
724.3C93257256J219368J015510J304093J099395J680031R87396l90663K72141O39114
$$ 393257256 394476624 395492134 396796227 397895622 399575653 400563049 400172386 400444527 401083641
733D01083641Q58345P75070J216431J535873J192437Q2016n73121K06299N01633J089592
$$ 401083641 401941986 402717056 403933487 405469360 406661797 406743813 406170692 406376991 406878624 407968216
742.6D07968216R91745K42615O5422Q76541Q44765J39350J157532J480904J468429
$$ 407968216 408959961 409202576 409267998 410144539 410989304 411128654 412286186 413767090 415235519
751.3D15235519L97263m16946P05909J176415J584205J521912J672173J987419J478843
$$ 415235519 415632782 415215836 415921745 417098160 418682365 420204277 421876450 423863869 425342712
760D25342712J070900J417923J228905K10457P2365L1471P85942J399193R50317K67945
$$ 425342712 426413612 427831535 429060440 429270897 429343262 429374733 430160675 431559868 432510185 432778130
769.6D32778130j15090Q4038J77765k6093m56428K9831k97737k22931N0811n12275
$$ 432778130 432663040 432747078 432924843 432898750 432442322 432472153 432174416 431951485 432002296 431490021
779.2D31490021L27759O41899O05468J08529N37948M86565k9488J083985L02772N07011
$$ 431490021 431817780 432459679 433065147 433173676 433711624 434198189 434168701 435252686 435555458 436062469
788.9D36062469Q12684J94435k73323j21651P65266r5291l56407j269226n90134N27573
$$ 436062469 436875153 437069588 436796265 436674614 437439880 437344589 436988182 435718956 435128822 435656395
798.5D35656395p82013k167969l276138j532135o78635j414604k071648k500648k303200
$$ 435656395 434874382 432706413 429430275 427898140 427219505 425804901 423733253 421232605 418929405
807.2D18929405k493477j895790j695442j497383j374741j752243k167778j953315
$$ 418929405 416435928 414540138 412844696 411347313 409972572 408220329 406052551 404099236
814.9D04099236j629105j276512m07677q78487p7095N80178J11541N80483J347923
$$ 404099236 402470131 401193619 400785942 399907455 399830360 400410538 400522079 401102562 402450485
823.6D02450485K696953K497940K141113K273026K939682L992386L542557K767982
$$ 402450485 405147438 407645378 409786491 412059517 414999199 418991585 422534142 425302124
831.3D25302124K323074L377762L470574L386726K552567J647682K371635J853562
$$ 425302124 427625198 431002960 434473534 437860260 440412827 442060509 444432144 446285706
839D46285706L059616K392807K026367K538605J991539K374229Q53081J510772J798935
$$ 446285706 449345322 451738129 453764496 456303101 458294640 460668869 461521950 463032722 464831657
847.7D64831657J859208J824569J826401J677284j54762J873016J619988J346969K178154
$$ 464831657 466690865 468515434 470341835 472019119 471864357 473737373 475357361 476704330 478882484
856.4D78882484K412262K530671R64012K331238J697807J425819J386681M51584J22490
$$ 478882484 481294746 483825417 484789429 487120667 488818474 490244293 491630974 492082558 492205048
865.1D92205048n44892J297q48961R8114m94308p47185m97742j391449j287841k353211
$$ 492205048 491660156 491661453 490812492 490910606 490416298 489669113 489171371 487779922 486492081 484138870
874.7D84138870r05647j478004j485558j381302j446571J57356r91592j09826j337089
$$ 484138870 483233223 481755219 480269661 478888359 477441788 477599144 476607552 476497726 475160637
883.4D75160637j611061m40827j277809r20601j226616j208725j345748M77829M60853
$$ 475160637 473549576 473108749 471830940 470910339 469683723 468474998 467129250 467607079 468067932
892.1D68067932m98199k27814r95712m59824o99387O3057o82563j300888m61426j70632
$$ 468067932 467569733 467341919 466346207 465886383 465186996 465250053 464567490 463266602 462805176 462634544
901.7D62634544K52266p03087J014443K056618K084999J968307J508675J934891O74820
$$ 462634544 462886810 462183723 463198166 465254784 467339783 469308090 470816765 472751656 473426476
910.4D73426476P15675M12025J75324o24085j420517j572342k684860k506065l261795
$$ 473426476 474142151 474554176 474729500 474105415 472684898 471112556 468427696 465921631 462659836
919.1D62659836l028488k308083k399139l170967l367691k898980l331108k777328
$$ 462659836 459631348 457323265 454924126 451753159 448385468 445486488 442155380 439378052
926.8D39378052l857155l957214l502808l275223k147713k546119j990471j972771
$$ 439378052 435520897 431563683 428060875 424785652 422637939 420091820 418101349 416128578
934.5D16128578j417274m87671j290474j721954j455956j177788j894645j356545r57603
$$ 416128578 414711304 414223633 412933159 411211205 409755249 408577461 406682816 405326271 404368668
943.2D04368668r08280l08685m59671n45502j024132j39503J76964q82988q10471o03294
$$ 404368668 403460388 403151703 402692032 402146530 401122398 400982895 401159859 400276871 399466400 398863106
952.8C98863106r86519j577225j861687k044754j777496k720756l443184k583504k244148
$$ 398863106 397876587 396299362 394437675 392392921 390615425 387894669 384451485 381867981 379623833
961.5C79623833k389260k298507k076149k262993j712723k065506k398910j962891
$$ 379623833 377234573 374936066 372859917 370596924 368884201 366818695 364419785 362456894
969.2C62456894k825584k695961k692490l068810k838096k900505l425370l627967
$$ 362456894 359631310 356935349 354242859 351174049 348335953 345435448 342010078 338382111
976.9C38382111l571778m532585m800491m825211m940853n234127o001244n661373
$$ 338382111 334810333 330277748 325477257 320652046 315711193 310477066 304475822 298814449
984.7B98814449m902839m769326m967422m960327m511719m231205m515762m228077
$$ 298814449 293911610 289142284 284174862 279214535 274702816 270471611 265955849 261727772
992.4B61727772l943997m068412l860283l266621l220882l179455k638550k693253
$$ 261727772 257783775 253715363 249855080 246588459 243367577 240188122 237549572 234856319
1000.1B34856319k767105l135471k163601k329292k649880j197700j755276j331940
$$ 234856319 232089214 228953743 226790142 224460850 221810970 220613270 218857994 217526054
1007.8B17526054j877288k071667j264839j964798j399536j430645j658287j917134
$$ 217526054 215648766 213577099 212312260 210347462 208947926 207517281 205858994 203941860
1015.5B03941860j847420k469520k468166j525784j580029j744499l358516j786480
$$ 203941860 202094440 199624920 197156754 195630970 194050941 192306442 188947926 187161446
1023.2A87161446j318951k494049j426811j756020j854286j599522m70905j182346
$$ 187161446 185842495 183348446 181921635 180165615 178311329 176711807 176240902 175058556
1031A75058556n64537l31345j237450N76840n6153M93794P61986J775379K149315J225471
$$ 175058556 174494019 174162674 172925224 173502064 173445911 173939705 174701691 176477070 178626385 179851856
1040.6A79851856J922379M09527R84115O93855J01262L18775q9932j0452p21741o94446
$$ 179851856 181774235 182183762 183167877 183861732 183962994 184281769 184191837 184181385 183459644 182765198
1050.2A82765198j353607o91529j232681j180420l76816q95424k03781q17585L27816
$$ 182765198 181411591 180720062 179487381 178306961 177930145 177034721 176830940 176013355 176341171
1058.9A76341171L66516J084404K010765K093106K459984J357002K515125J630364
$$ 176341171 176707687 177792091 179802856 181895962 184355946 185712948 188228073 189858437
1066.6A89858437K304344K020912M98829J168690M44927J339111Q75092O05869m47445
$$ 189858437 192162781 194183693 194682522 195851212 196296139 197635250 198510342 199116211 198668766
1075.3A98668766J99986J416740R5386J348801J197796J410885Q24337P22332O21719
$$ 198668766 198868752 200285492 200380878 201729679 202927475 204338360 205162697 205885029 206506748
1084B06506748L08914J594258Q49571J518745P19910J607571J872730Q49495K446384
$$ 206506748 206815662 208409920 209259491 210778236 211498146 213105717 214978447 215827942 218274326
1092.7B18274326J432267J149482Q38299J288052J132831J124077J640778P03926K063293
$$ 218274326 219706593 220856075 221694374 222982426 224115257 225239334 226880112 227584038 229647331
1101.4B29647331J723576J561737J005707J015281K415333J650067R03930k03228L85361
$$ 229647331 231370907 232932644 233938351 234953632 237368965 239019032 239922962 239719734 240105095
1110B40105095Q59680R99146J236152J276665J238937N04628J323013L73707M2324
$$ 240105095 240964775 241963921 243200073 244476738 245715675 246220303 247543316 247917023 247959347
1118.7B47959347J45092l60451J40877l22952L45573O84929O83689R20944J771355
$$ 247959347 248104439 247743988 247884865 247561913 247907486 248592415 249276104 250197048 251968403
1127.4B51968403J094265Q40835L269425K292538P64064P54128K408695L248749K176609
$$ 251968403 253062668 253903503 257172928 259465466 260229530 260983658 263392353 266641102 268817711
1136.1B68817711K329464K228393K244645J730861K102432J889630O59942J141129
$$ 268817711 271147175 273375568 275620213 277351074 279453506 281343136 282003078 283144207
1143.8B83144207J175041R97811R46865R13543M45843J0223k06470m92115q5621j95942
$$ 283144207 284319248 285317059 286263924 287177467 287623310 287633533 287427063 286934948 286849327 286653385
1153.4B86653385O2008Q2207m44031o96239r78508j053620j074924n50480n11875N7659
$$ 286653385 286715393 286797600 286353569 285657330 284678822 283625202 282550278 281999798 281487923 281545582
1163.1B81545582N67016K72522J027775K173176K542515K122841K827358L128014L119411
$$ 281545582 282112598 282385120 283412895 285586071 288128586 290251427 293078785 296206799 299326210
1171.8B99326210L158093K776508L204841L637505L445606K907048L206710L277359
$$ 299326210 302484303 305260811 308465652 312103157 315548763 318455811 321662521 324939880
1179.5C24939880K739411K480659K764511K730637J988220J770706K081414J607513
$$ 324939880 327679291 330159950 332924461 335655098 337643318 339414024 341495438 343102951
1187.2C43102951O02646R90524P28073L12310K27394n30587n21431n98182p35169o19354
$$ 343102951 343705597 344696121 345424194 345736504 345963898 345433311 344911880 344313698 343578529 342959175
1196.8C42959175o43043j356545j607551j342049j636276j455994j355782j185913
$$ 342959175 342316132 340959587 339352036 338009987 336373711 334917717 333561935 332376022
1204.5C32376022j200370j285859p96585o96907l68995l98064p82700p18612o97899
$$ 332376022 331175652 329889793 329093208 328396301 328027306 327629242 326846542 326127930 325430031
1213.2C25430031m59290n56602n69954k95868n36728o60553j46789O3819n80482p75032
$$ 325430031 324970741 324414139 323844185 323548317 323011589 322351036 322204247 322268066 321687584 320912552
1222.9C20912552n31502n78632r50909j217441q70610p90939q31852n68676o52714
$$ 320912552 320381050 319802418 318851509 317634068 316763458 315972519 315140667 314571991 313919277
1231.5C13919277r87949r92603p33090q31604o08501l13416l58734j21651q7089r2316
$$ 313919277 312931328 311938725 311205635 310374031 309765530 309452114 309093380 308971729 308884640 308792324
1241.2C08792324k12631o09532n43460l40710n04265m71382o86760o35834m1332j72844
$$ 308792324 308579693 307970161 307426701 307085991 306581726 306110344 305423584 304787750 304746418 304573574
1250.8C04573574j61400l21369n28030k05574J45969L281n86357Q3122L9387j86463
$$ 304573574 304412174 304090805 303562775 303357201 303503170 303506451 302920094 303003216 303042603 302856140
1260.5C02856140L02029L4733M56104O06251M65164L77579P46917Q76751O23760R15528
$$ 302856140 303158169 303192902 303649006 304255257 304720421 305098000 305844917 306721668 307345428 308260956
1270.1C08260956P06291J151524J232299J137867J227837J252632J454315R45607J075973
$$ 308260956 308967247 310118771 311351070 312488937 313716774 314969406 316423721 317369328 318445301
1278.8C18445301J113071J065827J517563J875839J791306J675911J592102J503639
$$ 318445301 319558372 320624199 322141762 324017601 325808907 327484818 329076920 330580559
1286.5C30580559K129364J580086J136474J369019J231880J053924J027070J153297
$$ 330580559 332709923 334290009 335426483 336795502 338027382 339081306 340108376 341261673
1294.2C41261673Q42171R68513R46732P57637N58624P26090O96372J05515J86234j23902
$$ 341261673 342103844 343072357 344019089 344776726 345335350 346061440 346757812 346863327 347049561 346925659
1303.9C46925659j34239J21117M36401Q5220n45997m17939r45129o83975j85127m03328
$$ 346925659 346791420 346912537 347348938 347434158 346888161 346470222 345525093 344841118 344655991 344252663
1313.5C44252663q12874n64461J49574L30925P06902M89731O90918J028099Q86574
$$ 344252663 343439789 342875328 343024902 343355827 344062729 344552460 345243378 346271477 347158051
1322.2C47158051N93719M29459J206932P56988M61998O07186K47192l62511p93838
$$ 347158051 347751770 348181229 349388161 350145149 350607147 351214333 351461525 351099014 350305176
1330.9C50305176l97568m78401l90816m12674m32014k89727L8910N68581J74484J78032
$$ 350305176 349907608 349429207 349038391 348625717 348193703 347903976 347942886 348511467 348685951 348863983
1340.5C48863983K90337P70874Q57620O48613R25484Q23555R54361L19442K69700J85775
$$ 348863983 349154320 349925194 350782814 351431427 352356911 353180466 354134827 354454269 354723969 354909744
1350.2C54909744l03764m36668m37317k56119q65326n42641j60446M0970j41296l39509
$$ 354909744 354605980 354169312 353731995 353475876 352610550 352067909 351907463 351948433 351807137 351467628
1359.8C51467628m38537j182938p13310n20668J30501n73960j071853k99492o84090
$$ 351467628 351029091 349846153 349132843 348612175 348742676 348168716 347096863 346797371 346113281
1368.5C46113281k11601k63786l78189l86429n00450n03197k00539M80538k89002k84347
$$ 346113281 345901680 345637894 345259705 344873276 344372826 343869629 343669090 344149628 343860626 343576279
1378.1C43576279n16548l53241l32261q77380r51729j761589j275444j140060j334343
$$ 343576279 343059731 342706490 342374229 341496849 340545120 338783531 337508087 336368027 335033684
1386.8C35033684k624665j793670o49109j819611j757774k118721j861496k353249
$$ 335033684 332409019 330615349 329966240 328146629 326388855 324270134 322408638 320055389
1394.5C20055389l795681j992702j558876j563187l466472k560997j433087k282543
$$ 320055389 316259708 314267006 312708130 311144943 307678471 305117474 303684387 301401844
1402.2C01401844k042866k088814l001346k759037j430931j508846j813260j709556
$$ 301401844 299358978 297270164 294268818 291509781 290078850 288570004 286756744 285047188
1409.9B85047188k139607j199073j136761j207180j138592j662254r64432p93247K30846
$$ 285047188 282907581 281708508 280571747 279364567 278225975 276563721 275599289 274806042 275036888
1418.6B75036888j098614j72577J352730O3172M96196n5465Q35933J147232N34687
$$ 275036888 273938274 273765697 275118427 275181599 275677795 275622330 276458263 277605495 278140182
1427.3B78140182J366120R76086J291141P73983J771259J827984J638699K263641J425533
$$ 278140182 279506302 280482388 281773529 282547512 284318771 286146755 287785454 290049095 291474628
1436B91474628K440491J421967K495098J861687J590061K322597J567536K267990J683521
$$ 291474628 293915119 295337086 297832184 299693871 301283932 303606529 305174065 307442055 309125576
1444.7C09125576J833725J327381J077747R67312J547318K668819J676312K091713
$$ 309125576 310959301 312286682 313364429 314331741 315879059 318547878 320224190 322315903
1452.4C22315903J552543K234040J745872K76375J614952P93381M293899J840134K542076
$$ 322315903 323868446 326102486 327848358 328124733 329739685 330533066 334826965 336667099 339209175
1461.1C39209175K560616K035522K496758J284141L007469K157250K910538K555847
$$ 339209175 341769791 343805313 346302071 347586212 350593681 352750931 355661469 358217316
1468.8C58217316K468528L077736J422272K765770L805008M635887L201599K898598
$$ 358217316 360685844 363763580 365185852 367951622 371756630 376392517 379594116 382492714
1476.5C82492714L391228K501945K223587J856766K402801J912384J538277J765175
$$ 382492714 385883942 388385887 390609474 392466240 394869041 396781425 398319702 400084877
1484.2D00084877J631393J834679J183586O80924R81254j209335p94563L77502j51863
$$ 400084877 401716270 403550949 404734535 405415459 406396713 405187378 404392815 404770317 404618454
1492.9D04618454p77473r71833j172256m656716j64184j633721l306770p46803j780014
$$ 404618454 403840981 402869148 401696892 397040176 396875992 395242271 391935501 391188698 389408684
1501.6C89408684j644554j547852J42479M8447k639618k921105o62765J310005q80852
$$ 389408684 387764130 386216278 386358757 386407204 383767586 380846481 380183716 381493721 380612869
1510.2C80612869K40670j844407k345848J57852q15200l41072j671944j627731R67674
$$ 380612869 380853539 379009132 376663284 376821136 376005936 375664864 373992920 372365189 373332863
1518.9C73332863J568832l56674k626266Q78295J051178J557045P7591R14116J147652
$$ 373332863 374901695 374545021 371918755 372797050 373848228 375405273 375482864 376396980 377544632
1527.6C77544632O41746J179314J043320R17320O65474N98373j383438J458245J334571
$$ 377544632 378186378 379365692 380409012 381326332 381991806 382590179 381206741 382664986 383999557
1536.3C83999557P11480J353187k338066J01128K134094J340065n8861J280327O87904
$$ 383999557 384711037 386064224 383726158 383827286 385961380 387301445 387242584 388522911 389210815
1545C89210815j553993J585808P51953N08385p71599j71318J337280p3242K69852k527428
$$ 389210815 387656822 389242630 389994583 390502968 389731369 389560051 390897331 390824089 391093941 388566513
1554.6C88566513j29661O94007J186180k996292j2424354L741188L57399J035194j781387
$$ 388566513 388436852 389130859 390317039 387320747 374896393 378637581 378994980 380030174 378248787
1563.3C78248787j774941l557395l681107j667099l271675j920319r218483j976852
$$ 378248787 376473846 372916451 369235344 367568245 364296570 362376251 353157768 351180916
1571C51180916k047997l676948l215866m463387k753754j2769317j019364l537559
$$ 351180916 349132919 345455971 342240105 337776718 335022964 322253647 321234283 317696724
1578.7C17696724m725704m256535n802460l378486o183930l844719n618743m667206
$$ 317696724 312971020 308714485 302912025 299533539 293349609 289504890 283886147 279218941
1586.4B79218941m519863n712414l564778n977363k619496n422668l433170m184285
$$ 279218941 274699078 268986664 265421886 259444523 256825027 251402359 247969189 243784904
1594.1B43784904n159740k346077n006714k135544m846439k248878l480568l478604
$$ 243784904 238625164 236279087 231272373 229136829 224290390 222041512 218560944 215082340
1601.9B15082340j719398m047203r22718l430310r65824k847538j262245j097965k921143
$$ 215082340 213362942 209315739 208393021 204962711 203996887 201149349 199887104 198789139 195867996
1610.5A95867996P7934k648143M71096k063828L45993O89240m666386J512013j595726
$$ 195867996 195945930 193297787 193768883 191705055 192051048 192740288 188073902 189585915 187990189
1619.2A87990189J318473j081409J246662l91235j406365J861801o77967K009945j530800
$$ 187990189 189308662 188227253 189473915 189082680 187676315 189538116 188860149 190870094 189339294
1627.9A89339294J924210N70488R57356J221332m57706K638549n52177K376842j202144
$$ 189339294 191263504 191833992 192791348 194012680 193554974 196193523 195641346 198018188 196816044
1636.6A96816044L143577K561436J013279K742977J60160K686119Q79822K680607J780262
$$ 196816044 199959621 202521057 203534336 206277313 206437473 209123592 210003414 212684021 214464283
1645.3B14464283j020718L406773N39017M076366N66254K973976J799583k34184K885895
$$ 214464283 213443565 216850338 217389355 221465721 222031975 225005951 226805534 226571350 229457245
1653.9B29457245r14440M166107P87086K639428J394500K211170K622948J936302L507901
$$ 229457245 228542805 232708912 233495998 236135426 237529926 239741096 242364044 244300346 247808247
1662.6B47808247L50685M241199K571488L389816L120270K563400M644737J762390
$$ 247808247 248158932 252400131 254971619 258361435 261481705 264045105 268689842 270452232
1670.3B70452232N365048L002224M854221M194679L734627M181652L378163N163860
$$ 270452232 275817280 278819504 283673725 287868404 291603031 295784683 299162846 304326706
1678C04326706L442745N582447M087467M648037N543785K858582P981262K485123O387787
$$ 304326706 307769451 313351898 317439365 322087402 327631187 330489769 338471031 340956154 347343941
1686.7C47343941M905205M959716N082283M754448N926743N069046N857467M990120
$$ 347343941 352249146 357208862 362291145 367045593 372972336 378041382 383898849 388888969
1694.4C88888969N220719M647674O141777O001511M982529M478225K700081P915650
$$ 388888969 394109688 398757362 404899139 410900650 415883179 420361404 423061485 430977135
1702.1D30977135N781402M680786M079972M232406L832093L459129M585648L271217
$$ 430977135 436758537 441439323 445519295 449751701 453583794 457042923 461628571 464899788
1709.9D64899788K970314L242645L017769L072968J613769K377625M065437K176132
$$ 464899788 467870102 471112747 474130516 477203484 478817253 481194878 485260315 487436447
1717.6D87436447k610817L758393L686141K503853K284699J342277J122017K295456
$$ 487436447 484825630 488584023 492270164 494774017 497058716 498400993 499523010 501818466
1725.3E01818466K487068J448594J556854K376137P68699J062393L622055K943345
$$ 501818466 504305534 505754128 507310982 509687119 510455818 511518211 515140266 518083611
1733E18083611k242165j698608N475730M633675K826729L379936R49135m27666M552651
$$ 518083611 515841446 514142838 519618568 524252243 527078972 530458908 531408043 530980377 535533028
1741.7E35533028L551674J654663K444801M150429L812523L053512K982178K308273
$$ 535533028 539084702 540739365 543184166 547334595 551147118 554200630 557182808 559491081
1749.4E59491081N204201K673569K272644N143890L702507L921242L677978J583558
$$ 559491081 564695282 567368851 569641495 574785385 578487892 582409134 586087112 587670670
1757.1E87670670K570800L893853L544082L395081k99988R11217M141197K350998K479057
$$ 587670670 590241470 594135323 597679405 601074486 600774498 601685715 605826912 608177910 610656967
1765.8F10656967K854996K119560j108208K654229M516830J33591o90994n7869M420852
$$ 610656967 613511963 615631523 614523315 617177544 621694374 621827965 621136971 621079102 625499954
1774.5F25499954K393913l56025K522163J255455K040444J015434O1493J377868J874962
$$ 625499954 627893867 627537842 630060005 631315460 633355904 634371338 634432831 635810699 637685661
1783.2F37685661J988488l70026N62897J896896J849670J206818J906815J065521j31302
$$ 637685661 639674149 639304123 639867020 641763916 643613586 644820404 646727219 647792740 647661438
1791.8F47661438j470871j50452M106217J399078L17612J637726J553344J145096n13382
$$ 647661438 646190567 646040115 650146332 651545410 651863022 653500748 655054092 656199188 655685806
1800.5F55685806J785660q3923O30340J966324J106644J236191N10330Q83560J231308
$$ 655685806 657471466 657387543 658017883 659984207 661090851 662327042 662837372 663720932 664952240
1809.2F64952240J247025r26972J082077J565476K83660J401825L68729J021576p0801
$$ 664952240 666199265 665272293 666354370 667919846 668203506 669605331 669974060 670995636 670924835
1817.9F70924835O67343J305924M25033J523972O5689J231079O19431j875840Q68531
$$ 670924835 671592178 672898102 673323135 674847107 674912796 676143875 676763306 674887466 675755997
1826.5F75755997K230682K097855m97284k824021J025620K686157N84183M45556N37873
$$ 675755997 677986679 680084534 679587250 676763229 677788849 680475006 681059189 681504745 682042618
1835.2F82042618L35388L61176m96750J520233P02743J208344R55887Q84170M13513
$$ 682042618 682378006 682739182 682242432 683762665 684465408 685673752 686629639 687513809 687927322
1843.9F87927322n327606K453995K363052K55051j45569O24390J626892K76794R02787
$$ 687927322 682599716 685053711 687416763 687671814 687526245 688150635 689777527 690054321 690957108
1852.6F90957108l6927M20151J34430k58255O18362k5634O62002k08435O58264O03333
$$ 690957108 690920181 691340332 691474762 691216507 691834869 691809235 692471237 692262802 692921066 693524399
1862.2F93524399N16586N54962M6997R50928m47235M88739j165695j231690J290360
$$ 693524399 694040985 694595947 694642944 695593872 695146637 695635376 694469681 693237991 694528351
1870.9F94528351J256256J395721K39411P45544R766m8828l0365m9668K48261l14102
$$ 694528351 695784607 697180328 697419739 698165283 698175049 698126221 698095856 698046188 698294449 697980347
1880.6F97980347P15255K04621N52063l36533P4768J120377P0572P73086r11789j013641
$$ 697980347 698695602 698900223 699452286 699115753 699190521 700310898 700381470 701154556 700242767 699229126
1890.2F99229126N78079P79190N38559M62113O5918o03028J460190J32065l21961K39258
$$ 699229126 699807205 700586395 701124954 701587067 701652985 701049957 702510147 702642212 702320251 702559509
1899.8G02559509J60065M08249l05863M45557j62430M51660L09983j70746J34430l23105
$$ 702559509 702719574 703127823 702821960 703267517 703105087 703556747 703866730 703695984 703830414 703507309
1909.5G03507309q1558l13034P66525k80685L58123P09763L57284J582337j784210
$$ 703507309 703425751 703112717 703879242 703598557 703956680 704666443 705023727 706606064 704821854
1918.2G04821854n61142P15027K37197J05973j340485K594M46854O63452M22745N09414
$$ 704821854 704260712 704975739 705212936 705318909 703978424 703981018 704427872 705091324 705514069 706023483
1927.8G06023483j14975j78833p6n38940M62722k55661J32218J08261M35791O19049
$$ 706023483 705908508 705729675 705729599 705190659 705653381 705397720 705529938 705638199 706073990 706693039
1937.5G06693039l46298K02026n98755M39148k42386j214599N61599O87l19443j56936
$$ 706693039 706346741 706548767 705950012 706389160 706146774 704932175 705493774 705494461 705175018 705018082
1947.1G05018082O81915J98440O8131k37274k35825L22266l17993L2119Q698M22287
$$ 705018082 705699997 705898437 705966568 705729294 705493469 705815735 705497742 705529861 705538559 705960846
1956.7G05960846l35999j91650M79126j57013M6921l48587J31149m17480J18484L57590
$$ 705960846 705624847 705433197 705912323 705755310 705802231 705453644 705584793 705167313 705285797 705643387
1966.4G05643387o62918n4474q5297M77066m13589p63K85416j11237N20859l98865
$$ 705643387 704980469 704925995 704840698 705317764 704904175 704903412 705188828 705077591 705598450 705199585
1976G05199585l01514l53164J90887N9967O3477K07672m39530L97873l4027O6910l98941
$$ 705199585 704898071 704544907 704735794 704795761 704859238 705066910 704627380 705025253 704991226 705058136 704659195
1986.6G04659195l95279n4321l61405L78113l80783l51181j6174M30298o028l73153
$$ 704659195 704263916 704209595 703848190 704226303 703845520 703494339 703478165 703908463 703902435 703529282
1996.3G03529282J3351m69437K86408j69449k5101J61209J56708J12610m87060J20239
$$ 703529282 703542633 703073196 703359604 703190155 703165054 703326263 703482971 703595581 703108521 703228760
2005.9G03228760l94364j20849m34647m66995J2894j08719j4420n87616K97775K9221
$$ 703228760 702834396 702713547 702278900 701811905 701824799 701716080 701701660 701114044 701411819 701441040
2015.6G01441040q8119j52283j14899O0196p51495l0899n66254r8343j42822o6300
$$ 701441040 701352921 701200638 701085739 701145935 700394440 700363541 699797287 699698944 699556122 699489822
2025.2F99489822N00641o55517P782k00196Q1559r6894k90222q1711p37457j41907
$$ 699489822 699990463 699334946 699342728 699142532 699224091 699127197 698836975 698755264 698017807 697875900
2034.9F97875900k62603L53317j15891l36151M1733j65863k5253n51758K55813j59683
$$ 697875900 697613297 697966614 697850723 697514572 697556305 697390442 697365189 696813431 697069244 696909561
2044.5F96909561k08053k55433l52859K22855m2496K69470n08499k4948m45328m88892
$$ 696909561 696701508 696446075 696093216 696316071 696273575 696543045 696034546 696009598 695564270 695075378
2054.1F95075378K82593m56085Q9264k78473M8599j70364q7814J88369k4032O09588
$$ 695075378 695357971 694901886 694991150 694712677 694761276 694590912 694503098 694691467 694667435 695277023
2063.8F95277023l91388j47857m48838j51977K12250k95563J15204j67008M55780k59323
$$ 695277023 694885635 694737778 694288940 694136963 694349213 694053650 694168854 694001846 694457626 694198303
2073.4F94198303k47268j5717j61285k7466o05545J91116r6970K37580j07880m10385
$$ 694198303 693951035 693935318 693774033 693746567 693141022 693332138 693235168 693472748 693364868 692954483
2083.1F92954483k4261m43879j25656p50885K8687n2567k84042P8964l5324M17786
$$ 692954483 692930222 692486343 692360687 691609802 691638489 691585922 691301880 691380844 691345520 691763306
2092.7F91763306j72501K25143l92913o54526m52499k77176J33819l62549L01133k10953
$$ 691763306 691590805 691815948 691423035 690768509 690316010 690038834 690172653 689810104 690111237 689900284
2102.4F89900284J24512J47705l58735k76718n89752n8670o78253l5706M5395j97830
$$ 689900284 690024796 690172501 689813766 689537048 688947296 688888626 688210373 688174667 688220062 688022232
2112F88022232j89514m07333L44238l45001J76544J4419j72577j30615m96597O4163
$$ 688022232 687832718 687425385 687769623 687424622 687601166 687615585 687443008 687312393 686815796 686879959
2121.6F86879959l60031L70560K60467j67389l13110J3046M03595n87616k97622l63312
$$ 686879959 686519928 686890488 687150955 686983566 686670456 686683502 687087097 686499481 686201859 685838547
2131.3F85838547k8382o5536J04370N17120J82419L60642k95410O637m37393m46472
$$ 685838547 685810165 685744629 685848999 686366119 686548538 686909180 686613770 686620407 686183014 685736542
2140.9F85736542k03400p1106M29917n88532L65143M78363K12402J05286n22919l4180
$$ 685736542 685533142 685462036 685891953 685303421 685668564 686146927 686359329 686464615 685941696 685907516
2150.6F85907516j02844O3019l87192N7678Q9341L1814L95584k33001M1732k63748
$$ 685907516 685804672 685867691 685480499 685538177 685627518 685659332 686054916 685821915 685863647 685599899
2160.2F85599899J68457Q9951k07672l9368j14899J84479O8360P59658J76316Q2626
$$ 685599899 685768356 685858307 685650635 685611267 685496368 685680847 685749207 686508865 686685181 686767807
2169.9F86767807K23465n1346k21710q55560J43051l0670J50375K06299K92282O37817
$$ 686767807 686991272 686939926 686718216 685862656 686005707 685975037 686125412 686331711 686623993 687261810
2179.5F87261810l79715p8888j24511K10647r8266j90811j11390m27017O51703L62549
$$ 687261810 686882095 686803207 686678696 686889343 686791077 686600266 686488876 686061859 686713562 687076111
2189.1F87076111M41742J17798l7995j04294l28674P3471n49393J67237K84118M90265
$$ 687076111 687517853 687635651 687597656 687493362 687164688 687238159 686688766 686856003 687140121 687630386
2198.8F87630386M36173k00272k62756j47400P36923l56903m42810j14975J12915M17328
$$ 687630386 688066559 687866287 687603531 687456131 688193054 687836151 687393341 687278366 687391281 687808609
2208.4F87808609R4223P16553k32010r8343J25885J30157P1335n33294P553o4926M70428
$$ 687808609 687902832 688619385 688387375 688289032 688414917 688545074 688616409 688083115 688090668 688025742 688496170
2219F88496170l0518j6403J88065k0828K33764n36194K67029R9793p9727j57471m21906
$$ 688496170 688465652 688449249 688637314 688616486 688850250 688314056 688581085 688680878 688601151 688443680 688021774
2229.7F88021774Q4534k1210O54907R9564j91498j19171J04599M8218k76489J72195
$$ 688021774 688106308 688085098 688740005 688839569 688648071 688528900 688633499 688681717 688405228 688577423
2239.3F88577423m62189K71836L17535J64642j3656m21372K83890k40021l9367l17383
$$ 688577423 688115234 688387070 688704605 688869247 688855591 688434219 688718109 688478088 688438721 688121338
2248.9F88121338J78299L00674m85763L2577j11847J38932j26114J82571J92795N3787
$$ 688121338 688299637 688600311 688114548 688147125 688035278 688174210 688048096 688230667 688423462 688477249
2258.6F88477249j34201n44357L39660m9972k6093n01022M1046O01425k81448J2817
$$ 688477249 688343048 687798691 688138351 688088379 688062286 687561264 687602310 688203735 687922287 687935104
2268.2F87935104k02331P46078J50452o79779l87116k23922K54974m15573q1940j03454
$$ 687935104 687732773 688478851 688629303 687949524 687562408 687338486 687593460 687177887 687095947 686992493
2277.9F86992493L88031J40838k38113J53580l44544L18222l85284k44141Q2626j26037
$$ 686992493 687380524 687521362 687283249 687436829 687092285 687410507 687025223 686781082 686863708 686737671
2287.5F86737671k01798o48498J03683k00042K73971j97220m1122K69775p48291R6741
$$ 686737671 686535873 685887375 685991058 685791016 686064987 685867767 685826645 686096420 685348129 685444870
2297.2F85444870j61972K12097l02048n00869p0496l47977M07715k77633J9378l74145
$$ 685444870 685282898 685494995 685192947 684692078 684621582 684273605 684681320 684403687 684423065 684048920
2306.8F84048920k33689k05612r67254J89437j02081j07269n45807Q9416N3940r19800
$$ 684048920 683815231 683609619 682642365 682831802 682729721 682622452 682076645 682166061 682220001 681300201
2316.4F81300201l65524n23300M29001L08151j17187j224213l38135P66525q45108
$$ 681300201 680934677 680411377 680840378 681148529 681031342 679807129 679468994 680235519 679390411
2325.1F79390411j34124j02082K96173o74057n49392J92032k72294P17316o41708q38394
$$ 679390411 679256287 679154205 679450378 678776321 678226929 678418961 678146667 678863983 678222275 677383881
2334.8F77383881p28226Q1024q2092n83267P4920r9258J24435q40225M66843K88772
$$ 677383881 676655655 676736679 676654587 676071320 676146240 676046982 676171417 675331192 675798035 676086807
2344.4F76086807m1961n98374o20041J110077N81665N89981m61044o20956j073533
$$ 676086807 676044846 675446472 674826431 675936508 676518173 677108154 676647110 676026154 674952621
2353.1F74952621j163253J019897l42483J01242q33969k29264r71603k90604J109009
$$ 674952621 673789368 674809265 674466782 674568024 673734055 673504791 672533188 672242584 673351593
2361.8F73351593j705704j526j113967l5553J68838P8354P82928J59455J188049l44772
$$ 673351593 671645889 671644363 670530396 670494843 670663681 670742035 671524963 671684418 672872467 672527695
2371.4F72527695K08587m42505J99585O07987j017685j49307j39084M35486J04980
$$ 672527695 672736282 672293777 672493362 673101349 672083664 671934357 671795273 672230759 672335739
2380.1F72335739k95257k95258l77655k83279m47312K45438l77274N6534J84479p23267
$$ 672335739 672040482 671745224 671367569 671084290 670636978 670882416 670505142 670561676 670746155 670022888
2389.7F70022888k33688k9450r9334p90024k42233K06451k87018p79877n43746K54135
$$ 670022888 669789200 669759750 669660416 668870392 668628159 668834610 668547592 667767715 667223969 667478104
2399.4F67478104l52936k11945k61306k48490n37872o84815J40915l59421l47900m51889
$$ 667478104 667125168 666913223 666651917 666403427 665865555 665180740 665321655 664962234 664614334 664162445
2409F64162445k27966j32523j72119j28784o25458j06201n53131p29828p74841l14255
$$ 664162445 663934479 663801956 663629837 663501053 662875595 662769394 662216263 661486435 660711594 660397339
2418.7F60397339K15912o02417l60947k76108k07214m14505r5139J97754m05273n12390
$$ 660397339 660613251 660010834 659649887 659373779 659166565 658752060 658656921 658854675 658449402 657937012
2428.3F57937012n82199k83204p19757m79736j20087J78223K8000j015854m37546l38592
$$ 657937012 657354813 657071609 656351852 655872116 655752029 655930252 655958252 654942398 654504852 654166260
2438F54166260k74811q09784o90308J05515m12979j00327l82232m64096n23606k04391
$$ 654166260 653891449 653081665 652391357 652496872 652083893 651983566 651601334 651137238 650613632 650409241
2447.6F50409241k04315p85141k77482m18319j40991o23551l40500J11847p62024p64770
$$ 650409241 650204926 649419785 649142303 648723984 648582993 647959442 647618942 647730789 646968765 646203995
2457.2F46203995r15070k55050m3183j14136m47006p55997n82504q31756r8954k12097
$$ 646203995 645288925 645033875 644990692 644876556 644429550 643673553 643091049 642259293 642160339 641948242
2466.9F41948242k38800k07138o79779q63342n93872j72959p99865n77507o77948k23694
$$ 641948242 641709442 641502304 640822525 639959183 639365311 639192352 638392487 637814980 637137032 636913338
2476.5F36913338P7743n41839l91770q92219l25241m47045r37652m67492k08702j31149
$$ 636913338 636991081 636449242 636057472 635165253 634840012 634392967 633455315 632987823 632779121 632647972
2486.2F32647972m31671m32587q55522m21066n11208o05316k01530o35758m66041j026307
$$ 632647972 632216301 631783714 630928192 630507126 629995918 629390602 629189072 628553314 628087273 627060966
2495.8F27060966p00149m63333o35643k00882k41509j32103p75299o21948l82652o83441
$$ 627060966 626360817 625897484 625261841 625060959 624819450 624687347 623912048 623290100 622907448 622224007
2505.5F22224007r06639p35589k20413n71975m84009l91503l02391o99424p27806m58527
$$ 622224007 621317368 620581779 620361366 619789391 619305382 618913879 618611488 617912064 617184258 616725731
2515.1F16725731o84548k47535o17981o37093m35982l8833q4877m70200P4921l93677
$$ 616725731 616041183 615793648 615175667 614538574 614102592 614063759 613978882 613508682 613583603 613189926
2524.7F13189926n42602p23267o60934p60651r39255k85225m87671l51181l00255j34620
$$ 613189926 612647324 611924057 611263123 610502472 609563217 609277992 608790321 608439140 608138885 608004265
2534.4F08004265m92935l98484j07040q60405o06918r14307l64799j87455o69365l76167
$$ 608004265 607511330 607112846 607005806 606145401 605538483 604624176 604259377 604071922 603402557 603026390
2544F03026390n35850j09406j75247k42729p02782p41501o88438r28116m26140n31578
$$ 603026390 602490540 602381134 602205887 601963158 601260376 600518875 599830437 598902321 598476181 597944603
2553.7E97944603R3574j98097o83059o41823l75710j05896q85162m04511o32858o66809
$$ 597944603 598038177 597840080 597157021 596515198 596139488 596033592 595148430 594743919 594111061 593444252
2563.3E93444252l08495l28712j7090l13644k10533o72493m91829o73485r03511l66059
$$ 593444252 593135757 592807045 592789955 592476311 592265778 591593285 591101456 590427971 589524460 589158401
2573E89158401k65579O4812n13153j81046l01475q05397m74549l70292m61312j002082
$$ 589158401 588892822 588957634 588444481 588263435 587961960 587156563 586682014 586311722 585850410 584848328
2582.6E84848328l54767n14641m19693j84441m92859J5679n98831o31714n73311l84369
$$ 584848328 584493561 583978920 583559227 583374786 582881927 582897606 582298775 581667061 581093750 580709381
2592.2E80709381m81987q94203n50613o77720k02560j78795k22282l80822p01408p80144
$$ 580709381 580227394 579333191 578782578 578104858 577902298 577723503 577501221 577120399 576418991 575638847
2601.9E75638847p84645m95834p53059r5673j49918n45883n61981n26009j15661o00701
$$ 575638847 574854202 574358368 573605309 573509636 573359718 572813835 572251854 571725845 571610184 571009483
2611.5E71009483p73735j212425o84471n18494q61664j72767o27289m30298l53851
$$ 571009483 570235748 569023323 568338852 567820358 566958694 566785927 566158638 565728340 565374489
2620.2E65374489m67949n06592n18875l66020r65538o75583o33621o83594n27802l06511
$$ 565374489 564906540 564399948 563881073 563515053 562549515 561873932 561240311 560556717 560028915 559722404
2629.9E59722404k20909k63633l44620j012612n08346o72836q32253o48537p81173
$$ 559722404 559501495 559237862 558893242 557880630 557372284 556699448 555867195 555218658 554437485
2638.5E54437485j31150m42123o20041m91600k65732n27801p80564n71289q94432o34231
$$ 554437485 554306335 553864212 553244171 552752571 552486839 551959038 551178474 550607185 549712753 549078522
2648.2E49078522n62935n18189o72950j87149j86158o62155J0796q79746q54149q4762
$$ 549078522 548515587 547997398 547324448 547137299 546951141 546288986 546299782 545420036 544565887 544481125
2657.8E44481125l17574p37457p20520j78986m81720j80778m61998m35486j35116p32880
$$ 544481125 544163551 543426094 542705574 542526588 542044868 541864090 541402092 540966606 540831490 540098610
2667.5E40098610p19833p83349l71856n30586l86696o1875k68135p7820l88259m62609
$$ 540098610 539378777 538595428 538223572 537692986 537306290 537244415 536976280 536898460 536510201 536047592
2677.1E36047592n35164k12745n33982j161575r44977o56013j07384k22092k58751
$$ 536047592 535512428 535299683 534765701 533604126 532659149 532003136 531895752 531673660 531414909
2685.8E31414909k50892j31264n68390j014938k75994k78511o20079o85234R1896k6169
$$ 531414909 531164017 531032753 530464363 529449425 529173431 528894920 528274841 527589607 527681503 527655334
2695.4E27655334o44340l88374l94249r5597m43725m55780o23169o74515k49748o38542
$$ 527655334 527010994 526622620 526228371 526132774 525689049 525233269 524610100 523935585 523685837 523047295
2705.1E23047295m59252l11699J6861j79405k74353k70348j010475j041488q55866
$$ 523047295 522588043 522276344 522293205 522113800 521839447 521569099 520558624 519517136 518661270
2713.8E18661270j00975k2850j77994k92473m36821k01835l87192J62697m51546q71315
$$ 518661270 518560295 518537445 518359451 518066978 517630157 517428322 517041130 517203827 516752281 515880966
2723.4E15880966k60467j24016l2005l46566l9825k41394n37377o28280n55573J145
$$ 515880966 515620499 515496483 515464478 515117912 515078087 514836693 514299316 513671036 513115463 513116608
2733E13116608j34316k26402k70844k89459p73392m85076K02064j36452j19171j91612
$$ 513116608 512982292 512755890 512485046 512195587 511422195 510937119 511139183 511002731 510883560 510691948
2742.7E10691948m52843n35240K747L8833k9678N0201m99038l17574m97703l96386
$$ 510691948 510239105 509703865 509706612 509745445 509715767 509765968 509266930 508949356 508451653 508055267
2752.3E08055267k66533m81567m39682m31595k5101j57203j46866m77676l74222l0136
$$ 508055267 507788734 507307167 506867485 506435890 506410789 506253586 506106720 505629044 505254822 505224686
2762E05224686l73421k02751n55878n95512o05622l79562k61917m88014J3847l11699
$$ 505224686 504851265 504648514 504092636 503497124 502891502 502511940 502250023 501762009 501775856 501464157
2771.6E01464157l37677k77100m54063l84216n07965m28391l62167n46570q94775n59540
$$ 501464157 501126480 500849380 500395317 500011101 499503136 499074745 498712578 498166008 497271233 496711693
2781.3D96711693o92673p23648l12653k94799l20816o86760k90795k61955l42712l83301
$$ 496711693 496019020 495295372 494982719 494687920 494367104 493680344 493389549 493127594 492784882 492401581
2790.9D92401581r10607j066818j004219k95448n86624p04270l79371n80979m31480
$$ 492401581 491490974 490424156 489419937 489124489 488537865 487833595 487454224 486873245 486441765
2799.6D86441765o35643p33986j189537j116905n82085l27072l54958q92372p29065
$$ 486441765 485806122 485072136 483882599 482765694 482183609 481856537 481501579 480609207 479880142
2808.3D79880142o31866q02231j167717j016884p16133p55386n61180r31778q48961
$$ 479880142 479248276 478446045 477278328 476261444 475545311 474789925 474228745 473296967 472448006
2816.9D72448006q24089q22831p27920q66051q81576j152382j282654j432304n33600
$$ 472448006 471623917 470801086 470073166 469207115 468325539 467173157 465890503 464458199 463924599
2825.6D63924599j39771q18786j156884j255760j083259j320343q08983r14383j237908
$$ 463924599 463784828 462966042 461809158 460553398 459470139 458149796 457340813 456426430 455188522
2834.3D55188522j178054j592560r13811j011696j518516j763306j884308j736755
$$ 455188522 454010468 452417908 451504097 450492401 448973885 447210579 445326271 443589516
2842D43589516j837044j852837k362098k122460j972580k478447k716980k318268j719589
$$ 443589516 441752472 439899635 437537537 435415077 433442497 430964050 428247070 425928802 424209213
2850.7D24209213j894760j344757r41925q70323p18041m34684N5847k25258k03400
$$ 424209213 422314453 420969696 420027771 419157448 418439407 418004723 418060570 417835312 417631912
2859.4D17631912k92473l45001l71132o88209o76346q50449j240654j286239p03087
$$ 417631912 417339439 416994438 416623306 415935097 415258751 414408302 413167648 411881409 411178322
2868.1D11178322p75643j156311j159172o14318j86196p11746p67899q33435r43603
$$ 411178322 410402679 409246368 408087196 407472878 407286682 406574936 405807037 404973602 404029999
2876.7D04029999r01528p09915r81064j436157p12166o83784q83026q11043q02269
$$ 404029999 403128471 402418556 401437492 400001335 399289169 398605385 397722359 396911316 396109047
2885.4C96109047q80928j250992j264458j254501q49800j129532j252060p95784j106949
$$ 396109047 395228119 393977127 392712669 391458168 390608368 389478836 388226776 387430992 386324043
2894.1C86324043j326942j205864n88608o59752r39178r97200j115837o63529l63922
$$ 386324043 384997101 383791237 383202629 382542877 381603699 380606499 379490662 378827133 378463211
2902.8C78463211o72951j483841j273803j160431r64737j06125n49812j424256j973839
$$ 378463211 377790260 376306419 375032616 373872185 372907448 372801323 372251511 370827255 368853416
2911.4C68853416j115112p07016j569595j743851j722412j635551j721917j335029
$$ 368853416 367738304 367031288 365461693 363717842 361995430 360359879 358637962 357302933
2919.2C57302933j361084j360741o63414p90100p88307l85895N7945j26190j75323
$$ 357302933 355941849 354581108 353917694 353127594 352339287 351953392 352011337 351885147 351709824
2927.8C51709824J49345j2550J14R4032K55433N96199Q15963J30501L36380J046867
$$ 351709824 351859169 351846619 351846733 351940765 352196198 352792397 353608360 353738861 354075241 355122108
2937.5C55122108O70395Q76122O76155N38750Q06083P47948Q38051P01790Q14018Q89282
$$ 355122108 355792503 356668625 357344780 357883530 358689613 359437561 360275612 360977402 361791420 362680702
2947.1C62680702O60134N07316P35321Q82111P46612J65978l1548R10454O96640J32485
$$ 362680702 363340836 363848152 364583473 365465584 366212196 366378174 366346626 367257080 367953720 368086205
2956.8C68086205L36456P18727P19871M47159P25746N94254O28662N26390N92766J166534
$$ 368086205 368422661 369141388 369861259 370308418 371034164 371628418 372257080 372783470 373376236 374542770
2966.4C74542770J005669Q34770Q03604Q14972O71120O38618O61927P74421O51589
$$ 374542770 375548439 376383209 377186813 378001785 378672905 379311523 379973450 380747871 381399460
2975.1C81399460L22151P17278P47108N69420J04866K22359O50405J46065M4861k7542
$$ 381399460 381721611 382438889 383185997 383755417 383860283 384082642 384733047 384879112 384923973 384896431
2984.7C84896431K78435K33001O5041M34876K73475P630m4976M57764K46696k34375
$$ 384896431 385174866 385407867 385472908 385907784 386181259 386188889 386143913 386601677 386848373 386613998
2994.4C86613998m60586m45862l19176l62663K77710l66974p44781n47257n77888j81885
$$ 386613998 386153412 385707550 385388374 385025711 385303421 384936447 384191666 383644409 383066521 382884636
3004C82884636q26912q10852p87277m90761J1101o31790n24979m28352q80547j094513
$$ 382884636 382057724 381246872 380459595 379968834 379979935 379348145 378823166 378394814 377514267 376419754
3013.7C76419754m44031l16429p43141n26199p08809p58171p72858p58820q49151j132660
$$ 376419754 375975723 375659294 374916153 374389954 373681145 372922974 372150116 371391296 370542145 369409485
3023.3C69409485r17893m58755k82555q09746j201286j066971p64427r21707q87451
$$ 369409485 368491592 368032837 367750282 366940536 365739250 364672279 363907852 362986145 362098694
3032C62098694o47888p68738p34406r54666p43065o65283r66415j174050j136894p94525
$$ 362098694 361450806 360682068 359947662 358992996 358249931 357584648 356618233 355444183 354307289 353512764
3041.6C53512764j056213p76444m28886p86629j169510r40094n32226j018448j174469
$$ 353512764 352456551 351680107 351251221 350464592 349295082 348354988 347822762 346804314 345629845
3050.3C45629845q86994n54008p48978j033134r32961p81212n22575r91020j333275
$$ 345629845 344742851 344188843 343439865 342406731 341473770 340692558 340169983 339178963 337845688
3059C37845688j560822q47435k19078n83763l96652j033096j025162p76940q81958
$$ 337845688 336284866 335437431 335218353 334634590 334237938 333204842 332179680 331402740 330520782
3067.7C30520782n83152r99413j067161j129532o97937k68517m62837l27034o99844
$$ 330520782 329937630 328938217 327871056 326741524 326043587 325775070 325312233 324985199 324285355
3076.4C24285355j145058o69174j69182q72650j320153j134529o39438j19839l90644
$$ 324285355 323140297 322471123 322301941 321429291 320109138 318974609 318335171 318215332 317824688
3085C17824688r09557j090889n19524p09610p73773o69823r77173m66308o75259q42171
$$ 317824688 316915131 315824242 315304718 314595108 313821335 313151512 312174339 311708031 311032772 310190601
3094.7C10190601j192073r17035j29490p91950p57560p96013q62427o46744p85217
$$ 310190601 308998528 308081493 307952003 307160053 306402493 305606480 304744053 304097309 303312092
3103.4C03312092n97592l70369n84888j303062r89209n63564n84660o72245j106071
$$ 303312092 302714500 302344131 301759243 300456181 299466972 298903408 298318748 297646503 296540432
3112B96540432r91039m73461j98441o68888q07171q90236j133022q82626p62253n87616
$$ 296540432 295549393 295075932 294877491 294208603 293401432 292511196 291378174 290495548 289733295 289145679
3121.7B89145679p95440j035977r95845n32742m87270j144047r67140o10581n99479
$$ 289145679 288350239 287314262 286318417 285785675 285298405 284154358 283187218 282576637 281977158
3130.4B81977158r25312p42150n79471o51379n21622r84878o87351m52729r01012j082993
$$ 281977158 281051846 280309696 279730225 279078846 278557224 277572346 276884995 276432266 275531254 274448261
3140B74448261r51843p14989p65457j022034j215305n59616n17120q29945p21779o52065
$$ 274448261 273496418 272781429 272015972 270993938 269778633 269219017 268701897 267871952 267150173 266498108
3149.6B66498108l51505j029435j220321o63433n75028p48691r10530q74577r06315
$$ 266498108 266146603 265117168 263896847 263233414 262658386 261909695 260999165 260124588 259218273
3158.3B59218273o67782q24642p00245p21321q13160l53908q02346r04598p53631p67670
$$ 259218273 258550491 257725849 257025604 256304283 255491123 255137215 254334869 253430271 252676640 251908970
3168B51908970q86307q63476p21512r99259o21281l88832o07205j380596r54056J19534
$$ 251908970 251022663 250159187 249437675 248438416 247817135 247428303 246821098 245440502 244486446 244605980
3177.6B44605980p68070j074791r32255o72436l77826o68278o02284o20727o71215
$$ 244605980 243837910 242763119 241830864 241158428 240780602 240112324 239510040 238889313 238218098
3186.3B38218098p75910o55136p61661j047440q43487l06225l98712j028728o51550
$$ 238218098 237442188 236787052 236025391 234977951 234134464 233828239 233429527 232400799 231749249
3195B31749249o23017p29008o01902l88622j94759o44474n81055j137810j120166k46354
$$ 231749249 231126232 230397224 229795322 229406700 229211941 228567467 227986412 226848602 225728436 225482082
3204.6B25482082l21636o80904q15945m98619r40819p72075k22340l51620k88944q02479
$$ 225482082 225160446 224479542 223663597 223164978 222224159 221452084 221229744 220878124 220589180 219786701
3214.3B19786701n65433j6289k11697p68795r84592o48728m78172l43342n45902n02624
$$ 219786701 219221268 219204979 218993282 218224487 217239895 216591167 216112995 215769653 215223751 214721127
3223.9B14721127n48974l97281l33767j114311p48368j34849l02410n34077p08065
$$ 214721127 214172153 213774872 213441105 212326794 211578426 211443577 211141167 210607090 209899025
3232.6B09899025r91211o21567j29719o86817l58009m8637n51930o85234o69308k50854
$$ 209899025 208907814 208286247 208156528 207469711 207111702 207063065 206511135 205825901 205156593 204905739
3242.2B04905739j83277q02594r74102p4806M387m84905k92873o59466p22237m96979
$$ 204905739 204722462 203919868 202945766 202870960 202875347 202390442 202097569 201438103 200715866 200218887
3251.9B00218887o76422l11584J41563j72367n72376q21724r34544o3324K25029l10993
$$ 200218887 199542465 199230881 199372444 199200077 198627701 197805977 196871433 196808109 197033138 196722145
3261.5A96722145l75690o38638m34284k43683n95779n53303l80211J8463J0090m44431
$$ 196722145 196346455 195707817 195273533 195029850 194434071 193880768 193500557 193519020 193529110 193084679
3271.2A93084679j29986m51260j283531n46474K32257r6588m66518l11146l90072m84028
$$ 193084679 192954693 192503433 191219902 190673428 190905685 190809097 190342579 190031433 189641361 189157333
3280.8A89157333M1581R021l74603m81682n44872m45747j221J79119m49543m76913
$$ 189157333 189198914 189207935 188833332 188351650 187806778 187361031 187359810 187538929 187089386 186612473
3290.4A86612473k95964m30908n6305j96628n96867j61705j8349n77411n13363k98157
$$ 186612473 186316509 185885601 185829296 185632668 185035801 184874096 184855747 184278336 183764973 183466816
3300.1A83466816J163L92685k25048n70373k44637k84576m23680o1225J09882m85058
$$ 183466816 183467979 183860664 183635616 183065243 182820606 182536030 182112350 182051125 182161007 181675949
3309.7A81675949o11858l80268m57306n28336j27220J10016l72563o25572k67162L18127
$$ 181675949 181064091 180683823 180226517 179698181 179570961 179680977 179308414 178682842 178415680 178733807
3319.4A78733807N4836n36080m81758n50003l64513m7340j52989m37736o94828o95057
$$ 178733807 178788643 178252563 177770805 177220802 176856289 176808949 176655960 176218224 175523396 174828339
3329A74828339p27578p33223m96997j39237j36700n08079n67036m90570l40023j94492
$$ 174828339 174100761 173367538 172870541 172731304 172594604 172086525 171519489 171028919 170688896 170494404
3338.7A70494404l86295l28179p7457k37370o43539p35531n29366l63865l6449L6888
$$ 170494404 170108109 169779930 169702473 169465103 168821564 168086033 167556667 167192802 167156353 167193241
3348.3A67193241N8689J12343m07104m83361l8891M3221m18949m77276J28136L01914
$$ 167193241 167251930 167364273 166957169 166473808 166434917 166478138 166059189 165581913 165710049 166011963
3357.9A66011963K30026l13244n24864j42116M2343K60887m0779m9820j07613m01382
$$ 166011963 166241989 165928745 165403881 165261765 165304108 165564995 165524216 165474396 165366783 164965401
3367.6A64965401n4150O218k35195o16398l83244M43211N41153k05097m04606J087
$$ 164965401 164911251 164917469 164682274 164065876 163682632 164125843 164666996 164461899 164057293 164058380
3377.2A64058380j73607J37577J58120l40539j90353j94168j63002O6662M12674L01018
$$ 164058380 163884773 164022350 164180470 163839931 163649578 163455410 163292408 163359070 163771744 164072762
3386.9A64072762j12820j70784J40228M40350j14765m05331j88923m6215J52187N19200
$$ 164072762 163959942 163789158 163929386 164369736 164254971 163849640 163660717 163614502 163766689 164285889
3396.5A64285889M16832m51813j24245K60124N5218J7090l76167l18947J09386N10788
$$ 164285889 164702721 164250908 164126663 164386787 164442005 164459095 164082928 163763981 163873367 164384155
3406.2A64384155K14043j79310K30999K76909J94569K68077J02272R652K21977J1215
$$ 164384155 164598198 164418888 164649887 164926796 165121365 165389442 165491714 165501366 165723343 165734558
3415.8A65734558K95677Q03070k19249j28613P05109K00386j50738k82745J82628P26185
$$ 165734558 166030235 166833305 166614056 166485443 167190552 167390938 167240200 166957455 167140083 167866268
3425.5A67866268P05128N34515K9392J22700P26776N26257p5970O87J93119K79922
$$ 167866268 168571396 169105911 169135303 169258003 169984779 170511036 170435066 170435753 170628872 170908794
3435.1A70908794R31549P21207j87244J96304O12354N07470K02865n6610N84755M40426
$$ 170908794 171840343 172561550 172374306 172570610 173182964 173690434 173893299 173836689 174421444 174861870
3444.7A74861870L12328O70300J13773J98803O25401Q51287P12300M31556O31562Q18042
$$ 174861870 175174198 175844498 175958271 176157074 176782475 177633762 178346062 178777618 179409180 180227222
3454.4A80227222R70993L88661l7365K84405N81608O07318K75441N97400M14124J27296
$$ 180227222 181198215 181586876 181549511 181833916 182415524 183022842 183298283 183895683 184309807 184437103
3464A84437103Q26130Q37631L56656K32944N78537O15406O27403J051102R90829Q25348
$$ 184437103 185263233 186100864 186457520 186690464 187269001 187884407 188511810 189562912 190553741 191379089
3473.7A91379089O94580L29171M97455J243973J071434N14221N98831O95992R42230
$$ 191379089 192073669 192402840 192900295 194144268 195215702 195729923 196328754 197024746 197966976
3482.3A97966976O88458M29363M19388N76420J236381J122933O70146N41420O10142
$$ 197966976 198655434 199084797 199504185 200080605 201316986 202439919 203110065 203651485 204261627
3491B04261627R26190Q03260N62382R24759J174221N92613L41359N68332J082344J467190
$$ 204261627 205187817 205991077 206553459 207478218 208652439 209245052 209586411 210154743 211237087 212704277
3500.7B12704277R99546P30991P85161N74779M31576Q53405J302280J287995Q85696
$$ 212704277 213703823 214434814 215219975 215794754 216226330 217079735 218382015 219670010 220555706
3509.4B20555706P63073J024742O35166R72290J217537Q27561J113357J108189R37557
$$ 220555706 221318779 222343521 222978687 223950977 225168514 225996075 227109432 228217621 229155178
3518B29155178J108933J189251Q93440J384105J318245J17665P20939J476193J307316
$$ 229155178 230264111 231453362 232346802 233730907 235049152 235166817 235887756 237363949 238671265
3526.7B38671265L04584J029720J775570O29368J098385J640358J384106J095123J782532
$$ 238671265 238975849 240005569 241781139 242410507 243508892 245149250 246533356 247628479 249411011
3535.4B49411011J568813K91691J331043J488972J013870J042347J597805J487732
$$ 249411011 250979824 251271515 252602558 254091530 255105400 256147747 257745552 259233284
3543.1B59233284J098366J348991Q96397J688385J438904K028694J920223J386967
$$ 259233284 260331650 261680641 262577038 264265423 265704327 267733021 269653244 271040211
3550.8B71040211K251396L97549J263847J924820J552887J733227J131172J924248
$$ 271040211 273291607 273689156 274953003 276877823 278430710 280163937 281295109 283219357
3558.5B83219357J461448J612416J203708J735764J933460J441460M006691J559982
$$ 283219357 284680805 286293221 287496929 289232693 291166153 292607613 296614304 298174286
3566.2B98174286L78456J421719J108703L105641J653709J698380K064361J867199
$$ 298174286 298552742 299974461 301083164 304188805 305842514 307540894 309605255 311472454
3574C11472454J015568J531143L086948J630040K262039K088547J610832K323913K438698
$$ 311472454 312488022 314019165 317106113 318736153 320998192 323086739 324697571 327021484 329460182
3582.6C29460182K273102J691055L315010J045418l41682K596016J375999L362885
$$ 329460182 331733284 333424339 336739349 337784767 337443085 340039101 341415100 344777985
3590.4C44777985L155021K759629K153892J930580L630295J109963J768188K786751
$$ 344777985 347933006 350692635 352846527 354777107 358407402 359517365 361285553 364072304
3598.1C64072304J967201L286896K240371K167893K701263J847992K426567L586121
$$ 364072304 366039505 369326401 371566772 373734665 376435928 378283920 380710487 384296608
3605.8C84296608K752609j16501L616715K661247J039124N956955K216949N80330M033508
$$ 384296608 387049217 386932716 390549431 393210678 394249802 400206757 402423706 403004036 407037544
3614.5D07037544L71971L923645M096756J738854K862892Q42895K903061M153786L589859
$$ 407037544 407409515 411333160 415429916 417168770 420031662 420874557 423777618 427931404 431521263
3623.1D31521263K897606K997742L000450L298836O589851K208595o497879M132233
$$ 431521263 434418869 437416611 440417061 443715897 450305748 452514343 446016464 450148697
3630.9D50148697N602951N455093K813187J324539L931999L922539K747688J841393
$$ 450148697 455751648 461206741 464019928 465344467 469276466 473199005 475946693 477788086
3638.6D77788086L113823L923645L248443K065201K003708L758354M226685M829178
$$ 477788086 480901909 484825554 488073997 490139198 492142906 495901260 500127945 504957123
3646.3E04957123m74777j441346P513428L275719j414032J354484O562424N495377
$$ 504957123 504482346 503041000 510554428 513830147 512416115 513770599 520333023 525828400
3654E25828400M098205N568772m495011K117729N388489K279663L345146J694069K663460
$$ 525828400 529926605 535495377 531000366 533118095 538506584 540786247 544131393 545825462 548488922
3662.7E48488922J978569K281647K817421J278953M247590K036018O16608J281509
$$ 548488922 550467491 552749138 555566559 556845512 561093102 563129120 563745728 565027237
3670.4E65027237m020920M244805Q074188Q785820j385727j4947052M846916P622948
$$ 565027237 561006317 565251122 573325310 582111130 580725403 565778351 570625267 578248215
3678.1E78248215M191704r79805K231445L034935J623001J593666J086540J233216
$$ 578248215 582439919 581460114 583691559 586726494 588349495 589943161 591029701 592262917
3685.8E92262917L553619N739288p825393k578316P899513n311966K51846N792389
$$ 592262917 595816536 601555824 593730431 591152115 599051628 593739662 593991508 599783897
3693.5E99783897J217919J652298J100006R9678J391830P46880K428131K894325m719925
$$ 599783897 601001816 602654114 603754120 603853798 605245628 605992508 608420639 611314964 606595039
3702.2F06595039j160965N261536K617645P16515k2736K244721L253555n893135M557762
$$ 606595039 605434074 610695610 613313255 614029770 614007034 616251755 619505310 613612175 618169937
3710.9F18169937N229302j2167511L064575M384384M53834P64275K472496K119064
$$ 618169937 623399239 611231728 614296303 618680687 619134521 619898796 622371292 624490356
3718.6F24490356k412109J006546N429115l112945l990669M390564R10987n12275k463036
$$ 624490356 622078247 623084793 628513908 625400963 621410294 625800858 626711845 626199570 623736534
3727.3F23736534M51279L520012J250992N840301k885284p188301Q817863k39563r438133
$$ 623736534 624187813 627707825 628958817 634799118 631913834 624725533 633543396 633303833 623865700
3736F23865700J600876L816185R68170J536064L309212k458115K506332J0676041j1956558
$$ 623865700 625466576 629282761 630250931 631786995 635096207 632638092 635144424 645820465 633863907
3744.7F33863907j4550324J1327858N826149N761566k775039j0240402R908943o061821
$$ 633863907 619313583 630641441 636467590 642229156 639454117 629213715 639122658 633060837
3752.4F33060837o187973O583481M683990L452149m399186K006569M181710p338715
$$ 633060837 626872864 633456345 638140335 641592484 637193298 639199867 643381577 636042862
3760.1F36042862o23856L877449J313820L41187L158264k622833m094849M027634N047073
$$ 636042862 635419006 639296455 640610275 640951462 644109726 641486893 637392044 641419678 646466751
3768.8F46466751j06048q863297K002716L163529R7351J039733j31454J315002M1504
$$ 646466751 646360703 637497406 639500122 642663651 642761002 643800735 643669281 644984283 645025787
3777.4F45025787J597672k14234o107788K857285J545334Q45947K179489k899627r13697
$$ 645025787 646623459 646409225 640301437 643158722 644704056 645550003 647729492 644829865 643916168
3786.1F43916168J674500J099930J31683k0905O81305O1035J26496m66309J345673
$$ 643916168 645590668 646690598 646822281 646801376 647482681 647543716 647670212 647203903 648549576
3794.8F48549576K903518m203796l826752K454605L947144N616837m998093r902496
$$ 648549576 651453094 647249298 643422546 645877151 649824295 655441132 650443039 640540543
3802.5F40540543L015976K637100M489898M514084q762893k960892M326858J502152
$$ 640540543 643556519 646193619 650683517 655197601 646434708 643473816 647800674 649302826
3810.2F49302826o561N61294L13645J033096M594116k323456j1619491N551758N204925
$$ 649302826 649296265 649857559 650171204 651204300 655798416 653474960 641855469 647407227 652612152
3818.9F52612152L117905j20239j5973740L127060N896530J771469J908798j75857
$$ 652612152 655730057 655609818 639636078 642763138 648659668 650431137 652339935 652164078
3826.6F52164078l478623l3874J901474L175812J053924p446518K658615O434098n839463
$$ 652164078 648685455 648651581 650553055 653728867 654782791 647336273 649994888 656428986 650589523
3835.3F50589523l19671P126770q185044l180084P169571m155655j10092N607529k564545
$$ 650589523 650269852 657396622 649211578 646031494 653201065 649045410 648935318 654542847 651978302
3844F51978302k715912K548218R48181r689J440124k56347J728286L448716n752640
$$ 651978302 649262390 651810608 652758789 652749100 654189224 653932877 655661163 659109879 653357239
3852.7F53357239J469497j2250747J416244R354401j023636j570587J542740J603775
$$ 653357239 654826736 642575989 643992233 653346634 652322998 650752411 652295151 653898926
3860.4F53898926L125229m084778q82569N451127m574814n034867L107148M207534
$$ 653898926 657024155 652939377 652056808 657507935 652933121 647898254 651005402 655212936
3868.1F55212936M056321p921296n856857L959885M890747K450561r408798J458283
$$ 655212936 659269257 651347961 645491104 649450989 654341736 656792297 647383499 648841782
3875.8F48841782M745864j72348J717682L678055m426651o444855M815445R61991R09195
$$ 648841782 653587646 653415298 655132980 658811035 654384384 647939529 652754974 653716965 654626160
3884.5F54626160M148330j1423111J474457M209366M85153K927094k130280o519623
$$ 654626160 658774490 647351379 648825836 653035202 653520355 656447449 654317169 647797546
3892.2F47797546J999817L506165q57620O25228L92762J306076J603088p609558M566803
$$ 647797546 649797363 653303528 652445908 653071136 653463898 654769974 656373062 648763504 653330307
3900.9F53330307K225494n081329K592087l389130m67453Q70285P12052J862030l86124
$$ 653330307 655555801 650474472 653066559 649677429 649209976 650080261 650792313 652654343 652268219
3909.6F52268219K57797L44086L11813j3962p58667O11496J989594l167648l514023
$$ 652268219 652526016 652870102 653181915 653167953 652409286 653020782 655010376 651842728 648328705
3918.2F48328705M020996J7242k921219K537003J563263L32489j273346k228546N35507
$$ 648328705 652349701 652366943 649445724 651982727 653545990 653878479 652605133 650376587 650912094
3926.9F50912094R25903R04313p40509n82352J583786k073059j185913J883621o3095
$$ 650912094 651837997 652742310 652001801 651419449 653003235 650930176 649744263 651627884 651564789
3935.6F51564789n15900m21142j94855R24835R61380J253510k27738l901520o68182
$$ 651564789 651048889 650627747 650432892 651357727 652319107 653572617 653344879 649443359 648775177
3944.3F48775177J655731R36814P73620j557312O58569Q37784j805191R73664k23160
$$ 648775177 650430908 651367722 652141342 650584030 651242599 652080383 650275192 651248856 651025696
3953F51025696o73599M24118J68991J40609o66809P11060J32370j09482K16904j310272
$$ 651025696 650352097 650776215 650945206 651085815 650419006 651130066 651262436 651152954 651369858 650059586
3962.6F50059586k2126J157532J8997n99746O31637M05655o60934r72367k60162L26919
$$ 650059586 650037460 651194992 651213989 650614243 651245880 651651535 650990601 650018234 649758072 650084991
3972.2F50084991j62124M06799Q2932M58831M17252j32599K94647o56662m38919k7923
$$ 650084991 649922867 650329666 650412598 650871429 651288681 651156082 651450729 650794067 650355148 650327225
3981.9F50327225j55258k86179J54571M19007m5853J43738j44730K79236j97220l50570
$$ 650327225 650171967 649885788 650040359 650459366 650413513 650557251 650412521 650691757 650494537 650143967
3991.5F50143967K92282N39856M35409p49359J56021r1858j92718K60620k15454
$$ 650143967 650436249 650976105 651411514 650662155 650818176 650726318 650533600 650794220 650578766
4000.2F50578766
$$ 650578766
##END=$$ End of the data block
