##TITLE=$$ Begin of the data block
##JCAMP-DX=5.00 $$ ACD/SpecManager v 10.08
##SPECTROMETER/DATA SYSTEM=Varian
##DATE=14 Jan 2013 09:38:40
##DATA TYPE=INFRARED SPECTRUM
##DATA CLASS=XYDATA
##ORIGIN=
##OWNER=
##NPOINTS=3735
##FIRSTX=399.26403809
##LASTX=4000.35498047
##MAXX=4000.35498047
##MINX=399.26403809
##MAXY=73.26628876
##MINY=25.03363609
##XFACTOR=1.0000000000
##YFACTOR=0.000000100000000
##FIRSTY=43.28034592
##DELTAX=0.96440572
##XUNITS=1/CM
##YUNITS=TRANSMITTANCE
##XYDATA=(X++(Y..Y))
399.3 432803459 445556602 440834007 427771111 425146637 432556877 432182655 439494400 444332733
407 444332733 434745789 429257431 426370850 425450401 422278671 422983665 435435677 438540115 434342308
415.7 434342308 432772636 427563248 429749260 431717491 424205360 425481567 428404160 430261078
423.4 430261078 428626213 431321106 431873245 429912796 432663155 428781128 423146362 424109955 425445099
432.1 425445099 425624275 427131271 427066460 427211533 429964142 430312042 430428734 429605408 431512451
440.7 431512451 433907242 429009705 423547783 422190323 426524467 426908607 425486374 425780754 422766609
449.4 422766609 425313988 430626297 431257172 427104607 425760269 426917076 425172958 420445442 416944923
458.1 416944923 421883087 424026031 427366409 428224297 425127487 425225906 424164314 425267105 425188942
466.8 425188942 422758446 422466850 422399101 423042984 421308174 416153297 415377235 418610992 418206673
475.5 418206673 418195801 418294830 415113983 415166893 413581467 413572884 418008194 420151520 417376556 414099884
485.1 414099884 416620712 419217186 416633568 414053535 416014786 415401230 413073921 415983353 419194450
493.8 419194450 418652458 414316559 413580818 414469948 412089424 410495605 412196655 415342560 416055336
502.5 416055336 416573677 415085793 414262352 414731560 411013374 409912720 410482254 412011909 413509216
511.1 413509216 412548332 411321526 409612122 408981934 408838615 408390045 407943001 407444267 407465935 407715988
520.8 407715988 406801643 404170799 402739258 405209885 408938675 408614426 407431526 405270500 402226372
529.5 402226372 402150421 403216400 404390602 404482765 404111290 404304543 405301743 404837456 402916565 402498131
539.1 402498131 402201614 403704033 403058777 400749397 401535759 401033897 400330124 399332848 398376808
547.8 398376808 398907433 399454994 399057465 397201538 397440910 398835487 398773499 397727509 397150650
556.5 397150650 396795998 395639038 395130081 394601364 394129333 394543495 395635719 396026039 395767288
565.1 395767288 394521370 392667160 393299065 394541893 396026306 396101456 394105988 394187546 395786476
573.8 395786476 396906128 396223373 394590149 394347801 394442406 394519691 395188065 395811310 396734505 397144432
583.5 397144432 396368141 396499977 395501328 394227409 394398537 394553947 395561867 396314125 396985703
592.1 396985703 397818069 398032761 397184029 396631660 397706604 398394127 398264656 397684593 397985687 398060913
601.8 398060913 398316040 399591103 398824883 397465668 396825562 396253586 394537468 394117203 395765381
610.5 395765381 394964447 394011040 393578644 392692795 392398376 392758026 393187485 392869606 392676926 392065544
620.1 392065544 391985130 392979393 394348221 394737701 394999733 396001396 395541115 395842476 396737328 397895355
629.8 397895355 399259491 400003624 401693916 403783646 406408119 407197075 406692162 407546921 407608185
638.4 407608185 407083893 407319717 408720055 410806084 412963600 414197083 415576477 417160568 417328644
647.1 417328644 417540207 417543335 417939606 419889030 422157745 423025627 422692757 423484116 423898697 422730370
656.8 422730370 422167625 423341064 423718452 422299042 422407150 422302971 421467514 422120476 422731552
665.4 422731552 422761002 420357742 414525986 418672142 421309586 423552589 425665398 426480217 427544289
674.1 427544289 428507805 428243713 428059235 428212624 429377899 430872841 431865005 432623940 432419472
682.8 432419472 433090897 435715370 438244438 439588966 440055504 439450951 438234787 438219757 439750252
691.5 439750252 441833305 442919617 443523712 444405441 444373589 444142838 444143486 444463120 445205078 445839806
701.1 445839806 447186432 448334846 448458328 449218483 450761604 451464233 451573143 452242012 452780151
709.8 452780151 453723259 455147400 456081696 457109108 457654877 457498589 457198524 457909164 459674644
718.5 459674644 460426979 460595055 460815125 461490326 463577194 465579910 465810585 465293159 465574112
727.2 465574112 466154709 467160072 467927322 467765236 469019165 471426888 473387032 474636993 474871979
735.8 474871979 474962196 475659409 476242218 475597725 475497742 477021027 477384911 477539597 479009857 480055237
745.5 480055237 480736427 481708984 482540169 482921791 483474617 484219131 485237350 486502457 487310982
754.2 487310982 488486977 489964066 491337204 491740837 491472244 492285652 493369827 494530602 495642662
762.8 495642662 497114906 498757668 499416962 499296112 499262009 499943619 499323959 499314384 500142746 499792900
772.5 499792900 500208931 500758972 501453133 501896553 502467117 502565155 501665955 501999359 502098083 502533569
782.1 502533569 503184204 503692436 504799881 505890274 506485863 506228828 506903839 507052612 507252350
790.8 507252350 508175430 509123459 510798912 510804558 510230598 509533005 508749084 507719345 505810204 504408684
800.5 504408684 503962135 504800491 504905052 504439735 503092194 501211014 500119934 498050003 496153946
809.1 496153946 494589767 492997017 491313629 490291061 490422974 489878769 488632965 487006531 485739822
817.8 485739822 484894447 484490242 484584846 485485077 487295914 488920860 490542755 491332054 492780533
826.5 492780533 495379105 497496681 499403725 500626068 502790909 505832596 509110909 512558632
834.2 512558632 515270042 517548294 519312744 520697250 522084923 524008255 524574776 525191154 527369385
842.9 527369385 529621239 531745186 533146095 535180702 536470757 537320175 538307419 538595695 539632950
851.6 539632950 541277390 543867226 545321770 546426430 547745399 548830566 550937119 552651291
859.3 552651291 554173012 554706345 555840302 557170563 557843704 559448357 560505447 560758553 560005608
868 560005608 559785881 558682785 556616364 555935059 555210381 554570732 554205017 553778114 553270264 553505211
877.6 553505211 553285789 552003822 550493355 549509048 549495888 548548965 548526878 548951530 548591957 547771950
887.3 547771950 545614166 543709450 542145958 541533852 541368027 540625610 540028687 540395241 540795975
895.9 540795975 540058479 539081879 537649269 536697617 535081291 533447266 533033257 532828865 534129448
904.6 534129448 535705681 537530556 538816757 539506302 540331116 540467758 541270752 541230736 541184273 541662827
914.3 541662827 541742477 541410713 540024529 538654633 536693764 534007301 531042633 528807030 527503433
922.9 527503433 526520462 524998169 522532845 520538330 518725700 516709747 513325005 509724426 507583313
931.6 507583313 506597977 506142883 504621162 503541679 502910919 502092323 501352882 499930954 497778778
940.3 497778778 495040932 493579407 492710075 491135864 490046806 489654541 489066734 488575134 488237495
949 488237495 486900253 485357399 483768921 482537575 481382713 479697571 478528557 477614365 476613541
957.7 476613541 474373856 471651344 468742790 465632057 463773994 461506233 459119225 458037109
965.4 458037109 457591934 457146721 456345825 454612007 452220726 449858437 447129555 444972992 443270607
974.1 443270607 441038971 438450546 436411552 434964333 432339821 429038963 425648918 421575546
981.8 421575546 417505455 414061241 410911865 407549896 403908272 400376053 396807594 393018570
989.5 393018570 389026985 385055962 382002945 378864708 375426102 372416191 370340729 368144684
997.2 368144684 365132294 363550682 361839638 359416008 356273193 352929192 350870476 348692741
1004.9 348692741 347053452 345206947 343570290 341893768 339823990 338695488 336896057 334886894
1012.6 334886894 332939835 331280022 329726257 328346062 326909447 325118141 323886414 321372681
1020.3 321372681 318753319 317069149 315517654 313388500 311620674 310988121 309180984 307477226
1028.1 307477226 306575203 305791893 304863548 304574203 303796806 302527714 302872944 303047771 304083767
1036.7 304083767 305483131 307380371 309265327 310444565 312396431 313270473 314645824 316001225
1044.5 316001225 316331863 316470203 317072105 317590275 316286125 315650234 315323868 314388657 312747650
1053.1 312747650 311769772 311703072 310819187 310455189 309940739 310196476 310391560 310711536 311503677 312365589
1062.8 312365589 314620533 316331387 318199406 319798164 321235466 322328453 323600540 325475006
1070.5 325475006 325551834 325593147 325383301 325966530 327154465 327452164 328018570 328512497 329322090 329881172
1080.1 329881172 330307236 330309601 330686760 331074409 331717873 332920303 333161812 334660645 335891457
1088.8 335891457 337356224 338939781 339717369 340577354 340432281 342147141 343813972 344248695 344999352
1097.5 344999352 345707169 346442223 346718483 347602806 348154564 348657646 349306068 349865952 350535011 351267853
1107.1 351267853 352099876 351842537 352253685 352702866 352881851 353747864 354774742 355990448 356559410
1115.8 356559410 357054901 357539253 358592873 359174614 359509087 360337906 359903450 359924889 360056076 360120583
1125.5 360120583 361244125 362700005 363772430 364605560 365867691 367141304 368752327 370357933
1133.2 370357933 372009964 373333130 374917564 377089958 378722649 380852432 382577515 383834648
1140.9 383834648 385004196 385758781 386337852 386537476 386987152 387487411 388219681 388842468 389340439
1149.6 389340439 389788437 389677925 389788818 389428329 388931580 389266243 389455643 388847618 388258514 387990112
1159.2 387990112 387782402 387860184 387276955 386715508 387086372 388288040 389653625 390841789 393110466
1167.9 393110466 395783997 398869781 402156181 404690475 406864204 409448128 412416649 415717163
1175.6 415717163 419080391 421967239 425362244 428823738 432036133 435041618 437722473 439915314
1183.3 439915314 441344643 442984352 445218849 447434807 448933868 450517921 451935692 452691574
1191 452691574 453133316 453241425 453035622 452491302 451813164 450553894 449762306 449203453 448300858 447606010
1200.7 447606010 446614075 445751686 444126740 442261200 441417885 440505142 439490585 438769455 438653984
1209.4 438653984 438561516 438215332 438312683 438346291 437926865 437145882 436216850 435378723 435194321 435273705
1219 435273705 434981346 434991226 435137405 434887543 434260521 433655472 432967110 432234840 431545143 430792732
1228.6 430792732 430715942 430501213 430032845 429832077 429358215 429037628 428487282 428042412 428034668 428073959
1238.3 428073959 428162384 427998848 427997093 427762947 427447777 427242279 426868248 426726341 426289368 425819206
1247.9 425819206 425524864 425279655 425014496 424531212 424404602 424263077 423732491 423349915 423268738 422998047
1257.6 422998047 422784729 422850609 423013229 423363609 423427391 423782654 424358368 424692421 425229416 425737419
1267.2 425737419 426605148 427756996 428442650 428948288 429917412 431569672 432778969 433041649 433601570
1275.9 433601570 434545937 435701332 436991310 438139687 439074936 439834290 441298027 442833824 443865509
1284.6 443865509 444817429 446087456 447510834 448354836 449392509 450720863 451989365 452898674 453583946
1293.3 453583946 454130402 454482117 454808426 455012169 455534630 455746040 456352997 457240601 457577782 457522240
1302.9 457522240 456975632 457030449 456707230 456145744 455786781 455253448 454799728 454218178 454127197 453608589
1312.5 453608589 452805176 451996078 451218719 450716972 449913292 450132980 450746346 451320000 452455101
1321.2 452455101 453341522 453834381 454268494 454751282 454855118 455223465 455411491 455216141 455067215 454749451
1330.9 454749451 454621239 454406548 454166222 453454132 452406349 451934433 452008934 452101097 452217903 452851524
1340.5 452851524 453433876 454463463 455588760 455811081 455625229 455760689 456669960 457371140 457600441
1349.2 457600441 457891731 458329277 458101616 457578888 457294731 456651230 456293488 455912895 455603981 455025864
1358.8 455025864 454578133 454332504 453906708 454164238 453530273 453493690 453404350 452569351 452147369 451202660
1368.5 451202660 450691032 450477638 450268898 450280685 450124092 449531403 449115829 449556770 449728088 449926109
1378.1 449926109 449992828 450302124 450566864 450374336 449957695 448786469 447822189 446774139 445969200
1386.8 445969200 444415474 443481331 443436356 442373047 441514397 440298653 439097939 436907387 433728333
1395.5 433728333 432909737 431794968 429990158 427228661 425959129 425313606 423777733 422002296 420084648
1404.2 420084648 417763405 415468254 414112015 412433548 410538139 408893013 407091331 406044159
1411.9 406044159 404825897 403626938 402449799 400960083 399468727 397680702 397302017 395917778
1419.6 395917778 394949837 395420036 395469284 395797234 395315781 395597801 396205292 396140480 396100464 395732727
1429.2 395732727 396216660 396954384 398475189 399990387 401195946 402610626 403193665 403673096 405101662
1437.9 405101662 407685852 409187813 410268478 411891289 413312187 415436325 416850166 418324356
1445.6 418324356 419321899 420767784 422328949 423511887 425423698 426424217 428330269 429753494
1453.3 429753494 431243668 432925453 434070930 435355682 435706711 439658966 441362114 443342667
1461.1 443342667 445005722 446414642 448872032 449931030 452584229 454887276 457486000 460019455
1468.8 460019455 462489243 465196877 466699829 469742737 472183342 475553741 478565254 480731010
1476.5 480731010 483408585 485449867 487335167 488798103 490502357 492437744 493597336 494635162
1484.2 494635162 495172958 495796585 495502815 494382401 495069618 494382439 494409294 494696045 494254341 493481255
1493.8 493481255 492630272 491297302 486775970 486921692 485663795 483543854 483433189 482511673 481827583
1502.5 481827583 480807533 480747032 479439278 474590530 472280159 473041115 474438591 473849640 474567986
1511.2 474567986 473809891 472915649 472828789 472206230 471915054 469250069 468320694 469144402 469766235 467461548
1520.8 467461548 465914383 467734604 468332329 469568481 468498764 468133202 467735786 467190247 466998711
1529.5 466998711 466673355 466787682 465784149 465459175 465041237 466240845 466763802 466396103 466514091
1538.2 466514091 462365532 462969055 463209305 463526649 462793198 463720245 465397797 464415283 465484772
1546.9 465484772 465281715 465555267 465096359 463768997 464324799 464288025 465200996 463061295 463378525
1555.6 463378525 464501190 464634552 460890884 453386650 458553391 458387184 459342880 458607597 457787514
1564.2 457787514 456081352 454271011 453598976 451363144 450787582 444200592 442304268 441252251 438747368
1572.9 438747368 436565361 433441925 432223587 422884445 421728210 419587555 416327591 413425140
1580.6 413425140 408858261 406116447 401525459 398550949 394643707 391259155 387561035 382956734
1588.4 382956734 380234718 375704155 373544693 368972206 366064949 362861290 358414116 356191902
1596.1 356191902 352300682 350815239 347184715 345203209 342346039 339757652 338338127 334963760
1603.8 334963760 333961487 330671272 329376144 326428642 324918556 323906059 321382446 321427994 318689594
1612.5 318689594 318488159 316661625 316458340 316320610 311740551 312655830 310991879 311888294 310244160
1621.1 310244160 310348072 309793510 308421898 309658604 308498974 310187645 309021015 309768429 309892387
1629.8 309892387 310131741 310728912 310025558 311868801 311580410 313607769 311365490 313078403 314519348
1638.5 314519348 315038242 316917515 316620369 319045639 319630375 321501122 322560310 321070137 323654289
1647.2 323654289 323639870 327936783 328903046 331913757 334314651 334801369 336886406 335354118 339236145
1655.9 339236145 340487366 343343277 345214653 347373390 349359856 350827942 354327164 355320320
1663.6 355320320 359244461 361604195 364687729 367574806 369377670 371956024 373258896 378102264
1671.3 378102264 380511436 384363861 387867241 390886307 394406509 397452431 401704597 403875504
1679 403875504 407687492 410837517 414739647 418800278 419868240 426309242 428517838 434569740 439069633
1687.7 439069633 443043823 447168083 450793076 455329399 459137764 463883095 468254623 472695580
1695.4 472695580 474942894 480082359 485562859 489568748 492221031 493628807 501196899 506552887
1703.1 506552887 510842819 514395485 517556305 521364594 524973145 529202843 532036209 534584579
1710.8 534584579 537698555 540658302 543660393 544993591 546634674 549906693 552259483 550723801
1718.5 550723801 554431915 558180771 560447922 562553062 563794174 565126343 567461090 569595947
1726.3 569595947 571179276 572627068 574320831 574926071 575978355 579043655 581918182 580778008
1734 580778008 579077034 583862381 587825546 589709473 592164955 593484573 593367958 596888733 599463234
1742.7 599463234 600428123 602723999 606143723 608796120 610869980 613234024 615382309 619962234
1750.4 619962234 621875954 623196716 627820244 631037712 634310760 637240791 637983742 640143738
1758.1 640143738 642905121 645365295 648190689 648283310 649201431 652351913 654392014 656441193 658560333
1766.8 658560333 660150223 659071350 660796814 663537292 662941895 662745056 663469543 667675171 670391693
1775.4 670391693 670459137 672269287 673069229 674334488 674624329 674313202 675988159 678101196 679563980
1784.1 679563980 679182510 679850159 681528320 683063278 684007874 685193558 685400848 685412827 684685516
1792.8 684685516 684822845 688381119 689466324 689510956 690980301 692428360 692648392 691443558 693270645
1801.5 693270645 693948059 694821548 696418686 697304382 698477020 699239044 699994736 700407715 701318741
1810.2 701318741 700657349 700798264 701907501 702563324 704136200 704629898 705544434 705713043 706316299
1818.8 706316299 707455215 707232971 707895203 707737427 708272705 709085083 708331375 708907394 710462189
1827.5 710462189 712000961 711728745 709884262 710623016 712360306 712792816 713336563 713919907 714368744
1836.2 714368744 714854279 714811096 715826645 715910797 716387405 716513214 717057037 717561646 713934021 716371460
1845.8 716371460 718686371 719325562 719288254 719306564 720002823 719993286 720557022 720360565 720844574 721396866
1855.5 721396866 721401291 721738434 721852798 722814026 722984390 723385086 722943115 722523727 722964859 723011093
1865.1 723011093 723550262 723467178 724414673 723689041 723170319 724771118 725327530 725701370 725550995 725602493
1874.8 725602493 725532455 726338501 727127228 727140732 727186279 727044678 727419434 726803818 726799316 726924896
1884.4 726924896 727106018 727766647 727917557 729099197 728947830 727890396 728428116 729126511 728853760
1893.1 728853760 728832779 729177094 728483200 729299698 730093002 730375824 730295792 730008621 730095978 729909897
1902.7 729909897 730217590 729919968 730080643 730252533 730270157 730740280 730937653 731125412 731076889 731729355
1912.4 731729355 731108322 730806808 731087189 731215744 732427902 731187744 730660172 731595535 732153778
1921.1 732153778 732139359 731250458 731306915 731505661 731850510 731965103 732215652 732119141 732114563 732449493
1930.7 732449493 732370987 732662888 732096329 731735001 731534958 731471634 731515884 731631393 732201385 731849365
1940.3 731849365 732378235 731861420 730680161 731429825 731395645 730977631 730872574 731381531 731641617 731886368
1950 731886368 731858444 731643753 731709671 731555939 731480484 730850067 730969620 731099854 730968323 731015015 731013565
1960.6 731013565 731534042 731140137 730801849 730563889 730375748 730332642 730172119 730302353 730128632 730410843
1970.2 730410843 730665512 731118240 731058731 730728149 730688858 730188599 730081711 729836578 729894638 729685440
1979.9 729685440 729778137 730065384 729697952 729684219 729129486 729033585 729069824 729195709 729076385 728532257
1989.5 728532257 728792648 728724060 728649826 728451691 728758545 728724670 728373337 728421402 727904739 727915421
1999.2 727915421 727810135 727860870 727599182 727483292 727673035 727199020 727194748 726719589 726796494 726830063
2008.8 726830063 726526260 726566010 726134720 726070099 725996933 726127853 725957336 725532074 724973373 724712830
2018.5 724712830 724945602 724936981 724978638 724345016 724483871 724482269 723906174 723704910 723212585 723299561 723144073
2029.1 723144073 722948685 722535477 722534103 722825394 722616348 722375641 721478195 721488037 721497955 721328506 721144867
2039.7 721144867 720735931 720868683 720634079 720831833 720594559 720291290 719988708 719615631 719653473 719296036
2049.3 719296036 719479065 719604797 719952698 719989319 719831772 719674988 718994141 718726273 718287048 718407745
2059 718407745 718384094 718455505 718317490 718045044 718440781 717838287 717849960 717762299 717582626 717388458 716805038
2069.6 716805038 716972427 716975708 717317810 717066956 717083969 717295227 716868286 716446075 715634918 715731583
2079.2 715731583 716076660 716484833 716326599 716142426 716377487 715937347 715921936 715715179 715424728 714872513
2088.9 714872513 714739227 714827652 714501724 714649963 714418945 714483261 714192429 713946991 714002991 713829880
2098.5 713829880 713790054 713537064 713628845 713094101 712876358 713010483 713011093 713014526 712679672 712852173 712475891
2109.1 712475891 712216187 711891937 711547012 711822968 712074509 712066879 711665344 711966095 711498489 710900497
2118.7 710900497 710872879 710712280 710675049 710286407 710635376 710690155 710663834 710586319 710227966 710241928 710030670
2129.4 710030670 710244675 709845352 709379196 709256287 709393387 709897461 709946823 709838791 709548950 709739075
2139 709739075 709475021 709426193 709761047 709418869 709132462 708880157 709332047 709497986 709517059 709432602
2148.6 709432602 709263916 709380569 709101257 709493408 709619217 709526062 709424591 709526672 709672089 709211884
2158.3 709211884 709375687 709215622 709070892 709144135 709430542 709663239 709456558 709649582 709764938 710078964
2167.9 710078964 709569626 709085236 709124985 709027786 709312592 709485168 710137711 710207062 710044785 710148163
2177.6 710148163 710205154 710327530 710003128 709813614 709444733 709807739 710293655 710254822 710235062 710499802
2187.2 710499802 711092453 710760193 710545654 710267029 710359039 710890884 710826263 710956421 711261520 711761627
2196.9 711761627 711653824 711480942 711031647 710986176 711586685 711443710 711764450 711528091 711403885 711724701
2206.5 711724701 711884155 712053223 711759033 711899414 711818314 711994476 712049408 712050171 712121048 711807861 712151413
2217.1 712151413 711952820 711704483 711622467 711877823 712378387 712472839 712874298 712983017 712873611 712299576
2226.8 712299576 712032318 712153091 712404175 712676697 712502594 712829971 712767563 712680283 712417450 712168732
2236.4 712168732 712491379 712582626 712690506 712361145 712536240 712673416 712798691 713106308 712623215 712425232
2246 712425232 712318573 712393799 712464142 712606583 712890167 713067322 712988663 712666321 712774124 712406158
2255.7 712406158 712263107 712327576 712339630 712498093 712569809 712960968 712832565 712688599 712557602 712758331
2265.3 712758331 712857666 712643738 712755432 712347260 712425232 712387161 712361145 712517776 712359543 712599792
2275 712599792 712896957 713053818 712661285 712500153 712226868 712431259 712931442 712789612 712810745 712324677
2284.6 712324677 712273636 711947784 711989212 712355881 711726608 711381454 710996628 711562958 711582794 711329117
2294.3 711329117 711269379 710541687 710624084 710424500 710653610 710605164 710617142 710855560 710536880 710582733
2303.9 710582733 709595795 709331207 709533844 709247894 708834534 708295746 708073807 707731934 707992706 707285995
2313.5 707285995 707020035 707262497 706913605 707043915 706714401 705998535 704686203 704822388 705306396
2322.2 705306396 705175400 704731064 703738251 703583832 702810211 702956467 702733536 702779236 703406372 702760086
2331.9 702760086 702630310 701919632 702153702 701940613 701229553 701149292 700772934 700540085 700504761 700930023
2341.5 700930023 700499802 701270065 701956635 702362213 702091599 701444473 702861938 703357315 702976990
2350.2 702976990 702027435 700841370 700079956 699400253 699550323 698913498 697860489 696548157 697130661
2358.9 697130661 697607269 697276154 697581177 696348953 695057297 694800262 696874237 697568283 698281784
2367.6 698281784 699033737 698018265 698094254 698655396 700027237 700288773 700613098 701312332 701680527
2376.2 701680527 702178650 702201843 703001480 703289413 703641968 703827209 703489456 703704529 703861542 704236145
2385.9 704236145 704047623 703991165 704185104 704268112 704152679 703361664 703114395 703010788 702802429 702581177
2395.5 702581177 702959900 703177872 702684174 702360611 701932526 701888275 701174011 700734634 700878296 700916977
2405.2 700916977 701033707 700342712 700223999 700161743 700213165 700338745 699953461 699725494 699521103 699654770
2414.8 699654770 698973083 698353348 698141327 698133850 698567734 698463135 698411331 698042603 697737656 697413177
2424.5 697413177 697016068 696588211 696122742 696311646 696032104 695866852 695798569 695657578 695395813 694781036
2434.1 694781036 694640121 694396744 694263535 694166641 693968048 693636246 693317490 693210983 693178787 693158646
2443.7 693158646 692595673 692143326 691612625 691356888 691222610 691086197 691401672 690973129 690471649 690146408
2453.4 690146408 690169449 689912415 689271011 688927612 688251343 687987137 687622375 687468948 687381821 687135849
2463 687135849 687138290 686930695 686924286 686411743 685924149 685355453 685167847 685176239 684480591 684389801 684015121
2473.6 684015121 683859634 683706970 683074646 682650528 682350616 682297134 681751785 681420517 680968933 680675735
2483.3 680675735 680559158 680194931 680365906 680044632 679568481 678994064 678582458 678314896 677684097 677174301
2492.9 677174301 676745758 676664429 676294327 676040115 675981903 675688400 675108795 674428940 674057388 673492126
2502.6 673492126 673169785 672429047 671956253 672195435 671996307 671482010 670797272 670725403 670486603 669947357
2512.2 669947357 669382858 668994827 668854904 668176346 667863998 667826385 667963867 667780075 667201004 666662369
2521.9 666662369 666367950 666585388 666119232 665598755 665124969 664965439 664917297 664358978 664019241 663368225
2531.5 663368225 663153458 662842255 662421341 662165527 661563034 661176453 660700760 660820312 660921707 660616379
2541.1 660616379 659926987 659304581 659286575 658713150 658377609 658360748 658246536 657767715 657305145 657032852
2550.8 657032852 656329727 656017303 655797806 655811844 655738602 655380096 655086060 654658737 654374237 653947449
2560.4 653947449 653480682 652692947 652352753 652262115 652095871 652476578 652429199 652117081 651427460 650896912
2570.1 650896912 650564957 650104141 649698715 648949127 648856430 649012070 649052124 648888779 648462906 648012009
2579.7 648012009 647416611 647071228 646329880 645626297 645456314 645611801 645552139 645209198 645145340 644736786
2589.4 644736786 644354935 643986435 643186417 642297974 642075882 642057495 641532516 641381149 641469803 641311035
2599 641311035 640582275 640098267 639659576 638946228 638676720 637923241 637328911 637055130 636730843 636171303
2608.6 636171303 635633202 635743065 635491791 635157585 634663124 634127846 633632011 633043251 632849693 632697678
2618.3 632697678 632501907 631985207 631772728 631305885 630410690 629946556 629442482 628781509 627988472 627863541
2627.9 627863541 627681084 627294655 626990814 626327400 626100388 625862732 625458565 624759865 624126549 623617172
2637.6 623617172 623098984 622779961 622099419 621831512 621526833 621162224 620935402 620378990 619926071 619699669
2647.2 619699669 619538879 618675690 618048706 617898712 617438736 616621284 616066437 616075783 615573425 615221367
2656.9 615221367 614867172 614590683 614454918 614072227 613841095 613072090 612702141 612226334 611564560 611524086
2666.5 611524086 611286049 610856361 610070915 609621429 609488754 609449043 609282722 608789215 608469353 608189735
2676.1 608189735 608038406 607573891 607162704 606666183 606114006 605959091 605536308 604808197 604071198 604166069
2685.8 604166069 604250488 603845978 603151398 602378502 602326126 601959648 601578598 601461143 601289101 600746155
2695.4 600746155 599874268 599835052 600037689 599961395 599545059 599059029 598409271 597649879 597384987 597187500
2705.1 597187500 596959801 596630898 596739998 596735954 595949402 595390205 595001335 594325027 593733215 593565292
2714.7 593565292 593235512 592858124 592528343 592278595 592406197 592668152 592760620 591939201 591143341 590962677
2724.4 590962677 590790710 590342827 589829407 589737930 589578018 589691696 589615974 589172897 588916092 588408432
2734 588408432 587975273 587863922 587721748 587123566 586856384 586748505 586687775 586878777 586471443 586315193
2743.7 586315193 586282272 586041756 585384712 584658127 584638214 584496078 584447746 584257736 584097023 583914261
2753.3 583914261 583315544 583226318 583304443 583087349 582733192 582275887 581795464 581713409 581485863 581130486
2762.9 581130486 580800667 580064392 579908562 579792137 579499359 579146957 578825378 578979378 578903923 578547668
2772.6 578547668 577707520 577326813 577107239 576558418 576404724 575929680 575704231 575466080 574871941 574506607
2782.2 574506607 574265671 573760185 573040276 572644157 572283592 572064362 571598320 571301994 571177292 570546188
2791.9 570546188 569979973 569172668 568712463 568179169 567378616 567175140 566754494 566201553 565922012 565636406
2801.5 565636406 564941406 564215164 563582458 562745247 562126999 561699028 561004333 560309296 560210075 559773903
2811.2 559773903 558756409 557837067 557130890 556400299 555366783 554551392 553982124 553675461 553129272
2819.8 553129272 552282066 551723976 551269798 550621796 549449997 548447037 547485466 546644974 545828438
2828.5 545828438 544798508 544542351 544337196 543741913 542558022 541260376 539976387 538516884 537899246
2837.2 537899246 537040138 535657387 534240837 532719536 530880432 528891449 527319221 525517159
2844.9 525517159 523429031 520799637 518137894 516097069 514706192 513491249 511737328 510709839
2852.6 510709839 510116997 509764900 509834557 509327774 508718262 508556213 508505058 508669167 509249191 508741951
2862.3 508741951 507907829 507668686 506871834 506000481 505162125 504474068 503478546 502554398 502342873 501825790
2871.9 501825790 501534767 501276550 500340118 499512634 499014320 498267899 497666321 497011414 496143188 495623055
2881.6 495623055 494870453 494302025 493665581 492879372 492389221 491626205 490583992 489176025 488007011
2890.2 488007011 486997566 486384659 485925560 484963684 484249840 483262405 482112656 480753746 479755707
2898.9 479755707 479470749 478794518 478178902 477480736 476586990 475623512 474859467 474059792 472802010
2907.6 472802010 471993866 471325684 470368576 469368057 468561707 467320518 465328789 463553200 462180977
2916.3 462180977 460825500 459435196 458563347 457768669 456874962 456179504 455242233 454535332 454659843
2925 454659843 455150986 455148201 455028152 454942207 454964943 455175819 455454216 455921135 456071968 456880417 457911644
2935.6 457911644 458326149 458611336 458488731 458540497 458923073 459821968 461017532 461943626 462441292 462820129
2945.2 462820129 463563995 464045601 464601593 464906654 464988022 465357780 465797997 466786804 467358170 467482986
2954.8 467482986 467842941 467868195 467580338 467679024 468099632 468464050 469118576 469772224 470552177 471563110
2964.5 471563110 472121391 472087517 472378654 473138390 473737679 474468269 474866867 475587196 476709175 477142754
2974.1 477142754 477518692 477789726 477920761 478386955 478837891 478706131 478916092 479380341 479431419 479658852
2983.8 479658852 479555473 479649467 479817657 479971962 480480194 480615234 480903053 481068306 481053696 480934830
2993.4 480934830 480588493 480314522 480132713 480018425 479643250 479134216 478200340 477696228 477891502 477807426
3003.1 477807426 477346382 476713448 476448746 475840073 475325127 475110893 474388924 473666000 473257027 472948380
3012.7 472948380 472245712 471898727 471561890 470789108 470108414 469495697 469215775 468642769 467839394 466933289
3022.4 466933289 466268158 465799828 464737892 463640175 462917938 462533302 462070351 461434898 460164108
3031 460164108 459358215 459382744 458561707 457792168 457105560 456682777 456249161 455168877 454041061 452647896
3040.7 452647896 451881447 451525497 451158867 450723877 449987793 448970413 448007584 447771950 446999817
3049.4 446999817 445828781 444600754 443533783 443110275 442432137 441657639 440949402 440449371 439653206
3058 439653206 438720894 437949104 436969566 436238976 435771561 435554161 434724770 433920555 433694153 433308067
3067.7 433308067 432639427 431312485 430466652 430020599 429199562 428288383 427612686 427191505 426736870
3076.4 426736870 426263771 425363007 424722595 424169121 423619537 423100395 422127838 421430664 420375519
3085 420375519 419608002 419421883 419036140 418306274 417257118 416739731 416058578 415249023 414461327 413694382
3094.7 413694382 413381233 412922783 412388763 411796532 411233330 410407219 409482231 408662376 407933846 407714081
3104.3 407714081 407184143 406363297 405616798 405132980 404657364 403695412 402855988 402314949 401851578 401188927
3114 401188927 400590897 400023880 398961830 397894707 397523003 397042427 395971184 395238037 394197655
3122.6 394197655 392928238 392443314 392386246 391656685 390325737 389857101 389449234 388556900 387945442
3131.3 387945442 387625923 386855545 385740891 385221672 384669838 384319801 383752632 382644348 381988983
3140 381988983 381087151 379909706 379166298 378973579 378428078 377163887 376130180 375768166 375528717
3148.7 375528717 374803772 374069901 372955971 371595001 370912056 370590897 370036469 369270363 368635292
3157.4 368635292 367751923 366846352 366043358 365254211 364429893 363568916 363144531 362557030 361968269 361558456
3167 361558456 360875053 359807091 358771706 358209076 357471390 356506157 355396767 354847336 354396706
3175.7 354396706 353464165 353199310 352793350 352291145 352006302 351165962 350091553 349123650 348049583
3184.4 348049583 346785316 345825386 345245514 345177002 345023766 344493523 343729935 342868423 342515335 341556778
3194 341556778 340290298 339403076 338611221 338184891 337708092 337396698 336879616 335958405 335324860 334909401
3203.6 334909401 334232903 333493080 333287506 333045959 332221718 331137276 330190201 329193802 328749962
3212.3 328749962 328662453 327979126 327178383 326130142 325699425 325537148 324915886 324688492 323894730 322811813
3222 322811813 322252541 321914139 321215324 320404968 320310707 320228500 319395638 318318901 317975330 317672787
3231.6 317672787 317388935 317313347 316492310 315481548 314606476 314072704 313830585 313566647 312791958 311814575
3241.3 311814575 311462688 311029263 310819073 310408649 309687195 309383564 308886547 308362541 307838612 307672672
3250.9 307672672 307793579 307337551 306099510 305052910 305090065 305124207 304573975 303720169 303125553 302827549
3260.5 302827549 302486343 302100677 301822720 301791019 301196136 300447788 299903584 299597893 299782219 299544411
3270.2 299544411 299111996 298638058 298032284 297640305 297514114 297302017 296548595 295856781 295375805 295150681
3279.8 295150681 295127621 294857540 294208183 293284225 293091049 293474751 293141727 292306652 292192726 292554798
3289.5 292554798 292339325 292026501 291711197 290800514 290251732 290171680 289690533 289246845 288757591 288460884
3299.1 288460884 288687935 288403587 287537365 286942997 287033844 287147942 286987991 286525116 285928307 285711288
3308.8 285711288 285232334 284697952 284025517 283486977 283468571 282888756 282217731 281477375 281019344 281079845
3318.4 281079845 280710793 280439014 280222034 279758949 279118500 278647079 278392239 277533894 276337738
3327.1 276337738 275743065 275739498 275298882 274595985 274193611 274061909 273717690 272761726 272442379 271853466
3336.7 271853466 270564575 270409718 270351906 269809933 269475040 269018421 268155956 267449722 267304306 266877060
3346.4 266877060 266499939 266187344 265337658 264937382 264518070 263946877 263989964 263783016 263357067 262994385
3356 262994385 262553120 262273273 262217083 262310886 261767197 260621567 260065441 260189667 260187187 259691315
3365.7 259691315 258900509 258381100 258152618 257580833 257057018 256835861 256863956 257172012 256880531 256230335
3375.3 256230335 255784874 255438404 255392666 255286465 255106754 254973717 254412670 253794136 253756008 253794060
3384.9 253794060 253196011 252772465 253084641 253168602 253072624 252920074 252738762 252885323 252481594 252061691
3394.6 252061691 251766968 251329250 251380482 251202011 251078129 251021805 250649490 250349560 250336361 250814457
3404.2 250814457 251082020 250982723 250670795 250771294 251135063 250984173 250763874 250502853 250684052 250656719
3413.9 250656719 250542126 250877705 250747242 250909004 250975018 250723972 250667992 250553589 250493145 250684032
3423.5 250684032 251184330 251339569 251923580 252678185 252595139 252342014 252351303 252531185 252444916 253010902
3433.2 253010902 253345203 252920437 253211060 253381100 253569088 254074726 254559402 254925690 254935436 255056267
3442.8 255056267 255174313 255464325 256138134 256677475 256733360 257110710 257945080 258310089 258440590 258962193
3452.5 258962193 259577179 259851456 260361900 261166916 261789360 262184200 262323666 262830963 263718224 264262524
3462.1 264262524 264360142 264602356 264870548 265569324 266786251 267348728 268003998 268351192 268302898 268857746
3471.7 268857746 269580269 270590744 271179810 271283989 271628304 272484016 273492165 274022522 274709320
3480.4 274709320 275564365 276254730 276367207 276674213 277536926 278267384 279291058 280262966 280805874
3489.1 280805874 281273022 282301979 283197765 283319530 283707809 284263115 285056801 285747929 286586418
3497.8 286586418 287648945 287962570 288767662 290108185 290960007 291967697 292874088 292987881 293248539
3506.5 293248539 294122372 295164051 296120625 296991711 297950706 298449917 298906517 299588547 300717258
3515.1 300717258 302071877 302606430 303358498 304026470 304421787 305360565 306657600 307805519 308043308
3523.8 308043308 309084282 310550442 311236858 312017689 312953625 313672867 314837723 316236687 317054501
3532.5 317054501 318209286 319347115 320668449 321707611 321461830 322401581 324293518 325922546 326731834
3541.2 326731834 327710075 329038353 329691124 330366631 331181870 332866173 333945084 334913445 336516762
3549.9 336516762 338141594 339684639 339747620 341086693 342978325 344452362 346017036 347134094 348820267
3558.5 348820267 350250435 351598244 352196808 353619690 355175323 355826187 358917046 360452881 360634880
3567.2 360634880 361127090 362096786 365087814 366713104 368069344 369614754 371770935 373326225 374558029
3575.9 374558029 376958923 377691879 379453011 381934319 383444328 385291405 387402573 389194183
3583.6 389194183 389925270 392516174 394645615 395244942 397723846 398216248 400124741 403000183 405627022
3592.3 405627022 407337761 408616753 410976295 411431274 413539619 416307526 417539406 420186462
3600 420186462 422483368 424681206 426671486 428277206 430562286 432913475 435119171 435960312 439486389
3608.7 439486389 441062508 440988045 446283264 448572998 448727264 452736664 454121552 457127075 460305290
3617.4 460305290 461775970 464415016 465825462 467320824 470366402 473742561 476136780 478973694
3625.1 478973694 482162666 485342255 490798225 493371620 489290848 492216187 496362038 500872765
3632.8 500872765 503618088 504563370 507871552 511696777 514510498 516533852 518773270 521202774
3640.5 521202774 524216461 527445755 529839745 532595596 536163445 541264534 542802963 542225533
3648.2 542225533 547324142 549750938 550413284 550532227 554704742 559289474 563645630 569543457 565839844
3656.9 565839844 567495499 572791328 575172958 577826347 579424667 582111893 584114189 586102638
3664.6 586102638 588470840 590026093 594510040 597501907 597904587 598500404 595530739 598523331 605014305
3673.3 605014305 611317139 610251389 600989990 604450836 611502228 615964966 615087051 616223526
3681 616223526 618947525 620885658 622168121 622859001 623949966 627378159 632321129 627066803 625936165
3689.7 625936165 633018341 629110451 628117294 632301292 633125076 634850769 636237183 636742668 637663422
3698.4 637663422 637755623 640299530 642705841 638946075 638103218 641921005 643480148 643860855 644795456
3707 644795456 647382889 650144501 644225845 647542419 651872330 642780151 646496048 649965286 650650101
3715.7 650650101 651675262 653855209 655366211 652774353 654066086 657958984 655347824 652178726
3723.4 652178726 655035172 656052551 656408539 655860825 655908585 658080215 659012985 664383926 662938538
3732.1 662938538 655182495 661921234 662833328 656715317 657490921 658864975 659560928 661408310 663524933
3740.8 663524933 660863342 663860092 672877808 664163361 652211533 659748383 663982086 668724823
3748.5 668724823 668165588 659754105 667478256 666257401 661412735 665565491 668362045 670886536
3756.2 670886536 667124176 668737106 673411560 667737350 666410370 669055405 669856644 670380783 673303375
3764.9 673303375 671203842 667115707 670485077 675170517 675458832 667752533 668445740 671258240 671767731
3773.6 671767731 672588654 672834473 674114380 674154739 675520477 675832596 670328064 671678925 673532028
3782.3 673532028 674299622 675749359 674337616 673655853 674597702 675438995 676142883 676277771 675838776
3790.9 675838776 675328598 675405502 675078583 676414108 679573517 676870804 673025894 674238281 677238159
3799.6 677238159 682309799 678464661 669591141 672231216 675179367 679217453 682941437 675182266
3807.3 675182266 671665115 675520248 677228088 677430801 677830887 677406616 677772064 681460876 680841217
3816 680841217 671552200 675355072 679636612 682114792 683703690 671685028 671817474 675620804 677557297
3824.7 677557297 679968567 679598846 676599731 676841507 678213425 680410843 681387253 674881744 676254044
3833.4 676254044 682260971 678929596 678083878 682776871 675773849 673208618 679006653 676940384
3841.1 676940384 677342911 682180023 679909058 676599579 678921280 680586853 680596924 680700378 679243088
3849.8 679243088 680928879 685204849 681347427 683261871 671549301 670642624 679036331 679055939 678049622
3858.4 678049622 679650574 680582962 682300262 678463516 677876816 682187576 678103333 674646225 677755661
3867.1 677755661 681152954 684953308 678431396 670933685 674845734 680204315 683928223 678034515
3874.8 678034515 677437897 679930878 679705276 681606903 684045715 678389740 673341675 677909698 679912567
3883.5 679912567 681485977 685495758 676733627 676417923 678805466 679077530 682742920 682289581 676397781
3892.2 676397781 677688217 680210495 679074020 679209213 679776459 681317291 682462997 675957642 679707108
3900.9 679707108 681152191 676313171 679109955 676690826 676278000 677670135 678409348 679863663 679368896
3909.6 679368896 679120789 678811111 679609756 679899063 678628006 678828659 679943161 678675766 676865997
3918.2 676865997 680344620 681122360 677068100 677551956 678713989 679704895 679138565 677273102 677943726
3926.9 677943726 679200974 680478973 679376144 678624191 679816818 677826843 677012253 678072357 678168945
3935.6 678168945 678920670 679580688 678676758 677550430 677472687 678727951 679651413 676959610 675962372
3944.3 675962372 677256622 678283844 679293442 677663574 677154694 677369614 676461868 677737961 677813950
3953 677813950 677254944 677471390 677737885 678054504 677925797 678433075 677866669 677542267 677873535 676982956
3962.6 676982956 677102737 677581406 677821579 678544846 678706665 678353577 678165665 678034286 678144684 677956161
3972.2 677956161 677708817 678053513 677865067 677187424 677239075 678308487 678435669 677875061 677953720 677835007
3981.9 677835007 677832489 677450409 677398987 677573318 677551727 678145905 678393250 678140793 677042389 677096100
3991.5 677096100 677997665 677435760 677345581 677878571 678131561 678003769 677849503 677685547 677095261
4000.2 677095261
##END=$$ End of the data block
