##TITLE=$$ Begin of the data block
##JCAMP-DX=5.00 $$ ACD/SpecManager v 10.08
##SPECTROMETER/DATA SYSTEM=Varian
##DATE=14 Jan 2013 09:38:32
##DATA TYPE=INFRARED SPECTRUM
##DATA CLASS=XYDATA
##ORIGIN=
##OWNER=
##NPOINTS=3735
##FIRSTX=399.26403809
##LASTX=4000.35498047
##MAXX=4000.35498047
##MINX=399.26403809
##MAXY=73.66298676
##MINY=24.94550705
##XFACTOR=1.0000000000
##YFACTOR=0.000000100000000
##FIRSTY=43.98863220
##DELTAX=0.96440572
##XUNITS=1/CM
##YUNITS=TRANSMITTANCE
##XYDATA=(X++(Y..Y))
399.3D39886322k662048J479950J667442j294746l505135q792496J156464K315674
407D30251427m656487j687279K113877J624679j736030J643104M828759k853623k144279
415.7D27384148Q653183Q711967K913017q746032j1104317k856865k053833k39716
423.4D22661552M30565K752114M829750j540947m460907l296089k143479p95059J792946
432.1D20230446L74985m92402K227021N592537L819885l006249l46527J715088j403389
440.7D28711395k108040K156029J397438l156357K364731K499809m119186m460945
448.4D23284874j96610K830315J38512q85430l107185p4234K216377J972428J550331
457.1D27729378n503960p5798J82686p57561j03798P68547J938095l338203j489410
$$ y = [439886322, 437224274, 438704224, 440371666, 439076920, 435571785, 426779289, 427935753, 430251427, 425594940, 423907661, 426021538, 427646217, 425910187, 427553291, 432382050, 429528427, 427384148, 436037331, 444749298, 447662315, 438916283, 427811966, 424955101, 422901268, 422661552, 423092117, 425844231, 430673981, 429133034, 424672127, 421376038, 419232559, 418437500, 420230446, 420605431, 420113029, 422340050, 427932587, 431752472, 428746223, 428399696, 430114784, 428711395, 426603355, 428759384, 430156822, 427000465, 429365196, 431865005, 427745819, 423284874, 423088264, 425918579, 426057091, 425171661, 422064476, 421990242, 424206619, 426179047, 427729378, 422225418, 422149620, 422332306, 421574745, 421470947, 422239494, 424177589, 420839386, 419349976]
465.8D19349976j528054j885719L119926J349717K66113N01442N75714k118454j033821
474.5D18596840K636299K329979j889114n582810k933884R99375O17714J221046K306023
483.2D18301468j612320j527672J148300N93949j152306j338043K43797l013916j192512
491.8D10450745J746673J422692K439117k351532m36516K252884n69420j492233q54454
500.5D12607956O21109j530342l96309O50711n3368J146965O76995j373558j654473
509.2D10695686J45455p99713k921677k2850M265366J94244m232674j898842j014099
517.9D04410896j082802j14364K585678R24034j466827n05066m59519M00620L38631
526.6D05031281O88323j226272j542130O39229Q33130J324844j133117M61426J483116
$$ y = [419349976, 417821922, 415936203, 419056129, 420405846, 420671959, 421173401, 421749115, 419630661, 418596840, 421233139, 423563118, 421674004, 416091194, 413157310, 414156685, 414774399, 415995445, 418301468, 416689148, 415161476, 416309776, 416903725, 415751419, 414413376, 414657173, 411643257, 410450745, 412197418, 413620110, 416059227, 413707695, 413271179, 415524063, 414954643, 413462410, 412607956, 413229065, 411698723, 411302414, 411953125, 411899757, 413046722, 413723717, 412350159, 410695686, 410841141, 410041428, 407119751, 407096901, 411362267, 411556511, 407323837, 405424995, 404410896, 403328094, 403213730, 405799408, 406723442, 405256615, 404751549, 404292030, 404692650, 405031281, 405719604, 404493332, 402951202, 403590431, 404423561, 405748405, 404615288, 405076714, 406559830]
535.2D06559830j253701r40971K6436N0316j908531l55950l16314r74885p820m87785
544.9D00390625J178856p94067j220856j129456j490211L35235k31666r5711q46062
553.6C96096687n6724R7656l16010n35049k237396o33393M82178J262436Q53500K83318
563.2C95297203J011810K96936o43272j543961o1988J855583J519623j91269J09176
571.9C97649841J94550m31900L87306j202507p72171m38423j584435l0822J029853
580.6C94801292J166497k49253j2626J394615R18999q68302j375694l80859o40336
589.3C94754333M36478J743736J979943J387443m65011k357369m52995K112923k47574
597.9C98891907p71790m84352p20634J426391J815796J338730j663055l537865m28429
$$ y = [406559830, 405306129, 404365158, 404391594, 404441910, 402533379, 402177429, 401861115, 400886230, 400878410, 400390625, 401569481, 400775414, 399554558, 398425102, 396934891, 397270126, 397038460, 396942749, 396096687, 396039963, 396137619, 395821609, 395286560, 393049164, 392415771, 392897949, 394160385, 395013885, 395297203, 396309013, 396605949, 395962677, 394418716, 394356728, 396212311, 397731934, 397540665, 397649841, 397844391, 397412491, 397799797, 396597290, 395825119, 395386696, 393802261, 393771439, 394801292, 395967789, 395718536, 395705910, 397100525, 398019524, 397151222, 395775528, 395394669, 394754333, 395190811, 396934547, 398914490, 400301933, 399836922, 397479553, 397026558, 399139481, 398891907, 398120117, 397635765, 396915131, 398341522, 400157318, 401496048, 399832993, 396295128, 395866699]
606.6C95866699M98810j586876j922989Q33168K254105J78490r77478p23610r29795
615.3C93490524n77125o55937K63328Q72498k8496M12712K03552M00086J00326M30680
624.9C94912148J276855L3875J072082J947784J336441J20850P59583K091789J254959
633.6D04806366J810493R41658k27050j96610L1510M19502K57683K064552K674446
642.3D12582550K049675J691971J242409O12869L99132Q06121J10398M86297M10195
651D20391617Q59146K548103J465187J34812n12009o47812m44794q14590j022530l83758
660.6D21573372J028633P21664J172295J371307p66868o44188j406059o693001M074554
669.3D20431709M131584J893692N38674M81148Q24432L56255J86042p2250m05350J159172
$$ y = [395866699, 396365509, 394778633, 392855644, 393688812, 395942917, 396121407, 395143929, 394420319, 393490524, 392913399, 392257462, 392520790, 393393288, 393364792, 393777504, 393981056, 394381142, 394481468, 394912148, 396189003, 396222878, 397294960, 399242744, 400579185, 400700035, 401459618, 403551407, 404806366, 406616859, 407558517, 407331467, 407134857, 407166367, 407585869, 407843552, 409908104, 412582550, 414632225, 416324196, 417566605, 418179474, 418578606, 419384727, 419495125, 419981422, 420391617, 421250763, 423798866, 425264053, 425398865, 424886856, 424239044, 423794250, 422979660, 421957130, 421573372, 422602005, 423323669, 424495964, 425867271, 425100403, 424456215, 423050156, 416357155, 420431709, 424563293, 426456985, 426995659, 427476807, 428301239, 428657494, 428843536, 428771286, 428365936, 429525108]
678.9D29525108K270241K223854J528626O69517P32651Q56819J437912J324921J95389
687.6D40765038M18434Q75053N94673R91287Q24929J24664N32875O77376j89324l34968
697.3D45280037Q57887P33338M89692J611328J771584J497040Q0108P4883J272125
705.9D53668022l76434n60799J116448J726074Q87604K23236J452751J691322N41001
714.6D60369225o00396O1570J505317M46320k87666N98869J486282J537514J106529
723.3D66223564P21626j81312j602J391868J676178P42836N2376l3417J094399K341347
733D74027863J366424J135063J053391k99111k39257q9150J93253Q4152M23164J558037
742.6D79213829R04312Q55255J463013J357117N72204o81038q08487L23372J650505
$$ y = [429525108, 431795349, 434019203, 435547829, 436217346, 436949997, 437806816, 439244728, 440569649, 440765038, 441183472, 442058525, 442653198, 443644485, 444469414, 444594078, 445126953, 445804329, 445615005, 445280037, 446137924, 446871262, 447360954, 448972282, 450743866, 452240906, 452321014, 452395897, 453668022, 453291588, 452730789, 453847237, 455573311, 456460915, 456684151, 458136902, 459828224, 460369225, 459768829, 459830399, 461335716, 461782036, 461494370, 462093239, 463579521, 465117035, 466223564, 466945190, 466763878, 466762276, 468154144, 469830322, 470573158, 470625534, 470592117, 471686516, 474027863, 475394287, 476529350, 477582741, 477283630, 477044373, 476955223, 477148476, 477232628, 477655792, 479213829, 480118141, 480973396, 482436409, 483793526, 484365730, 483684692, 482876205, 483199577, 484850082]
751.3D84850082K011872J687813J002273J339340J117859l60718O50521Q77495k05231
760D92971306J342010K611313J568718J291046J438485P17658M53187l16124l22113
768.6E01755486L43704N81665L83529k71072N66673P03545l4752j65710m31595p3738
778.3E03357735M46624L43514M81148P38792P45354J161003J0643j33324J512795M96750
787.9E09161034n08728K8801M69627J88713J034775J270103k11563J17226m98276j141586
797.6E09910126n17159m49867j619072k146721Q1024Q45871n41496j914330j593933
806.2E02054443r30900j438332k163887k178955j174202j722221j120835R3193l66706
814.9D91051598r88846j549530q14972m43230q41865r52645N03121K041626K002144
$$ y = [484850082, 486861954, 488549767, 489552040, 490891380, 492009239, 491648521, 492299042, 493176537, 492971306, 494313316, 496924629, 498493347, 499784393, 501222878, 501940536, 502393723, 502077599, 501755486, 502099190, 502680855, 503064384, 502793312, 503359985, 504063530, 504028778, 503863068, 503431473, 503357735, 503804359, 504147873, 504629021, 505367813, 506113167, 507274170, 507284813, 507151489, 508664284, 509161034, 508652306, 508681107, 509150734, 509339447, 510374222, 511644325, 511432762, 511549988, 511051712, 509910126, 509392967, 508943100, 507324028, 505177307, 505258331, 506104202, 505562706, 503648376, 502054443, 501123543, 499685211, 497521324, 495342369, 494168167, 492445946, 491325111, 491418304, 491051598, 490062752, 488513222, 487698250, 487255020, 486413155, 485460510, 485963631, 488005257, 490007401]
823.6D90007401K206039K133522K525139J921997J009560J473464J423378K279244
831.3E04979744L160057K940445K503357K979698K805100J967697J197662O94695J591377
840E24819832M95987J299667K373505K085075L136101K336883J931038R9144l9177
848.7E38538055Q68988O5041J077309J415901K369842K365227J698876J576576J541900
857.4E51517715J321679J105804J546974j18179P18803J348992J204033K017669R13124
866E61576614Q59719L73039R3842j445389k278824j321945j105652l71437o81458n70183
875.7E55128326j81541L13721n49469j519394j483765j620903k66189j32180j030k47078
885.3E49440498n01098m72603j269760j696739k091713m84009l29781m87480j06392
$$ y = [490007401, 492213440, 494346962, 496872101, 498794098, 499803658, 501277122, 502700500, 504979744, 508139801, 511080246, 513583603, 516563301, 519368401, 521336098, 522533760, 523228455, 524819832, 525315819, 526615486, 528988991, 531074066, 534210167, 536547050, 538478088, 538577232, 538538055, 539407043, 539472084, 540549393, 541965294, 544335136, 546700363, 548399239, 549975815, 551517715, 552839394, 553945198, 555492172, 555373993, 556092796, 557441788, 558645821, 560663490, 561576614, 562436333, 562809372, 562903214, 561457825, 559179001, 557857056, 556751404, 556379967, 555698509, 555128326, 554946785, 555260506, 554711037, 553191643, 551707878, 550086975, 549820786, 549688606, 549687576, 549440498, 548939400, 548466797, 547197037, 545500298, 543408585, 542924576, 542594795, 542107315, 542000923]
894E42000923m81224l34816r91249l09296p36236j441956j568641j663018n81054l19252
903.7E33574181P62367J882400K363320J956138J100846K42157j34507P22847k59819
912.3E42209930n98564J16806N38292k88696j438637j414261k342262k336960k264671
921E32180977k487641k326622j206512q33969k046280k056198k147408k060547k923278
929.7E14092522l191948k247582j729736j142731j321373m41856j54305o26602j441574
938.4E01794815k300034j530876j576156k003060j732254p58400m92401m13780r23882
947.1D90063972j593742n12009j149406j417923j383553k063636j209717o55518j218834
955.7D78859634j824874j159974k034225k857514k425117l034515k093544j383362
$$ y = [542000923, 541519699, 541184883, 540193634, 539884338, 539148102, 537706146, 536137505, 534474487, 533893433, 533574181, 534336548, 536218948, 538582268, 540538406, 541639252, 541881409, 541746902, 542469749, 542209930, 541611366, 541728172, 542266464, 541977768, 540539131, 539124870, 536782608, 534445648, 532180977, 529693336, 527366714, 526160202, 525326233, 523279953, 521223755, 519076347, 517015800, 514092522, 510900574, 508652992, 506923256, 505780525, 504459152, 504017296, 503862991, 503236389, 501794815, 499494781, 497963905, 496387749, 494384689, 492652435, 491894035, 491401634, 490987854, 490063972, 488470230, 487958221, 486808815, 485390892, 484007339, 481943703, 480733986, 480078468, 478859634, 477034760, 475874786, 473840561, 470983047, 468557930, 465523415, 463429871, 462046509]
963.4D62046509j743241j404647j028405p95364r66835j577377k334290k798729k630730
972.1D46766891k220153k342644j743622j153412j885833k390061k731285l178406
979.8D29121475l223533l664437m757614m676971l761826l359604k994690k862663
987.6C99820137l750420l525848k705536l718948m091149m079208l289490k555618
995.3C72103920k555695j826744j876983j688843k417832k743606k780609l364601
1003C52849007k552605j975250j241608j498566j948089j560822j230316j769485k064934
1011.7C37007332j558304k317734j975631j389885j306076k028008j685410q15124
1019.4C23931160k290344k200108k270431j585236j136208j571064j115760j261845
$$ y = [462046509, 460303268, 458898621, 457870216, 457074852, 456108017, 454530640, 452196350, 449397621, 446766891, 444546738, 442204094, 440460472, 439307060, 437421227, 435031166, 432299881, 429121475, 425897942, 422233505, 417475891, 412798920, 409037094, 405677490, 402682800, 399820137, 396069717, 392543869, 389838333, 386119385, 382028236, 377949028, 374659538, 372103920, 369548225, 367721481, 365844498, 364155655, 361737823, 358994217, 356213608, 352849007, 350296402, 348321152, 347079544, 345580978, 343632889, 342072067, 340841751, 339072266, 337007332, 335449028, 333131294, 331155663, 329765778, 328459702, 326431694, 324746284, 323931160, 321640816, 319440708, 317170277, 315585041, 314448833, 312877769, 311762009, 310500164]
1027.1C10500164r94091j638489j179313j594639p14989J74713j397343J78643R59015
1035.8C04293671J248512J288509J962700J622276P54738J891041J276722J020413
1043.5C15358582k7466O94580P13711K1190Q89130q23670l89709r46770j462707q31452
1053.1C13195419o81896m4632q35991m11415m54330K39238j106J28765J456795J411343
1062.8C14002190J628551J009750J704827J407795J691856J782761J491051J715965
1070.5C26434746K57835R84459m23775q46443N98946N10330Q69064J20697R50890J441956
1080.1C30898705J134681N39971L83148L03764k38647M36516P02705J627846J164703
1088.8C36953392J128235J250915P45583Q37402L38250J521377J292648P28875K67105
$$ y = [310500164, 309506073, 307867584, 306688271, 305093632, 304378643, 304553356, 303156013, 303334656, 304293671, 305542183, 306830692, 308793392, 310415668, 311170406, 313061447, 314338169, 315358582, 315331116, 316025696, 316739407, 316760597, 317649727, 316826057, 316436348, 315489578, 314026871, 313195419, 312513523, 312468891, 311632900, 311221485, 310767155, 311006393, 311005287, 311134052, 312590847, 314002190, 315630741, 316640491, 318345318, 319753113, 321444969, 323227730, 324718781, 326434746, 326692581, 327677040, 327253265, 326406822, 327005768, 327516098, 328385162, 328505859, 329456749, 330898705, 332033386, 332573357, 332956505, 333260269, 333021622, 333458138, 334160843, 335788689, 336953392, 338081627, 339332542, 340078125, 340915527, 341253777, 342775154, 344067802, 344796677, 345063782]
1097.5C45063782P50198J973152M24691j82457q622J053391R45740n1270N77202J054382
1107.1C51600189O32439k15683O84891M74968N59043R70269N44166J047631N62019
1115.8C56859932N26771O08368J116295O18363p7439J68000K75154J233520k46734
1124.5C61082230m46549J042710J263580J320495J198807J842385J772041J406898
1132.2C70482597R28917J176148J101150J190071K187920J648102J863479J833611
1139.9C82411995J721725J641503O49948Q6059M6654R27086R55582O69365N16052K27394
1149.6C89853363J60141L09143L71056r09310n51948K46582l42903j33095O1073j04523
1159.2C88959579j69906J01356j92566l82232k82936J87301J500397J825981J885300
$$ y = [345063782, 345813980, 347787132, 348211823, 348029366, 348020744, 349074135, 350019875, 349968605, 350545807, 351600189, 352232628, 352016945, 352701836, 353176804, 353735847, 354706116, 355250282, 356297913, 356859932, 357386703, 357995071, 359111366, 359729729, 359652290, 359820290, 360095444, 361328964, 361082230, 360635681, 361678391, 362941971, 364262466, 365461273, 367303658, 369075699, 370482597, 371411514, 372587662, 373688812, 374878883, 377066803, 378714905, 380578384, 382411995, 384133720, 385775223, 386425171, 386511230, 386557884, 387484970, 388440552, 389109917, 389625969, 389853363, 390013504, 390322647, 390693703, 389784393, 389232445, 389479027, 389136124, 389003029, 389064102, 388959579, 388789673, 388891029, 388698463, 388316231, 388033295, 388220596, 389720993, 391546974, 393432274]
1167.9C93432274K687263L241043K878457K879867K548905K634124K859383K670479
1175.6D15831795L440551L104935K871475L269120L465118L270874K697029K201042
1183.3D40151939J656914J869888K171212J960106J199951J147308J568070R95330
1191D52720718L90053M35066j13678q46214o84318q83980p01943l28979o51360j098098
1200.7D48237267j471634j073532n67170j199684j637497j035766r83086m80957K44331
1209.4D40032272m08325m69093O9656l12958j103286j170693m17022K4604j85775l37639
1219D35721741j84746m3030J38474k31285n59502m26598q89244o77109n61294p89375
1228.6D31498032J76887K33231n32913m96865m54712n24673m37393m36097m04968j36795
$$ y = [393432274, 396119537, 399360580, 402239037, 405118904, 407667809, 410301933, 413161316, 415831795, 419272346, 422377281, 425248756, 428517876, 431982994, 435253868, 437950897, 440151939, 441808853, 443678741, 445849953, 447810059, 449010010, 450157318, 451725388, 452720718, 453110771, 453545837, 453432159, 452585945, 451901627, 451017647, 450315704, 449986725, 449335365, 448237267, 446765633, 445692101, 445124931, 443925247, 442287750, 441251984, 440268898, 439787941, 440032272, 439623947, 439154854, 439224510, 438911552, 437808266, 436637573, 436220551, 436245155, 436059380, 435721741, 435536995, 435493965, 435632439, 435401154, 434841652, 434415054, 433525810, 432848701, 432287407, 431498032, 431674919, 431908150, 431375237, 430878372, 430423660, 429898987, 429461594, 429025497, 428620529, 428483734]
1238.3D28483734J27030K53982k12250o36673r4223Q1482l77464m48837k91062o44722
1247.9D26240997o41899m8637j74828k93388l1777J37253k62947l39622J9226p13158
1257.6D23891220m72946L19595L57361L19634K3155L57361N66330K99186O4125L63846
1267.2D26088867Q01048J071930J072770M63295J012878J362267R32846O97555N92537
1275.9D34095993R32884J160126J356316J211738J161156J227722J279793J467094
1283.6D43892822J039315O30569J000900J287880J096611J358719J438103J224403
1291.3D52969322J000405M05120J51673N70297N79681K66724L61366M15650P95021
1300D57515259N29136K07673J45301l23524n6343l17230o00815m68407m95491o30188
$$ y = [428483734, 428610764, 428864746, 428652496, 428015823, 427921600, 428003082, 427625618, 427176781, 426885719, 426240997, 425599098, 425550461, 425375633, 425082245, 425050468, 425187721, 424924774, 424585152, 424604378, 423891220, 423418274, 423737869, 424095230, 424414864, 424438019, 424795380, 425361710, 425660896, 425725021, 426088867, 426889915, 427961845, 429034615, 429497910, 430510788, 431873055, 432805901, 433503456, 434095993, 435028877, 436189003, 437545319, 438757057, 439918213, 441145935, 442425728, 443892822, 444932137, 445562706, 446563606, 447851486, 448948097, 450306816, 451744919, 452969322, 453969727, 454374847, 454526520, 455096817, 455676498, 455943222, 456304588, 456720238, 457515259, 458044395, 458252068, 458397369, 458073845, 458017502, 457700272, 457099457, 456631050, 456135559, 455505371]
1309.7D55505371o83441l75176j92947n06058j066780n20706m00963l48282J69182
1318.3D51580200J01090Q02459R95293J000710P69081N81703O05469j63002k327j62850
1328D56107826j65596J49384o2218m22096o81610J7013l82766j082879o89659j15127
1337.6D52672272l2807J95618O31294O07567J175766J071014P59125M81224J67389
1346.3D57728462M50249K21977M56696J42250J19285k4566m23851k85836q55560m70390
1355.9D57058716m31442l87383j98860j24931l28408p91168l07198p67364K25067O0005
1365.6D54007034o85119m53568p39441k79312k03743R5940o5155k15187j18294m57382
1375.2D50885773N3177k94152J35880J61400n074K17819l0861n63888j197128p44286
$$ y = [455505371, 454821930, 454446754, 454253807, 453747749, 452680969, 452160263, 451759300, 451411018, 451580200, 451681290, 452483749, 453479042, 454479752, 455248833, 455830536, 456436005, 456273003, 456270676, 456107826, 455942230, 456091614, 456029396, 455607300, 454925690, 454942703, 454559937, 453477058, 452787399, 452672272, 452639465, 452835083, 453466377, 454073944, 455249710, 456320724, 457079849, 457561073, 457728462, 458178711, 458400688, 458857384, 458999634, 459118919, 459094353, 458670502, 458384666, 457529106, 457058716, 456627274, 456239891, 456041031, 455916100, 455587692, 454796524, 454489326, 453721962, 453947029, 454007034, 453321915, 452868347, 452128906, 451849594, 451645851, 451741791, 451676636, 451461449, 451343155, 450885773, 450938950, 450644798, 450780678, 450942078, 450937004, 451154823, 451123962, 450560074, 449362946, 448618660]
1384.9D48618660j024246q07877j129379m84238k18429j649018j013679j120682j189613
1393.6D39981499j878891k680702j264344j620941j796951k885018j175842o15539
1401.3D26063271j520539j636925k032203k273255k013359j178321k097626k378884
1409D10932159j359481j411820p05948j129379j190567j131592j706085j330643j619720
1417.7C99346924r34601j903839k56996R33151l57971n53971k26440O98891M19998
1426.3C97165146m4403P5760k96784M74015P32383J556320J396180J297531J449585
1435D03805733N06363O37626J229439K310829J347924J156768J760636J766586J955528
1443.7D16477432Q17948K016601J604080J241913J280480R31129J936417J064262J801338
$$ y = [448618660, 447594414, 446786537, 445657158, 445172920, 444954491, 443305473, 442291794, 441171112, 439981499, 438102608, 435421906, 434157562, 432536621, 430739670, 427854652, 426678810, 426063271, 424542732, 422905807, 420873604, 418600349, 416586990, 415408669, 413311043, 410932159, 409572678, 408160858, 407454910, 406325531, 405134964, 404003372, 402297287, 400966644, 399346924, 398412323, 396508484, 396251488, 397184639, 396826668, 396272697, 396046257, 396745148, 397165146, 397120743, 397196503, 396899719, 397373734, 398106117, 399662437, 401058617, 402356148, 403805733, 404312096, 404949722, 406179161, 408489990, 409837914, 410994682, 412755318, 414521904, 416477432, 417295380, 419311981, 420916061, 422157974, 423438454, 424369583, 426306000, 427370262, 429171600]
1452.4D29171600J436997J340637J282310N22995J868058J217575L481941J841011
1460.1D42163124K233238K039528J891709K356948N58434K920494K710228K528343
1467.8D59402046K208748J833496K279625J911316K870674K764855L755760K721634
1475.5D79748154K335586K805748K197876K081680J379700J438065J878128J275711
1483.2D95140648Q90655O20995O51588l16124p70874N44739j230202m39262N49774
1491.9D95641937j08146p63054r44290r90715l991356p7286j571961k907295O9122
1500.6D84356956k75268q16612j326409j41296j071205l684807k608147N97000J763306
1509.3D76793518p18651L14369p43789r09424j77116q81157p39594k679024l80058
$$ y = [429171600, 430608597, 431949234, 433231544, 433754539, 435622597, 436840172, 440322113, 442163124, 444396362, 446435890, 448327599, 450684547, 451242981, 454163475, 456873703, 459402046, 461610794, 463444290, 465723915, 467635231, 470505905, 473270760, 477026520, 479748154, 482083740, 484889488, 487087364, 489169044, 490548744, 491986809, 493864937, 495140648, 496031303, 496652298, 497303886, 496987762, 496216888, 496761627, 495531425, 495092163, 495641937, 495533791, 494770737, 493826447, 492835732, 488844376, 488767090, 487195129, 484287834, 484356956, 484081688, 483265076, 481938667, 481797371, 480726166, 477041359, 474433212, 475030212, 476793518, 476074867, 476389236, 475645447, 474736023, 474558907, 473677750, 472938156, 470259132, 469879074]
1518D69879074R87778M02489k120858j165161R78203N71556J343460o68831M71573
1526.6D70679283k33803q79402k8419l98941O0348n75027r17511j448136J076889N64385
1536.3D67899666q6403M30107l835182p61185J210022J043701j319694O57463J628036
1545D66866531j103935J071358L80821M38805q78716q55980P41959k21787R98269j527138
1554.6D65910187k16599K56653j228714m982490n804329O272583M16488J043015q06008
1563.3D60860786j020851j702881j697883r44748k558937j224747n886574j240081
1571D44584084j351281k613563k203369k909470j234589r214134n88112k382126l678131
1579.7D18409309k912902m210473l097419n370941l110657m084969l241615l323746
$$ y = [469879074, 470866852, 471269341, 469148483, 467983322, 468961525, 469533081, 470876541, 470207710, 470679283, 470445480, 469566078, 469537659, 469138718, 469199066, 468624039, 467706528, 466258392, 467335281, 467899666, 467813263, 468243370, 464408188, 463647003, 464857025, 465900726, 464581032, 465238495, 466866531, 465762596, 466833954, 467214775, 467653580, 466774864, 465918884, 466660843, 466439056, 467437325, 465910187, 465693588, 465950241, 464721527, 459739037, 453934708, 460207291, 460623779, 461666794, 460860786, 459839935, 458137054, 456439171, 455494423, 452935486, 451710739, 445824165, 444584084, 443232803, 440619240, 438415871, 435506401, 434271812, 425057678, 424469566, 422087440, 418409309, 415496407, 411285934, 408188515, 402817574, 399706917, 395621948, 392380333, 389056587]
1587.4C89056587m747123l008767m647598k003059m372788k916374l255997m313621
1595.1C59791260k367172m044266j336479l908730k205086k752800k608986j523590
1602.8C39044151l628692j146889l241501r37691k576065j672439j406060k841682
1610.5C21593132J21765k452164l03268k237606l65639l22113n133648J496010j274414
1619.2C11122055P47051j479091P09095j75267k117424P78313q84228J682492j812764
1627.9C08570232P93362K48718K37980R56536m65889J592483r08890J547947j480751
1636.6C11091728J923542J457901M22058J994953q8825K163468L49750J753349R16672
1645.3C21984596o85653L440589k46429M119072J092339K857170J932068j669503K507515
$$ y = [389056587, 384309464, 381300697, 376653099, 374650040, 370277252, 367360878, 364104881, 359791260, 357424088, 353379822, 352043343, 348134613, 345929527, 343176727, 340567741, 339044151, 335415459, 334268570, 331027069, 330089378, 327513313, 325840874, 324434814, 321593132, 321714897, 319262733, 318959465, 316721859, 316356220, 316034107, 310900459, 312396469, 311122055, 311869106, 310390015, 311099110, 310923843, 308806419, 309584732, 308700504, 310382996, 308570232, 309363594, 309612312, 309850292, 310806828, 310340939, 311933422, 311024532, 312572479, 311091728, 313015270, 314473171, 314895229, 316890182, 316801357, 318964825, 319314575, 321067924, 321984596, 321298943, 324739532, 324493103, 328612175, 329704514, 332561684, 334493752, 332824249, 335331764]
1653.9C35331764R28307M225235J326217K839318J290664K111931K432556J852837
1661.6C52338829L790093O99234L656158K381592K963333K550201J777535K591018
1669.4C72747993J753045N496673K427292L805924L454284K739639L577958L165359
1677.1C99168167M245949K368698M310951L123780L655090M106865Q12263O614838
1684.8D28406601K891388N462646L727837L972778M456253L982659M929161L916130
1692.5D61745453M388199L915443M570656K812347M727097N459099M962883M746513
1700.2D97327690m96712P455025N488510M299927L664780K992935L069038L582535
1707.9E27383728M423103K671624K705383L116913K753257L027764J206322J992073
$$ y = [335331764, 336260071, 340485306, 341811523, 344650841, 345941505, 348053436, 350485992, 352338829, 356128922, 356828156, 360484314, 362865906, 365829239, 368379440, 370156975, 372747993, 374501038, 379997711, 382425003, 386230927, 389685211, 392424850, 396002808, 399168167, 403414116, 405782814, 410093765, 413217545, 416872635, 420979500, 421791763, 428406601, 431297989, 436760635, 440488472, 444461250, 448917503, 452900162, 457829323, 461745453, 466133652, 470049095, 474619751, 477432098, 482159195, 487618294, 492581177, 497327690, 496830978, 504286003, 509774513, 514074440, 517739220, 520732155, 523801193, 527383728, 531806831, 534478455, 537183838, 540300751, 543054008, 546081772, 547288094, 549280167]
1715.6E49280167L841781L115006j140785L080863L627587K089996J732369J260795
1723.4E66887779J127701K069206K488022J645661J218833J724778M45251J067772
1731.1E78675003L084908K598953l13950j048393M052849L708229J845894K397690
1738.8E95001183O10923m28123L986969K816963J275520K430954L354760K863311K000733
1747.5F13913193K121849J999092M644356K112465Q43391M842682L457909K921485
1755.2F36856422L093262J018334K013931K972946K422867K418060l8299J472854L427124
1763.9F55657501J993180J879348J839295J507416o41938J920090K854309n77316r13773
1772.5F65518112Q36258M431610K239762R9182K512436J032104J034622L84217j29471
$$ y = [549280167, 553121948, 556236954, 555096169, 558177032, 561804619, 563894615, 565626984, 566887779, 568015480, 570084686, 572572708, 574218369, 575437202, 577161980, 577607231, 578675003, 581759911, 584358864, 584044914, 582996521, 587049370, 590757599, 592603493, 595001183, 595612106, 595183983, 599170952, 601987915, 603263435, 605694389, 609049149, 611912460, 613913193, 616035042, 618034134, 622678490, 624790955, 625634346, 630477028, 633934937, 636856422, 639949684, 640968018, 642981949, 645954895, 648377762, 650795822, 650757523, 652230377, 655657501, 657650681, 659530029, 661369324, 662876740, 662234802, 664154892, 667009201, 666431885, 665518112, 666354370, 670785980, 673025742, 673124924, 675637360, 676669464, 677704086, 678088303, 677958832]
1781.2F77958832J156006J786728J773529K67486R10034J451264J312942O10581R26590
1789.9F88153992j30463l60336J20849N49851L170776R95560N05600J750412J470947
1798.6F96227188K93961j390610J735535O00357R18884J847153R00421J205826N43518
1807.3G02882233O38656P03202N00946r75953O99387J309586L82461J312256M61960
1815.9G07914734J042099O60858P29446P40128j54953N16205n15900O64749R06601
1824.6G12503967m63333P32880J666946J579132l55987j765290K99073J716385N82199
1833.3G16495972N92575Q82950M64935N33829p4387R29718R3536M27323J40686K80685
1842.9G20767822J24665l958664K818832K749176M42658m807J64261P04651Q7280N62744
$$ y = [677958832, 679114838, 680901566, 682675095, 682942581, 683852615, 685303879, 686616821, 687227402, 688153992, 688023529, 687663193, 687784042, 688333893, 691504669, 692500229, 693005829, 694756241, 696227188, 696521149, 695130539, 696866074, 697466431, 698385315, 700232468, 701132889, 702338715, 702882233, 703520889, 704224091, 704725037, 703749084, 704448471, 705758057, 706140518, 707452774, 707914734, 708956833, 709617691, 710347137, 711087265, 710932312, 711448517, 710932617, 711597366, 712503967, 712040634, 712773514, 714440460, 716019592, 715663605, 713898315, 714197388, 715913773, 716495972, 717088547, 717971497, 718436432, 718970261, 718895874, 719825592, 719919128, 720346451, 720487137, 720767822, 720892487, 716933823, 719752655, 722501831, 722944489, 722939682, 723103943, 723808594, 723895874, 724458618]
1852.6G24458618k05688M08096N87463K75269N49011j64871O15311L8910M16488J80969
1862.2G27159576j60369L0212k40479M93088j56936N13916l39508J12838J131668M79050
1871.9G29023056P09381k60086r6664N7296N96848P20367K99683J03149K2126M77218
1881.5G31652374o58416k30027j92718N05295J115417J53961R10263k32925j126099
1890.2G31897125K56195Q77381J13525j77612l51258o63604J227417N45730K41394
1898.9G33966293O1798k19421K52991J0376N59234k79693J36566Q8119P7057O83289
1908.5G35336609n3330r1323k29O27517p10296k20566K2812j63193J038895j471100
1918.2G34315796L32260J272965J06964l07694j029587L95203L81393L51639P4692
$$ y = [724458618, 724252930, 724661026, 725248489, 725523758, 726072769, 725907898, 726523209, 726562119, 726978607, 727159576, 726999207, 727029419, 726788940, 727282028, 727125092, 727639008, 727299500, 727412338, 728544006, 729023056, 729732437, 729472351, 729375687, 729432983, 730029831, 730750198, 731049881, 731153030, 731175156, 731652374, 730993958, 730763931, 730571213, 731076508, 732191925, 732345886, 733256149, 733023224, 731897125, 732153320, 733030701, 733144226, 732966614, 732615356, 731951752, 733179169, 733724899, 733966293, 734028091, 733808670, 734061661, 734072037, 734631271, 734351578, 734488144, 734576263, 734653320, 735336609, 735283279, 735191956, 735191727, 735819244, 735108948, 734888382, 734911194, 734748001, 735786896, 734315796, 734648056, 735921021, 736027985, 735720291, 734690704, 735085907, 735467300, 735818939, 735893631]
1926.8G35893631J37634K39868K98005O0730m45862L30658l29972p4844k17361k61307
1936.5G35631180J37634j54037M06723p9575N51834l25317j026230M24805o6910j27640
1946.1G35372467j59683K15530l6468J53656K96783j25885j38855p3852O1569p27616
1955.8G34837646j22451K0675L37143M89426k67029J99967n01481m21142j51138k3575
1965.4G34398041j86005m19922K89078J87836N66940M6463J67465n6686m33045m0893
1975.1G34519272m58603L1357k02332N0659J16425J19400K44141k56195M882n75409
1984.7G33593597k25296J88065L12653l54615q94775K83432K56958j66168n36499L8376
1994.3G32495728j55182k11716J19247l32946J19171p9270L17383k96860j95999K79999
$$ y = [735893631, 736031265, 736271133, 736569138, 736629868, 736184006, 736514664, 736184692, 736109848, 735892487, 735631180, 735768814, 735614777, 736021500, 735941925, 736493759, 736168442, 735142212, 735567017, 735500107, 735372467, 735212784, 735428314, 735391846, 735545502, 735842285, 735716400, 735577545, 735503693, 735565262, 734837646, 734715195, 734735870, 735073013, 735562439, 735295410, 735495377, 734993896, 734572754, 734421616, 734398041, 734212036, 733792114, 734081192, 734269028, 734835968, 734882431, 735049896, 734993210, 734560165, 734519272, 734060669, 734092026, 733889694, 733940353, 734056778, 734176178, 734420319, 734164124, 734169006, 733593597, 733368301, 733556366, 733869019, 733514404, 732619629, 732903061, 733160019, 732993851, 732457352, 732495728, 732340546, 732128830, 732248077, 731915131, 732034302, 731955032, 732272415, 731975555, 731779556, 732059555]
2004G32059555n36957j29852o79169j08871P3318R1858J01166n33371K48108r0332
2013.6G30495453l7155l32947l93677l41720k83509M00009m4326K5406o70319j54114
2023.3G28663101r6283o33163l2044l94287N3101l93219l11737J17340R079J7319r5368
2033.9G26903839K52075m03442k92053l84293k78244k68326m58221K8610j61209M51202
2043.5G25389938k63595o08750l98101j69983K02255n56870J21231J19935J02920J78528
2053.2G24117508L0289n5237n55115k16293l39127l2272m08020m730M92477J1673L891
2063.8G23045044o77948n6458k39563p5302j69143p79648J51291P2403L93448Q239
2073.4G21672363j11618j88675j87912K89460p13578k40631K24610Q1100k05460M6082
$$ y = [732059555, 731522598, 731392746, 730713577, 730604706, 730678024, 730769882, 730871048, 730337677, 730585785, 730495453, 730458298, 730125351, 729731674, 729389954, 729106445, 729506454, 729462128, 729487534, 728817215, 728663101, 728566818, 727933655, 727901611, 727507324, 727560425, 727167206, 726855469, 726972809, 726981888, 726999207, 726903839, 727155914, 726752472, 726460419, 726076126, 725797882, 725529556, 725071335, 725099945, 724938736, 725389938, 725126343, 724517593, 724119492, 723949509, 724151764, 723594894, 723716125, 723836060, 723938980, 724117508, 724147797, 724092560, 723537445, 723321152, 722982025, 722949753, 722541733, 722537003, 723029480, 723041153, 723045044, 722367096, 722310638, 722071075, 721995773, 721826630, 721046982, 721198273, 721270676, 721664124, 721672363, 721560745, 721372070, 721184158, 721473618, 720760040, 720519409, 720744019, 720825119, 720619659, 720665741]
2083.1G20665741Q1177o53076j5412m4861j51977n09796l92762J8921J02005L27835
2092.7G19427795l81393m6616j79138k31323O0425r4757k99454n06516J83640j77002
2102.4G17755661q2016M3411j05285o3248j98288m3488n35125r8191q9340J03836N4322
2113G16742249k90528O1493j90430K06757n67551n25283j61973l4027L15247n07126
2122.6G15048828J49689L8452q2855l55835n82199K08816J00861J77917m22744n3177
2132.3G14227753J39618J34277L33557k29721j37100l53089R4452k69317r4757J89972
2141.9G14035645l47291J62812P9117M16107M1046k8000r9182l66516j9074l13110
2151.5G13561554N33447M59137p0038l95813K8839M88663l74298l45917l26690L40042
$$ y = [720665741, 720746918, 720093842, 720078430, 720033569, 719881592, 719371796, 718979034, 718997955, 719099960, 719427795, 719046402, 718999786, 718820648, 718589325, 718649750, 718554993, 718255539, 717749023, 717932663, 717755661, 717673645, 717717056, 717611771, 717548523, 717350235, 717306747, 716771622, 716673431, 716584091, 716687927, 716742249, 716451721, 716513214, 716322784, 716529541, 715961990, 715436707, 715274734, 715240707, 715555954, 715048828, 715198517, 715236969, 715154114, 714798279, 714216080, 714424896, 714525757, 714703674, 714280930, 714227753, 714367371, 714501648, 714835205, 714605484, 714468384, 714115295, 714209747, 713940430, 713845673, 714035645, 713688354, 713851166, 713930283, 714346390, 714387436, 714359436, 714260254, 713893738, 713874664, 713561554, 714095001, 714554138, 714484100, 714088287, 714117126, 714605789, 714231491, 713885574, 713558884, 713898926]
2161.2G13898926J75781J59607L50723m11072N6305K9755K3804l57514k36892k0905
2170.8G13668518J0223P09916L18908M49829Q3085n0736j86462m27018J53199q7586
2180.5G14641876l0594j01928L49884L69873L2654J94854K42157J49079l58887J05514
2190.1G15594482k55050r0256L05634P9422L62167L9520L60413k21482l78494j52130
2199.8G15644226J25122O60935l0365J77917l8986J18332J47095j00708J79519j23367
2209.4G16759720k3270l15094L47367N12390j6098k77787l06091K47040j72653L8376
2219G16793900k36893j31836M42581L93143L27682l47824R5368N7678L6926R4605j18103
2229.7G17407227O9122j83106K0371o4697K02255q6975j13983L61404k3727j63422
$$ y = [713898926, 714074707, 714234314, 714585037, 714173965, 714230270, 714260025, 714283829, 713926315, 713689423, 713668518, 713678741, 714388657, 714707565, 715157394, 715240479, 715189743, 715003281, 714576263, 714729462, 714641876, 714611282, 714509354, 714859238, 715229111, 715261765, 715456619, 715698776, 715847855, 715488968, 715594482, 715339432, 715249176, 715554810, 715634232, 715996399, 716035919, 716396332, 716174850, 715796356, 715644226, 715769348, 716430283, 716399918, 716577835, 716538849, 716657181, 716804276, 716703568, 716883087, 716759720, 716736450, 716421356, 716768723, 717281113, 717265015, 716987228, 716681137, 716928177, 716755524, 716793900, 716557007, 716425171, 716867752, 717260895, 717588577, 717240753, 717336121, 717393799, 717430725, 717525330, 717407227, 717476349, 717293243, 717313614, 717248917, 717451172, 717364197, 717250214, 717611618, 717587891, 717424469]
2239.3G17424469r0103N25360p6904l52860k44675j43661M95377L0899j3733m03138
2248.9G17151031j50222J18332P1945K33078j26190J87530k55966J2741Q1787J46485
2258.6G17470551L04794l64533J01395j83563L0975k5329k45667L33405K86636P9040
2268.2G17787704m85305j83106K7008R1324j88751N0278O10351L70407K20261p24487
2277.9G17575684j77231n0049J00250M95072n44129k31170k0829K27967l30430k08816
2287.5G16836319L22952j00555l30124r33991N35965K58027n50614j86767o0959L72848
2297.2G16163101l71399J43891n18113n13992o8664k02790N38101n53359n7068n40543
2306.8G14019165r38263k11410j79673K49100n36728L6163l75442l06168J95618l90549
$$ y = [717424469, 717334366, 717859726, 717782822, 717429962, 717185287, 717041626, 717537003, 717567902, 717554169, 717151031, 717000809, 717119141, 717191086, 717424164, 717297974, 717485504, 717229538, 717242279, 717324066, 717470551, 717775345, 717410812, 717512207, 717328644, 717359619, 717334290, 717088623, 717422028, 717708664, 717787704, 717302399, 717119293, 717146301, 717237625, 717048874, 717099152, 717709503, 718079910, 718300171, 717575684, 717398453, 717348404, 717448654, 717943726, 717399597, 717168427, 717147598, 717375565, 717045135, 716836319, 717159271, 717058716, 716728592, 715794601, 716330566, 716588593, 716037979, 715851212, 715790253, 716163101, 715791702, 715935593, 715417480, 714903488, 714834824, 714632034, 715170135, 714616776, 714559708, 714019165, 713080902, 712869492, 712689819, 712938919, 712402191, 712438354, 712062912, 711756744, 711952362, 711561813]
2316.4G11561813m09317m62265L5324q64639R9030J4190p67898n97763j048813j65939
2326.1G07393723p86057R29565M78058q78372n00793r15451M60510p24487m48838j6479
2335.7G04991379M2114P10602N98221p15943j881332L81012m44412l48740J36642O90003
2345.4G04159546J316910P8048J247483N45273o41251j018524o22025n98373j248627
2354.1G03218460p70187j435089k08664j59226P75299K49329j756592j05286l63998
2362.7F99444046J56784k0752J084747J204987P14188Q71658J1215N71594n5542J01471
2372.4G04084396m348Q60519R34067q2245O39267L90701O53992N58243M49142J17188
2382G08600922l89405Q2703K39181O54679K42843r689j14822l02201j39389l75595
$$ y = [711561813, 711152496, 710690231, 710725555, 709860916, 709959946, 709974136, 709206238, 708608475, 707559662, 707393723, 706607666, 707537231, 708015289, 707136917, 706636124, 705720673, 706181183, 705456696, 705007858, 704991379, 705033493, 705744095, 706342316, 705626373, 703745041, 704126053, 703681641, 703332901, 703469543, 704159546, 705476456, 705554504, 706801987, 707347260, 706706009, 705687485, 705065460, 704467087, 703218460, 702448273, 701013184, 700804520, 700645294, 701420593, 701669922, 699913330, 699808044, 699444046, 699600830, 699580078, 700664825, 701869812, 702584000, 703455658, 703466873, 704038467, 703982925, 704084396, 704080048, 704940567, 705874634, 705792389, 706431656, 706822357, 707476349, 708034592, 708483734, 708600922, 708211517, 708294220, 708533401, 709188080, 709430923, 709421234, 709306412, 709004211, 708864822, 708489227]
2391.7G08489227o5765l41187o17141l07846L65295L73001j60904k73895m58145m2496
2401.3G06960144m39453l54462j8615j30463j47705n81360J45798J38626n0812j54266
2410.9G05367432o06766m15421j19934J28174m86755l59879k63748j33743M1351m425
2420.6G03146286N79910k26898n03311o04935n53589j15356m49905k54364l94288j47323
2430.2G00476227K3041Q9187P5989n73349p05414m80423k94342l46298J15051k34604
2439.9F98145065n37414O8588L98636J46103p92923n32532n78690l31420J96075l48129
2449.5F95833359l61328l00064J57852n3711k94800l55377o65741l47824j59455k8000
2459.2F93424911l72772k34756l93677n57098k07596k09809m1885m38003m03977n45578
$$ y = [708489227, 708423462, 708082275, 707465134, 707157288, 707522583, 707895584, 707734680, 707460785, 707002640, 706960144, 706520691, 706166229, 706147614, 706017151, 705869446, 705288086, 705433884, 705572510, 705521698, 705367432, 704760666, 704345245, 704225311, 704353485, 703866730, 703506851, 703243103, 703109360, 703150711, 703146286, 703726196, 703499298, 702995987, 702391052, 701837463, 701722107, 701272202, 701017838, 700623550, 700476227, 700499268, 700588455, 700664444, 700091095, 699385681, 698905258, 698610916, 698264618, 698379669, 698145065, 697607651, 697676239, 698074875, 698220978, 697428055, 696895523, 696316833, 695985413, 696181488, 695833359, 695472031, 695171967, 695329819, 695276108, 694981308, 694625931, 693960190, 693612366, 693452911, 693424911, 693052139, 692817383, 692423706, 691866608, 691659012, 691449203, 691407318, 690969315, 690565338, 690019760]
2468.8F90019760l28674j48010m01688P019l59116j55410k76413n77774l16620j32218
2478.5F87330856j38549o65131n20325m92554r765k08130l60642K80381l26615o48117
2488.1F84241409o50863p0114k59552p29294o89087o55213o9885r6664J66702p67899
2497.7F80419540q43048J37940n86167p24945n03845k49252o93588l43781m4022p92007
2507.4F75776825k56805J95236J54953p08924p59811k53906j51367J4038k97013l89480
2517F73323746q60367m22669j82037k43759o943j65787K3575n56717m48684n60990
2526.7F69899368n47256q1787m77677l68805m81796k25372l60108l66363k70996o84662
2536.3F66034546k79541k32315k86179n37491l38668r8725p9651q6898n10483j93787
$$ y = [690019760, 689691086, 689543076, 689141388, 689148407, 688789291, 688633881, 688357468, 687779694, 687463074, 687330856, 687192307, 686527176, 686006851, 685514297, 685504532, 685296402, 684935760, 685216141, 684889526, 684241409, 683590546, 683520432, 683260880, 682531586, 681842499, 681187286, 681117401, 681020737, 681187439, 680419540, 679576492, 679714432, 679128265, 678403320, 677899475, 677650223, 676956635, 676612854, 676568832, 675776825, 675520020, 675715256, 675870209, 675161285, 674401474, 674147568, 673996201, 674010239, 673713226, 673323746, 672463379, 672040710, 671858673, 671614914, 671607971, 671442184, 671465759, 670909042, 670460358, 669899368, 669352112, 669270325, 668792648, 668423843, 667942047, 667716675, 667356567, 666990204, 666719208, 666034546, 665755005, 665522690, 665236511, 664699020, 664360352, 664261627, 664181976, 664095078, 663584595, 663390808]
2546F63390808k35138j91498m83474o52161l43475o17829l43475q4457K44216j50909
2555.6F60532608o45905m74166j38016j82266r46045m70734k11639k31858K137K7389
2565.2F57261505o10n34439o48651n20935K9449j63956o89773q21533n43976L72238
2574.9F53739319L7765l61251o08368k85645j37176p29371m15725n47104m94080j37481
2584.5F50060883K02484j00403m56619j33439m46472m92477n53055m06647o58798o51016
2594.2F46364441p7972l37220o7978Q3084j48696o90537o96640l80707m47693l60412
2603.8F43239670o01807l10745l12958l90701n42603m09317j06201o81038n87349o37016
2613.5F38659935l69301l76205m76609m09927n54123K12822k56309m19541o94961j029320
$$ y = [663390808, 663155670, 662964172, 662480698, 661828537, 661485062, 660867233, 660523758, 660439301, 660683517, 660532608, 659886703, 659412537, 659274521, 659092255, 658146210, 657675476, 657463837, 657231979, 657234116, 657261505, 657260895, 656726456, 656077805, 655556870, 655586319, 655422363, 654732590, 653911057, 653367081, 653739319, 653777084, 653415833, 652807465, 652521820, 652384644, 651655273, 651239548, 650692444, 650198364, 650060883, 650263367, 650162964, 649706345, 649572906, 649126434, 648633957, 648080902, 647674255, 647015457, 646364441, 646286469, 645949249, 645881271, 645964355, 645815659, 645125122, 644428482, 644047775, 643600082, 643239670, 642637863, 642327118, 642014160, 641623459, 641080856, 640671539, 640565338, 639884300, 639296951, 638659935, 638290634, 637914429, 637437820, 637027893, 636473770, 636686592, 636430283, 636010742, 635315781, 634286461]
2623.1F34286461p5379k23159o24085m80346r4986o98586o88744j80969k67219k04659
2632.8F30748329r18045n25169l65868m67720l17192m79050l14560o74781j58883k52418
2642.4F26274643m82025l64037p19108p94945q56819l6240j54304m04931m57000o38085
2652F21367149q8348k46162n82276q74519l69644j50223j30272j54915p52525j65673
2661.7F17852592l37104p04003m14695j37635j78795o73790k93273l03345n85213l66821
2671.3F13857918k41127l23029j05819k11792n28527j79519l15285k67372n43480o54831
2681F10487137k66457o50444o53000k93655l204l42217p1831N2948p89489p07512n69077
2691.6F06193199j83601j02043n48439p00226m51508L3379n1003n02624n22652L09067
$$ y = [634286461, 634211082, 633987923, 633363838, 632883492, 632788506, 632089920, 631401176, 631220207, 630952988, 630748329, 629830284, 629305115, 628939247, 628471527, 628154335, 627675285, 627360725, 626685944, 626527061, 626274643, 625792618, 625428581, 624709473, 623914528, 623057709, 623021469, 622867165, 622462234, 622005234, 621367149, 621278801, 621032639, 620450363, 619575844, 619206200, 619055977, 618925705, 618770790, 618018265, 617852592, 617515488, 616811485, 616396790, 616259155, 616080360, 615406570, 615113297, 614809952, 614224739, 613857918, 613616791, 613293762, 613187943, 612976151, 612447624, 612268105, 611952820, 611685448, 611141968, 610487137, 610220680, 609570236, 608917236, 608623581, 608620377, 608278160, 608206329, 608259277, 607469788, 606762276, 606193199, 606009598, 605907555, 605359116, 604658890, 604207382, 604240761, 604189758, 603687134, 603164482, 603473549]
2701.2F03473549k68288j003265o23703n22461p1869k02293q4076j44310n95475k82859
2710.9E99674950j62087l93829r42307o84967j46065r4566j81923j33285J70936L37220
2720.5E97444077J2817j070023r37309k52037k33231n47332p46994k5673J16920q1787
2730.2E93679428k85339j53656M7950m34799m68559k62947p1678k33689k51846l77312
2739.8E91187553l30925P8469k33803k71530j98288Q6899l43132r06334l74298k22893
2749.4E88471718Q1787J6136m06265l91159j52436j51824m45786l97911q1596j20354
2759.1E86422310m31404J69716j85776m87366r54o25953m69399k51083P0648L2845
2768.7E84243584n20478k83889m73481n44777n27954k87437l20740m80842k57378r9487
$$ y = [603473549, 603205261, 602201996, 601578293, 601055832, 600983963, 600781670, 600697594, 600553284, 599957809, 599674950, 599512863, 599119034, 598176727, 597491760, 597345695, 597251129, 597069206, 596935921, 597106857, 597444077, 597456894, 596386871, 595449562, 595197525, 594964294, 594416962, 593669968, 593644295, 593761215, 593679428, 593394089, 593240433, 593288383, 592853584, 592385025, 592122078, 592050400, 591816711, 591564865, 591187553, 590856628, 590935097, 590701294, 590429764, 590231476, 590318375, 589975243, 589068909, 588694611, 588471718, 588553505, 588569641, 588163376, 587772217, 587619781, 587467957, 587022171, 586624260, 586542664, 586422310, 585990906, 586160622, 585974846, 585487480, 585486526, 584860573, 584391174, 584140091, 584210739, 584243584, 583723106, 583439217, 582965736, 582420959, 581893005, 581605568, 581284828, 580803986, 580546608, 580447121]
2778.4E80447121k18239r03893m55665j95351m17061n32074n91430j77117l52173j4228
2788E76589890j05744m42772o22520o31752j74027q52813q01163n75905p67937l73535
2797.7E71241722j37024l57437o45218m53644n94329p04575r76677o71654k13203n48706
2807.3E65939255n19066m74739q5182n22881q93059p07817q73642q39424j175690p84072
2816.9E59063683p88498p16324j95427m34876m46243p57294q57391r44977j127968
2825.6E52794685r27810n94559o67877q45795p19070q93631p99065j285934j161080
2834.3E44899864q99887j200638q72421j367187j231843j208229j390380j439896k174950
2843E33114433k052383j992836j956978k017288k106781k428208k156028j118660j422921
$$ y = [580447121, 580228882, 579324989, 578869324, 578673973, 578256912, 577724838, 577133408, 576956291, 576604118, 576589890, 576484146, 576041374, 575418854, 574787102, 574613075, 573760262, 572959099, 572383194, 571615257, 571241722, 571104698, 570747261, 570102043, 569648399, 569054070, 568349495, 567372818, 566701164, 566487961, 565939255, 565420189, 564945450, 564860268, 564337387, 563444328, 562736511, 561862869, 561023445, 559847755, 559063683, 558275185, 557558861, 557363434, 556928558, 556482315, 555725021, 554867630, 553922653, 552794685, 551866875, 551272316, 550604439, 549758644, 549039574, 548145943, 547346878, 546060944, 544899864, 543999977, 542799339, 541926918, 540559731, 539327888, 538119659, 536729279, 535289383, 533114433, 531062050, 529069214, 527112236, 525094948, 522988167, 520559959, 518403931, 517285271, 515862350]
2851.7E15862350j146698n01251m65698p46536m57840O6948k54936J72538K42844o4201
2861.3E12707520k26441k87208n15137q26683r57566j499252n85556k69432p92236
2870E06748009o67496n27763q0452n14794n46264o78521j009216q39233o41289k05193
2879.6E01037788p58056p33223k06299l68156q37098j217613r65347p89910j019248
2888.3D94142838j235962q42095q99124p59087n58052j147155j157647j281318j175347
2897D85087051q94813o01845o74782r30595m39263n74455o77795p97043r38301r08699
2906.6D77649460r00994q16650j232796r98382p53823j007156j367226j361084j389236
2915.3D67822113j820641j449661j412353j276017q86802r34944p03621j46256N1079
$$ y = [515862350, 514715652, 514214401, 513748703, 513002167, 512544327, 512611275, 512356339, 512528877, 512771721, 512707520, 512481079, 512193871, 511678734, 510852051, 509894485, 508395233, 507809677, 507540245, 506748009, 506080513, 505552750, 505472298, 504957504, 504411240, 503732719, 502723503, 501884270, 501242981, 501037788, 500279732, 499546509, 499340210, 498972054, 498134956, 496917343, 495951996, 495162086, 494142838, 492906876, 492064781, 491165657, 490406570, 489848518, 488701363, 487543716, 486262398, 485087051, 484192238, 483590393, 482915611, 481985016, 481545753, 480971298, 480293503, 479496460, 478558159, 477649460, 476748466, 475931816, 474699020, 473700638, 472946815, 471939659, 470572433, 469211349, 467822113, 466001472, 464551811, 463139458, 461863441, 460976639, 460041695, 459338074, 459191818, 459242897]
2924D59242897m70352n18456k77824K33650J60752k9107K69928p4920J68533M65889
2933.6D59170990R08089R65843N71213O55479K11945J65863L43971N54733R27544J137543
2943.3D65613213Q63113N99861O83937L03116K96707R5368J16043K59208L21694O24428
2952.9D69776688L34167O07147M60968K85569K8305k59285N69534Q26759R23767N53017
2962.6D74106636J57623N09796R67713Q52089L19252K71835K07787N08041M92401Q20732
2972.2D79213905J071358N73769M71840J78184N98297O53038L18871O0043j2016L98025
2981.8D83525314J11618K80533K20223K88200K18430J00822O27098l3226l24173m0512
2991.5D84974327M18892n3368p34443j27259m7378R8152l07198o11953m09622l57934
$$ y = [459242897, 458772545, 458254089, 457976265, 458209915, 458370667, 458341560, 458611488, 458536568, 458705101, 459170990, 460079079, 461044922, 461616135, 462271614, 462483559, 462649422, 462993393, 463548126, 464475670, 465613213, 466476326, 467076187, 467760124, 468063240, 468359947, 468455315, 468571358, 468830566, 469152260, 469776688, 470110855, 470718002, 471178970, 471464539, 471492844, 471233559, 471803093, 472629852, 473553619, 474106636, 474264259, 474774055, 475741768, 476593857, 476913109, 477184944, 477392731, 477900772, 478393173, 479213905, 480285263, 480859032, 481330872, 481509056, 482107353, 482760391, 483079262, 483139305, 483127289, 483525314, 483636932, 483917465, 484137688, 484425888, 484644318, 484745140, 485372238, 485339012, 485014839, 484974327, 485393219, 485339851, 484605408, 484478149, 484430771, 484528923, 484221725, 483609772, 483200150, 482842216]
3001.1D82842216j63307m49485l57285l90320l42941l29247r01756r25293k89612j81541
3010.8D78511429n58548k40097m77638o48575m63906o28814p28874r53331o89698p99789
3020.4D72322159r87969o36634l10669l50838m42581p01103j216202n15213l05786
3029.1D66855164o68335j106759j136817j86425p40089q55599o20117q25424o91147
3037.8D60024452r80148p38907q74939j063805p06596n21812m67644n23872p13425
3046.5D53433304r19647p22618q47359q86688j033707j234894p18651m37355m55398
3055.1D46176987n66941q22410r81331o55022r19838j243629p00760l29590k20756
3063.8D39736710q41790p54776k28881l36686q40988j361847q07342r99947j155281
$$ y = [482842216, 482678909, 482229424, 481872139, 481481819, 481138878, 480809631, 479907875, 478982582, 478692970, 478511429, 477952881, 477712784, 477235146, 476586571, 476122665, 475493851, 474764977, 473811646, 473121948, 472322159, 471334190, 470697556, 470386887, 470036049, 469593468, 468892365, 467676163, 467160950, 466855164, 466186829, 465080070, 463943253, 463756828, 463016739, 462161140, 461541023, 460715599, 460024452, 459044304, 458305397, 457430458, 456366653, 455660057, 455138245, 454670601, 454146729, 453433304, 452513657, 451791039, 450943680, 450056992, 449023285, 447788391, 447069740, 446632385, 446176987, 445610046, 444787636, 443806305, 443151283, 442231445, 440987816, 440287056, 439957466, 439736710, 438894920, 438140144, 437911263, 437574577, 436733589, 435371742, 434564400, 433564453, 432409172]
3072.5D32409172o20537k25296J05896m82254o84547n69153n31464p88231r00535p54013
3082.1D26959038j006699o53381p81975r13010m95796k20489k92435p11403n86738
3090.8D21297112p91245j028748q56399n41000l33939o59981q73298o13556q5221m31556
3100.5D15082169j085434j130333o48270l91731r38835q65899l55148k34909p37572
3109.1D08694038j084861r50623p31926l56598o03447o73828o87485r15985m00123
3117.8D02289162j69449q67272j151428p95936p31507p56798q69102o09512o80695
3126.5C95657463j073189q95385p55501k55699n20173o60133p14455j178703n69191
3135.2C89035034n82619n47943p17697j008529r85299j229896n55306o30493n43060
$$ y = [432409172, 431788635, 431563339, 431669235, 431186981, 430502434, 429933281, 429401817, 428613586, 427713051, 426959038, 425952339, 425298958, 424516983, 423603973, 423108177, 422887688, 422595253, 421883850, 421297112, 420505867, 419477119, 418620720, 418079720, 417745781, 417085800, 416212502, 415598946, 415513725, 415082169, 413996735, 412866402, 412218132, 411826401, 410887566, 410021667, 409666519, 409431610, 408694038, 407609177, 406658554, 405926628, 405570030, 404966583, 404292755, 403605270, 402689285, 402289162, 402119713, 401252441, 400101013, 399305077, 398573570, 397816772, 396947670, 396338158, 395657463, 394584274, 393688889, 392933388, 392677689, 392157516, 391497383, 390782928, 389604225, 389035034, 388452415, 387904472, 387186775, 386178246, 385192947, 383963051, 383407745, 382777252, 382234192]
3143.9C82234192k29874o46400n79376q58155j042938r75647n87883o07796j155624
3152.5C75550499o85272n00717q00858o64711r25751q98513l47596p47833q80852p19146
3162.2C68379250r48754p28493o46972n14298n94825q62389q68340o41822o94085j172790
3171.8C60706482r77821p39479m30565n27192o20002l15361p51000o96258p54509p92275
3181.5C54102020n97725r11216j266404j246795m54865r6702j13602p40089j083413
3190.1C47591209q48007j203117o25267j15013m11492p32536p35703p27005p49282
3198.8C41443787n49355r62982q42171p41043o21834l92341p28951m74243o33888o94084
3208.5C34802895o62156r08546o58302l94173l47671p19033o04782q86497j017762
$$ y = [382234192, 382004318, 381357918, 380778542, 379920387, 378877449, 377901802, 377313919, 376706123, 375550499, 374865227, 374364510, 373563652, 372898941, 371973190, 371074677, 370727081, 369979248, 369098396, 368379250, 367430496, 366702003, 366055031, 365540733, 364945908, 364083519, 363215179, 362573357, 361879272, 360706482, 359728661, 358989182, 358558617, 358031425, 357411423, 357096062, 356345062, 355648804, 354894295, 354102020, 353504295, 352593079, 351326675, 350079880, 349625015, 349528313, 349414711, 348674622, 347591209, 346743202, 345540085, 344914818, 344799805, 344388313, 343655777, 342920074, 342193069, 341443787, 340894432, 339931450, 339089279, 338348236, 337726402, 337334061, 336605110, 336130867, 335496979, 334802895, 334140739, 333232193, 332573891, 332179718, 331832047, 331113014, 330508232, 329621735, 328603973]
3217.2C28603973l6888r0332o59332o74820o91719j029282j035881l83377j1596m58069
3226.8C23532677r57489p56493n91965o71463j96876K89688m10233r76429r26323q22315
3236.4C17512779m30908n13725m71459o57367q40569l59497j80149k28691o04134o96125
3246.1C12530155o81782l94554k74124p15504k11277l31859q89206n99690k01053p7210
3255.7C08153896m41608n75962k91538o33755j056805o4201L204o83365l09753m63200
3265.4C03636913l63903l28121n36804l63407k76375q9359m64020n26199l01838n03388
3275B99883499o64005p40147k59399J8425l84026k21443P1240n84336o78806j55010
3284.7B96285992j41888m94003o75297q7185K67601j02367q50258j046677k57530J71394
$$ y = [328603973, 328567085, 328476753, 327817421, 327142601, 326450882, 325421600, 324385719, 324002342, 323990746, 323532677, 322575188, 321818695, 321226730, 320555267, 320358391, 320648079, 320237846, 319261417, 318335094, 317512779, 317081871, 316568146, 316096687, 315439320, 314598751, 314239254, 314059105, 313830414, 313226280, 312530155, 311848373, 311453819, 311179695, 310464191, 310252914, 309921055, 309031849, 308432159, 308231106, 308153896, 307712288, 307136326, 306844788, 306211033, 305154228, 305090027, 305093231, 304409866, 304100113, 303636913, 303273010, 302944889, 302408085, 302044678, 301768303, 301678944, 301214924, 300688725, 300386887, 299883499, 299219494, 298479347, 298219948, 298238373, 297854347, 297632904, 297704144, 297119808, 296441002, 296285992, 296144104, 295650101, 294974804, 294887619, 295155220, 295052853, 294202595, 293155918, 292898388, 293069782]
3294.3B93069782k13928m10538j87683p26795q39996m15230l37830q4667q7089k73686
3303.9B89492340m90875N131k40021r16405k54898j81198m26540o57235l52707p2078
3313.6B85905514n51434p09572q55846k34699l41797p45011m43439m20876J60332k36282
3323.2B81526890r98173q07075o44322p77283p79228l39451l22609k62317l97187j068954
3332.9B75130291p32079M1867o75850j169758l54290n30777o42643j38264m07848o97498
3342.5B69823151m87557o65626q02002L8089J77212m31995p75814o58016n64690q71716
3352.2B64781036m42447j71414j03626j15890p45469r30328k33536M58069k36912q75911
3361.8B61383572o43654l79238l00103j57299J6518l67622j65081k24247m25072k67868
$$ y = [293069782, 292855854, 292445316, 292257633, 291530838, 290690842, 290275612, 289937782, 289853115, 289766026, 289492340, 289001465, 289006596, 288766575, 287850170, 287595272, 287414074, 286987534, 286330299, 285977592, 285905514, 285354080, 284644508, 283788662, 283553963, 283212166, 282467155, 282023716, 281602840, 281763172, 281526890, 280528717, 279721642, 279077320, 278300037, 277520809, 277181358, 276858749, 276596432, 276199245, 275130291, 274398212, 274440079, 273764229, 272594471, 272240181, 271709404, 271066761, 270928497, 270520649, 269823151, 269335594, 268669968, 267867966, 267906055, 268083267, 267651272, 266875458, 266217442, 265652752, 264781036, 264338589, 264167175, 264063549, 263947659, 263202190, 262271862, 262038326, 262496395, 262259483, 261383572, 260739918, 260360680, 260060577, 259903278, 259919796, 259552174, 259387093, 259162846, 258737774, 258469906]
3371.4B58469906q81329p74212j15261R0905l86086p30953l42388j80188L5763J41602
3381.1B55327759k59819q51155n09700M63676L12538n68733p15389k06070m1886n5446
3390.7B52895775j50299p9956k67887n28794k78396j59645J18999j4057M4136k3575
3400.4B51556301l60374p5608m41856k71854K54135L48587P1754k96097J4801k80838
3410B50518951o76632l87249N74551L06721n05104K27737J22490J8749J28155l14197
3419.7B50014172k21730N13974P42225k03914j46409K66915N39017Q67595J19019n00794
3429.3B51990070l44219M0131K30789O71883M81777k5692K19402J40915K06146K50893
3439B53862095K52495O15787N76592j98956j07860R10301J041393M71344n70660P6123
$$ y = [258469906, 257588577, 256814365, 256699104, 256790009, 256403923, 255672970, 255330582, 255150394, 255186157, 255327759, 255067940, 254216785, 253707085, 254170761, 254483299, 253914566, 253199177, 252993107, 252951221, 252895775, 252745476, 252665520, 252397633, 251868839, 251590443, 251430798, 251549797, 251535740, 251579876, 251556301, 251195927, 251120319, 250678463, 250406609, 250660744, 251009331, 251081085, 250784988, 250799789, 250518951, 249842319, 249455070, 250029621, 250336342, 249831238, 250058975, 250181465, 250200214, 250328369, 250014172, 249792442, 250306416, 251048641, 250844727, 250698318, 250965233, 251504250, 252371845, 252490864, 251990070, 251645851, 251685982, 251916771, 252588654, 253070431, 253044739, 253264141, 253405056, 253611202, 253862095, 254114590, 254730377, 255306969, 255108013, 255000153, 255910454, 256951847, 257423191, 256852531, 256928654]
3448.6B56928654Q19473N29270P76806L40481L73249M16202J17722M78649L68557L15075
3458.2B61464138P16400J170941O27555L13054M72068K22741N61275P59029P65000
3466.9B67072201L04470M37755Q88939N22003P48597N93280J59226J95694L27682P09706
3476.6B71959553Q82568O68392O44207P77951P18879R28212O95552O34652P40718M77600
3486.2B79128284O64216O67991P59354O98395O21051J052437Q41122J36166L64055
3494.9B84933071J065598J178627J313591M68025J47896J156082Q80718Q1978J52626
3503.6B91378212J079521J264649J124248R18121P70932J019935N01080R27772J109486
3512.2C00093956Q36086O32248L15056J152420J140232Q53787Q35800O53190P20997
$$ y = [256928654, 257748127, 258277397, 259054203, 259394684, 259767933, 260184135, 260301857, 260780506, 261149063, 261464138, 262180538, 263351479, 263979034, 264292088, 264764156, 264986897, 265548172, 266307201, 267072201, 267376671, 267814426, 268703365, 269225368, 269973965, 270567245, 270726471, 270922165, 271249847, 271959553, 272842121, 273510513, 274154720, 274932671, 275651550, 276579762, 277275314, 277909966, 278650684, 279128284, 279792500, 280460491, 281219845, 281918240, 282539291, 283591728, 284432850, 284569016, 284933071, 285998669, 287177296, 288490887, 288958912, 289106808, 290262890, 291143608, 291225586, 291378212, 292457733, 293722382, 294846630, 295764751, 296535683, 297555618, 298056698, 298984470, 300093956, 300930042, 301562290, 301877346, 303029766, 304169998, 305023785, 305859585, 306512775, 307233772]
3520.9C07233772J071396J431904M84772O10599J071472J453000J724109L45612K08015
3529.6C15634651J177674J411380R58157P30629Q68263J305389J217042P62710J447716
3538.3C25513611J504249J004868Q07953J325836J300163P90520P44896Q70056K144814
3547C36006966J070594P66907J486206J218834J638909J103172J779175J105041J030769
3555.6C47206573K261315Q96263R24988J547584J575661J213226J812249J488952N04265
3564.3C59431076K293625J334000J364021J205864N83076K355271J618919J903305
3572C72089157J554718J500435K026672J641198J879806J358643K061805K001725J749115
3580.7C87863274J893959J370659J610260J660537K734528J552200K77481K209282
$$ y = [307233772, 308305168, 309737072, 310221844, 310832443, 311903915, 313356915, 315081024, 315426636, 315634651, 316812325, 318223705, 319181862, 319912491, 320780754, 322086143, 323303185, 324065895, 325513611, 327017860, 328022728, 328830681, 330156517, 331456680, 332247200, 332992096, 333862152, 336006966, 337077560, 337844467, 339330673, 340549507, 342188416, 343291588, 345070763, 346175804, 347206573, 349467888, 350364151, 351289139, 352836723, 354412384, 355625610, 357437859, 358926811, 359431076, 361724701, 363058701, 364422722, 365628586, 366211662, 368566933, 370185852, 372089157, 373643875, 375144310, 377170982, 378812180, 380691986, 382050629, 384112434, 386114159, 387863274, 389757233, 391127892, 392738152, 394398689, 397133217, 398685417, 398962898, 401172180]
3588.4D01172180J404228K655831K796173K348747J648750J424523K821922R55620
3596.1D17227974K102127K953186J100884K697219K456170J778640K394028J742897
3603.9D34453125J663704K497978L499107J371155K125931J418114J016807N555153
3611.6D53601074K386246j54991L406601J333656L612557L580932K210655K782936
3619.3D72759666M11263J962280K907181K897072L003616L231125K909164K194100
3627D92275467N026169K953453m553528L732948M656067M389877K415085R30939L430138
3635.7E15256615L900184L541489K367554K255439L040963L048820K612686J907616
3643.4E37931366K742386L509407M542007J139679p63969M590683K733383K221451
$$ y = [401172180, 402576408, 405232239, 408028412, 410377159, 412025909, 413450432, 416272354, 417227974, 419330101, 422283287, 423384171, 426081390, 428537560, 430316200, 432710228, 434453125, 436116829, 438614807, 442113914, 443485069, 445611000, 447029114, 448045921, 453601074, 455987320, 455832329, 459238930, 460572586, 464185143, 467766075, 469976730, 472759666, 473170929, 475133209, 478040390, 480937462, 483941078, 487172203, 490081367, 492275467, 497301636, 500255089, 495701561, 499434509, 504090576, 508480453, 510895538, 511826477, 515256615, 519156799, 522698288, 525065842, 527321281, 530362244, 533411064, 536023750, 537931366, 540673752, 544183159, 548725166, 549864845, 549100876, 553691559, 556424942, 558646393]
3651.1E58646393J019516M148712M596748M275818N331764m116783K105866N488510
3658.8E81496544K260971K910728J965714K609978J443176J664925K889938J882439
3666.5E99124413M347763K828674N55839J380578l362961K796440O737518O587258
3674.3F20995522M4670j0357437K887229O909066L894195p39250J189117K761231K237244
3682.9F29821587J457176Q65784O01844L364754N472641n707932j152496O773224l789864
3691.6F37706718m85611M379921J312256J569062R18502K96555J433639O95267K035828
3700.3F49862137J738815m198074l66974M642868J907883K41775P04193K630997L069839
3709F60233459n570678K926254M648209q902817K820206L417282Q12225J428909K146836
$$ y = [558646393, 559665909, 563814621, 568411369, 572687187, 578018951, 573902168, 576008034, 581496544, 583757515, 586668243, 588633957, 591243935, 592687111, 594352036, 597241974, 599124413, 603472176, 606300850, 606856689, 608237267, 604874306, 607670746, 614408264, 620995522, 621040192, 610682755, 613569984, 620479050, 624373245, 623633995, 624823112, 627584343, 629821587, 631278763, 632144547, 632746391, 636111145, 641583786, 635875854, 634723358, 641496582, 637706718, 637221107, 641601028, 642913284, 644482346, 645400848, 645697403, 647131042, 647826309, 649862137, 651600952, 647402878, 647035904, 651678772, 653586655, 653828430, 654532623, 657163620, 660233459, 654662781, 657589035, 662237244, 653334427, 656154633, 659571915, 660384140, 661813049, 663959885]
3717.7F63959885Q99276k909927R20792M727859j979828l791427L450012J527710L69110
3726.3F67173462j301727m64478K514496P34787M206543j139221n741043N686340j508331
3735F70160828p087326J950912L595505J757583J865464J950454l486709J327591P588424
3743.7F79622726q657379r755172Q993682M769593L875961k140884p501984Q769531
3751.4F77976074k720413n678329M749755L356018K404557l968354J527176L849488
3759.1F81495972n178223k43301L245849J132126m48990K024079j629258l550033K705002
3767.8F79553223L880386P41501o375656J335220K659378k35596P67518J21612P60574
3776.5F83208160J51291K042923Q96759n896606J224441J949616P01370J213150j861496
$$ y = [663959885, 664859161, 661949234, 662870026, 667597885, 665618057, 661826630, 665276642, 666804352, 667173462, 665871735, 665407257, 667921753, 668656540, 672863083, 671723862, 665982819, 671669159, 670160828, 663073502, 665024414, 668619919, 670377502, 672242966, 674193420, 670706711, 672034302, 679622726, 670965347, 661210175, 670203857, 674973450, 678849411, 676708527, 669206543, 677976074, 675255661, 669577332, 674327087, 677683105, 680087662, 676119308, 677646484, 681495972, 676317749, 676074448, 679320297, 680452423, 680003433, 682027512, 680398254, 676848221, 679553223, 683433609, 684175110, 677799454, 679134674, 681794052, 681558456, 682325974, 682447586, 683208160, 683359451, 685402374, 686299133, 680402527, 681626968, 683576584, 684277954, 685491104, 683629608]
3785.2F83629608o89850P52030J075058J094894J39771K28805j64413j3581m81109
3793.8F85571213P05414L027801k216720m010621J109543K915116L574218o299896
3801.5F84376068p067337M603348L226242L755188M354401q086319m375534M130172
3809.3F84916229J861344K62375O50863K7695K62985L106995j157837q640366M320526
3817.9F85610809L823395K049790K247848j2441559p57293M791107K877273J693802
3825.7F89895172j233902k647781Q86688J269226K233124J180420o621704J980133
3833.4F86941376O101913m486389k449646M248428n446090k823944N843277j209259
3841.1F86719666M07180M485779k353973l247299K019043J668090L63388J326142j165314
$$ y = [683629608, 682939758, 683691788, 684766846, 685861740, 686001511, 686230316, 686065903, 686052322, 685571213, 686276627, 689304428, 687087708, 683077087, 684186630, 687101746, 690675964, 684376068, 677308731, 681912079, 685138321, 688893509, 693247910, 685161591, 680786057, 684916229, 686777573, 687039948, 687690811, 687718506, 687981491, 691088486, 689930649, 681290283, 685610809, 689434204, 691483994, 693731842, 681290283, 680532990, 685324097, 688201370, 689895172, 688661270, 686013489, 686900177, 688169403, 690402527, 691582947, 684961243, 686941376, 693043289, 688556900, 686107254, 690355682, 684909592, 682085648, 687928925, 686719666, 687126846, 691612625, 689258652, 686011353, 688030396, 689698486, 690061874, 691388016, 690222702]
3849.8F90222702k41470L245010k066803L970490j2274018j713867P954483o03485
3857.5F88493042j385422J809922J486053Q69675m429551Q41141N672760m110183n150605
3866.2F84096832L021622L418350L198929n418549o122207L450241M457092K921143
3873.9F93023453o074753m51813K625351l4332K018356K607575m605713m395294L916473
3882.6F88629303J379395J670532L975372r865875q85315L249817J144027L180008
3890.3F92477264n68771o288605P15409K909927o65588j81275J8997K362137K044068
3898.9F92823563o912918L736038J512527m793930L264008j595688j204987J96381
3906.7F87024994K02713J453247K32162O50406L00522P8201n22384q55637M58069Q52890
$$ y = [690222702, 689981232, 693226242, 691159439, 695129929, 682855911, 681142044, 689096527, 688493042, 687107620, 688917542, 690403595, 691273270, 686843719, 687684860, 693357620, 689247437, 684096832, 687118454, 690536804, 693735733, 688317184, 682194977, 685645218, 690102310, 693023453, 686948700, 686496887, 689122238, 689087906, 691106262, 693713837, 689108124, 684712830, 688629303, 690008698, 691679230, 695654602, 685788727, 684903412, 688153229, 689297256, 692477264, 691908493, 685619888, 686335297, 689245224, 688579636, 688398361, 688417358, 690779495, 692823563, 685910645, 689646683, 691159210, 686365280, 689629288, 688033600, 686828613, 687024994, 687227707, 688680954, 688913116, 689563522, 689864044, 689942245, 689419861, 688564224, 689022293, 689875183]
3916.3F89875183j409912j084747K982864o95648l292084J275559R13772Q33969p19299
3925F88679657j461182J183930O16226N21774n39322k52380J091003j517105r75952
3933.7F87346649J86081P7438L36533J68686J03073m09088l19901P73545P16705k538910
3943.3F86440811n40314J641541L22952J91803j633987N14145R74655j233139J442184
3952F88120651J99967r17054o0195L60488O94962k15607j78756o75888L89175J9379
3961.6F87737122j164627M72259K74658L02582N56870j85624m98047l14178K16904
3970.3F87397919P52258j5182p78962J28556j8616k05536n1956M69208P39593k13470
3980F88203812n38025l81241l6087m59213K31781P95822o5079k36359Q6975Q04520
$$ y = [689875183, 688465271, 687380524, 690363388, 689667740, 686375656, 687651215, 688564987, 689398956, 688679657, 687218475, 688402405, 689018631, 689540405, 689001083, 688748703, 689839706, 688322601, 687346649, 687532730, 687610168, 687946701, 688115387, 688218460, 687809372, 687489471, 688263016, 688979721, 686440811, 685900497, 687542038, 687864990, 688056793, 686422806, 686936951, 687911606, 686678467, 688120651, 688320618, 687403564, 687343369, 687703857, 688398819, 688183212, 688004456, 687328568, 687717743, 687737122, 686572495, 687044754, 687319412, 687621994, 688178864, 687993240, 687495193, 687181015, 687397919, 688150177, 688134995, 687356033, 687484589, 687465973, 687260437, 687208481, 687677689, 688417282, 688203812, 687665787, 687284546, 687248459, 686789246, 687021027, 687816849, 687751770, 687515411, 687602386, 688406906]
3989.6F88406906r37042q63876Q45260L91083N88455q27103r19647N04837M01535L07465
3999.2F87897873k0599
4000.2F87877274
$$ y = [688406906, 687469864, 686605988, 687451248, 687842331, 688430786, 687603683, 686684036, 687188873, 687590408, 687897873, 687877274]
##END=$$ End of the data block
