##TITLE=$$ Begin of the data block
##JCAMP-DX=5.00 $$ ACD/SpecManager v 10.08
##SPECTROMETER/DATA SYSTEM=Varian
##DATE=14 Jan 2013 09:38:26
##DATA TYPE=INFRARED SPECTRUM
##DATA CLASS=XYDATA
##ORIGIN=
##OWNER=
##NPOINTS=3735
##FIRSTX=399.26403809
##LASTX=4000.35498047
##MAXX=4000.35498047
##MINX=399.26403809
##MAXY=73.92189026
##MINY=25.04123878
##XFACTOR=1.0000000000
##YFACTOR=0.000000100000000
##FIRSTY=46.17341995
##DELTAX=0.96440572
##XUNITS=1/CM
##YUNITS=TRANSMITTANCE
##XYDATA=(X++(Y..Y))
399.3D61734200j5800400o539841o440430j2659759L997650R726868R712104k87323
$$ 461734200 445933800 439393959 432953529 420293770 424291420 434018288 443730392 443443069
407D43443069j1367416o811066L40691J562576P7019J087341N796547J502610j3150521
$$ 443443069 432075653 425264587 425605278 427167854 427244873 428332214 434128761 435631371 422480850
415.7D22480850l995933J1162758J7443542j843910j2958298o36864n211830p919769
$$ 422480850 418484917 429647675 447091217 445247307 432289009 431652145 426440315 418520546
423.4D18520546J884499P065162O289749m12292l183975l213387k220840m376145P79534
$$ 418520546 420405045 427470207 433759956 433347664 430163689 426950302 424729462 420353317 421132851
432.1D21132851L745231K005234K838860M91485J180725o77681l098259j445999M005699
$$ 421132851 424878082 426883316 429722176 430213661 431394386 430716705 427618446 426172447 430178146
440.7D30178146P01790p243500J340371M814109J661606j421318k329864l731079k026978
$$ 430178146 430879936 423636436 424976807 429790916 431452522 430031204 427701340 423970261 421943283
449.4D21943283J881218p45277O33239J15166N513840L582344m000511j045838p489090
$$ 421943283 423824501 423079224 423712463 423827629 429341469 432923813 428923302 427877464 420388374
458.1D20388374k376289J339607J792603K234077m70428R5215K587165L128167n147591
$$ 420388374 418012085 419351692 421144295 423378372 422907944 423003159 425590324 428718491 423570900
466.8D23570900l959999q70590l291741k389869j99624N560341j541595m78096o4659
$$ 423570900 419610901 418740311 415448570 413058701 412859077 418419418 416877823 416399727 416335068
475.5D16335068n40276J284104j567727K59247l642845l402519Q06694L312874K283668
$$ 416335068 415794792 417078896 415511169 415770416 412127571 408725052 409531746 412844620 415128288
484.1D15128288l089828O95801K184906r74198k766380K11868Q14095K578926M663734
$$ 415128288 412038460 412734261 414919167 413944969 411178589 411390457 412204552 414783478 419447212
492.8D19447212r48906l67622J003036k20832j749878j932984j679840k79541L105011
$$ 419447212 418498306 418130684 419133720 418912888 417163010 415230026 413550186 413270645 416375656
501.5D16375656O49338m23737k075309j453133m16260j539230M50935k243538M23889
$$ 416375656 417024994 416601257 414525948 413072815 412656555 411117325 411568260 409324722 409748611
510.2D09748611J692620n13916o18706J332474K662468l154831j739235J164322j105995
$$ 409748611 411441231 410927315 410308609 411641083 414303551 411148720 409409485 410573807 409467812
518.9D09467812k266159j559067o3172q36601K553673J960449q57506l92646j173974
$$ 409467812 407201653 405642586 405579414 404742813 407296486 409256935 408399429 408006783 406832809
527.5D06832809l042984k825622K177467J714669j470948q76045J231728J356353Q30956
$$ 406832809 403789825 400964203 403141670 404856339 403385391 402509346 403741074 405097427 405928383
536.2D05928383N74226k534599j651077K37846R78127J061706k195778k164001p3242
$$ 405928383 406502609 403968010 402316933 402554779 403532906 404594612 402398834 400234833 400161591
544.9D00161591Q7966j428298r20220J013069R22280j073380p36732J276397n94520
$$ 400161591 400249557 398821259 397901039 398914108 399836388 398763008 398026276 399302673 398708153
553.6C98708153k086640j578216p9994N14640j61972l94287o71119J092071J979523
$$ 398708153 396621513 395043297 394963303 395477943 395315971 394921684 394250565 395342636 397322159
562.3C97322159J123009j047249j397896q84438n90439J637116O54373J002159Q87757
$$ 397322159 398445168 397397919 396000023 395115585 394525146 396162262 396816635 397818794 398706551
570.9C98706551J98745m39605k412987L3035m20837j114960N67589R5978K36015K14424
$$ 398706551 398905296 398465691 396052704 396085739 395664902 394549942 395117531 395213509 395449524 395663948
580.6C95663948M06914m38690J61781J152534R71070j115799l220215p0000J352425
$$ 395663948 396070862 395632172 395793953 396946487 397917557 396801758 393581543 393511543 394863968
589.3C94863968R45320K198067J525230L60565R8992j198960o84204Q21457M09661
$$ 394863968 395809288 398007355 399532585 399893150 399992142 398793182 398108978 398930435 399340096
597.9C99340096L34014m54788j12572Q29163N74684p515j626663r55353l7346K66686
$$ 399340096 399674110 399219322 399106750 399935913 400510597 400503082 398876419 397921066 397883720 398150406
607.6C98150406j057358k006607J14365k59972L77502R43604o05202j203880j585121
$$ 398150406 397093048 395086441 395200806 394940834 395318336 396261940 395656738 394452858 392867737
616.3C92867737j330567r14802M63295J524696J609039J517449J757049k57186j357117
$$ 392867737 391537170 390622368 391085663 392610359 394219398 395736847 397493896 397236710 395879593
624.9C95879593N96886k40517M02527K236557J468010O45103J780510K506714Q54836
$$ 395879593 396476479 396235962 396638489 398875046 400343056 400988159 402768669 405275383 406130219
633.6D06130219J156044P06138l88183P12776Q70666k5635J69335K123718K103806
$$ 406130219 407286263 407992401 407604218 408316994 409187660 409162025 409331360 411455078 413558884
642.3D13558884J929016K401695J370659N52368Q9951M80194N78117J22032R13048
$$ 413558884 415487900 417889595 419260254 419812622 419902573 420382767 420960884 421082916 421995964
651D21995964J695595R03892K51580L88145J68877M70581l38707r63135k88582j62964
$$ 421995964 423691559 424595451 424847031 425235176 425404053 425874634 425535927 424572792 424284210 424121246
660.6D24121246L08609p9155K97737O67878K16484K55813l483314q826103O105384
$$ 424121246 424429855 424350700 424648437 425316315 425532799 425788612 422305298 413479195 419584579
669.3D19584579M368439K438660J496620Q56209K56309Q92067J633911J108056O14128
$$ 419584579 423953018 426391678 427888298 428744507 429000816 429892883 431526794 432634850 433248978
678D33248978K65579k97203Q67615K009429R85947J326409J534347M27513J023560
$$ 433248978 433514557 433217354 434084969 436094398 437080345 438406754 439941101 440368614 441392174
686.7D41392174J009216k22969k79694M08249J405640J940002J140099O62994M80957
$$ 441392174 442401390 442178421 441898727 442306976 443712616 445652618 446792717 447455711 447936668
695.3D47936668l891l00331p27081M97131J637497J211014J331291N84832K72865J287803
$$ 447936668 447932777 447632446 446905365 447402496 449039993 450251007 451582298 452167130 452439995 453727798
705D53727798J010476J68304m3335L03078J051788J835861J277199R75151J417008
$$ 453727798 454738274 454906578 454863243 455166321 456218109 458053970 459331169 460306320 461723328
713.7D61723328M55627N3482j0910R3308K36740J07689J379203J413002Q05283J677017
$$ 461723328 462178955 462232437 462221527 462314835 462551575 462659264 464038467 465451469 466256752 467933769
723.3D67933769J737480Q7586p92389O78444J460266P02934J28479k4643Q74558K421760
$$ 467933769 469671249 469758835 468966446 469644890 471105156 471808090 471936569 471911926 472786484 475208244
733D75208244J888199N33219R16061N26695m13246l63769L6354N90705J825295K135620
$$ 475208244 477096443 477629662 478545723 479072418 478659172 478295403 478331757 478922462 480747757 482883377
742.6D82883377M57077L30582J037292R40209L54614n98183P1221Q10966J366387K265777
$$ 482883377 483340454 483671036 484708328 485648537 486003151 485404968 485476189 486287155 487653542 489919319
752.2D89919319Q33740j12915K042504K104034M13056K28233k42577L12386J360817
$$ 489919319 490753059 490640144 492682648 494786682 495199738 495427971 495185394 495497780 496858597
760.9D96858597J776085J797638J249847R96323N11818L84788j57547q62770o38657
$$ 496858597 498634682 500432320 501682167 502678490 503190308 503575096 503417549 502554779 501916122
769.6E01916122M22669J455917J072655K46468J09787N19104J30844O5117j33286j28059
$$ 501916122 502338791 503794708 504867363 505113831 505223618 505742722 505873566 505938683 505805397 505677338
779.2E05677338N21316J2970M08135J37634P62367J461105J40572J80206k05574N66788
$$ 505677338 506198654 506211624 506619759 506757393 507519760 508980865 509121437 509301643 509096069 509662857
788.9E09662857J431694N64690n80864J10512J802101j91422n29709M10347m16298
$$ 509662857 511094551 511659241 511078377 511188889 512990990 512799568 512269859 512680206 512263908
797.6E12263908p79266j351166j517029p72476N68543K07634q75244j772042k347984
$$ 512263908 511484642 510133476 508616447 507843971 508412514 508620148 507744904 505972862 503624878
806.2E03624878j849289j469460j478385k281266j740303l25470J02883n12772j469917
$$ 503624878 501775589 500306129 498827744 496546478 494806175 494480705 494583588 494070816 492600899
814.9D92600899j374245p47948l89289q14934m38271l28445J07383J485177J109542
$$ 492600899 491226654 490478706 490089417 489274483 488836212 488507767 488615150 490100327 491209869
823.6D91209869J741448K063560J482811K080574J969414J627655J593971K636376
$$ 491209869 492951317 495014877 496497688 498578262 500547676 502175331 503769302 506405678
831.3E06405678L532600L008919K218246K623368K864227K025414J331405M25720J091957
$$ 506405678 509938278 512947197 515165443 517788811 520653038 522678452 524009857 524435577 525527534
840E25527534J068841J330528K287674J803398K150688K050934K267647J750221L71704
$$ 525527534 526596375 527926903 530214577 532017975 534168663 536219597 538487244 540237465 540609169
848.7E40609169K56042J096879J149902O57310J494980J976967K792206J578865J168785
$$ 540609169 540865211 541962090 543111992 543769302 545264282 547241249 550033455 551612320 552781105
857.4E52781105J875763Q00743J100388L19519J176338Q94089K05841K036476J563225
$$ 552781105 554656868 555457611 556557999 556877518 558053856 558947945 559153786 561190262 562753487
866E62753487N56411q28132l23677o80695j672935o54602p16210r77745j018181N8975
$$ 562753487 563309898 562481766 562158089 561477394 559804459 559149857 558433647 557455902 556437721 556496696
875.7E56496696j06811j179199j316605o82068o71425j372718p79229k20565N06935
$$ 556496696 556389885 555210686 553894081 553212013 552540588 551167870 550388641 550168076 550675011
884.4E50675011p25479o31142j13525j880570j599998j701737q37555p7209n49774
$$ 550675011 549949532 549318390 549204865 547324295 545724297 544022560 543185005 543107796 542558022
893E42558022p06788m36859J22681l64151k34375j658325j868325q84552j139831p58171
$$ 542558022 541851234 541414375 541537056 541172905 540938530 539280205 537411880 536527328 535387497 534629326
902.7E34629326o39916R24988J732178J710205J719818J385193O79817m82483N58968
$$ 534629326 533989410 534914398 536646576 538356781 540076599 541461792 542141609 541659126 542218094
911.4E42218094j48049p11593L32718j06354k7924l89480j936379k601394k098389
$$ 542218094 542070045 541358452 541691170 541584816 541556892 541167412 539231033 536629639 534531250
920E34531250k637596k580834j381874q02459j266137j848716j880837k539253k586288
$$ 534531250 531893654 529312820 527930946 527128487 525862350 524013634 522132797 519593544 517007256
928.7E17007256k580719k863999l023796j689415k91290j316872j037712k73933m98276
$$ 517007256 514426537 511562538 508538742 506849327 506558037 505241165 504203453 503929520 503431244
937.4E03431244j106491j423683j860772k907028j944961j087990m73480k56768p14874
$$ 503431244 502324753 500901070 499040298 496133270 494188309 493100319 492626839 492370071 491655197
946.1D91655197n48363j365547j612167j624489j936912j574135r86367q91151j264153
$$ 491655197 491106834 489741287 488129120 486504631 484567719 482993584 482007217 481116066 479851913
954.8D79851913j053695p55120j246604k508088k527580k389183k933845k737847k737655
$$ 479851913 478798218 478043098 476796494 474288406 471760826 469371643 466437798 463699951 460962296
963.4D60962296k104912j259270r47533n58128p45201j523743k237472k269135j847496
$$ 460962296 458857384 457598114 456650581 456092453 455347252 453823509 451586037 449316902 447469406
972.1D47469406k170830k460403j833077j973495j997223k069817l015365l272247
$$ 447469406 445298576 442838173 441005096 439031601 437034378 434964561 431949196 428676949
979.8D28676949l671418m100380l908844l427124l319473l937569l762397k522469
$$ 428676949 425005531 420905151 416996307 413569183 410249710 406312141 402549744 400027275
987.6D00027275l079262m091911l917198m096909l344421l689118l991623l017654
$$ 400027275 396948013 392856102 388938904 384841995 381497574 377808456 373816833 370799179
995.3C70799179k279663j440048j680451j417427j978187k864380l066597l104439
$$ 370799179 368519516 367079468 365399017 363981590 362003403 359139023 356072426 352967987
1003C52967987k372208j836547j358757k183953k070884j364213j720428j755447j511422
$$ 352967987 350595779 348759232 347400475 345216522 343145638 341781425 340060997 338305550 336794128
1011.7C36794128j811294k341843j665077j506195j027603j526642j895409j789322
$$ 336794128 334982834 332640991 330975914 329469719 328442116 326915474 325020065 323230743
1019.4C23230743k355194j147957j660270j619816j795559k079678j515312j613273
$$ 323230743 320875549 319727592 318067322 316447506 314651947 312572269 311056957 309443684
1027.1C09443684o32859j650829o59599m4117q32501q88157p17601M35161m20952J407318
$$ 309443684 308810825 307159996 306500397 306456280 305623779 304735622 304018021 304453182 304032230 305439548
1036.7C05439548K187272J481399J408329Q72173J352425O68869J296864P51876M44470
$$ 305439548 307626820 309108219 310516548 311388721 312741146 313410015 314706879 315458755 315903225
1045.4C15903225N28946L6239N53589p2822o68488j194877J30004p40718j470452n24387
$$ 315903225 316432171 316468410 317021999 316949177 316280689 315085812 315215816 314475098 313004646 312480259
1055.1C12480259q41770p6695o84032L59192j94760k27985J439991J268635J990566
$$ 312480259 311638489 311561794 310877762 311236954 311042194 310814209 312254200 313522835 315513401
1063.7C15513401J565056K447548J866321J088028J255188O42510P07855O94733J380348
$$ 315513401 317078457 319526005 321392326 322480354 323735542 324378052 325085907 325780640 327160988
1072.4C27160988L13415J97678K08664K37884N22500k00387N33562R96781J474075
$$ 327160988 327474403 327672081 327880745 328118629 328641129 328440742 328974304 329971085 331445160
1081.1C31445160K87208M69094L49426M14620J566276J93710J484299J195221J444664
$$ 331445160 331732368 332201462 332550888 332965508 334531784 334725494 336209793 337405014 338849678
1089.8C38849678J539993K06414R52262K9717O70357Q10661J107216J143722J091423
$$ 338849678 340389671 340596085 341548347 341578064 342248421 343059082 344166298 345310020 346401443
1098.5C46401443J469117l51792M21830Q39920N89637L85743J80358M50020N96581
$$ 346401443 347870560 347518768 347940598 348780518 349370155 349755898 349936256 350386276 350982857
1107.1C50982857J237373N02586R72939N98259j98174k31704M90074J388016N61142
$$ 350982857 352220230 352722816 353695755 354294014 354095840 353864136 354354210 355742226 356303368
1115.8C56303368J258239P34444O12335Q05779P12814R12285n71365L0174J01890j44043
$$ 356303368 357561607 358296051 358908386 359714165 360426979 361339264 360767899 360798073 360899963 360755920
1125.5C60755920O25801J743012J780281Q40378J642685J239242J177063J182976J509400
$$ 360755920 361381721 363124733 364905014 365745392 367388077 368627319 369804382 370987358 372496758
1134.1C72496758J843490J103020J448936J772843K192955J465492J416969J409340
$$ 372496758 374340248 375443268 376892204 378665047 380858002 382323494 383740463 385149803
1141.9C85149803P80754R33914M16604N76171K95678P18994J144829O42433M34227
$$ 385149803 385930557 386864471 387281075 387857246 388152924 388871918 390016747 390659180 391093407
1150.5C91093407m23889m79775p88460j74217P19528q1978m81147j32943K52572k65503
$$ 391093407 390669518 390189743 389401283 389227066 389946594 389864616 389383469 389250526 389503098 389237595
1160.2C89237595n08805n70259j62582O65970R76715J076355J480522K465973K368431
$$ 389237595 388728790 388158531 387995949 388661919 389638634 390714989 392195511 394661484 397029915
1168.9C97029915K592049K812843K871666K916908K493477K466392K383194K866249
$$ 397029915 399621964 402434807 405306473 408223381 410716858 413183250 415566444 418432693
1176.6D18432693L262139L387642L309555L351974L424874L092003K514991J943207
$$ 418432693 421694832 425082474 428392029 431744003 435168877 438260880 440775871 442719078
1184.3D42719078J860237J347809J357574J822777J750641J470032J079063Q81958
$$ 442719078 444579315 445927124 447284698 449107475 450858116 452328148 453407211 454289169
1192D54289169L78456p76977j247864q29277p15485o74552o93512n35622m81758j058998
$$ 454289169 454667625 453890648 452642784 451813507 451098022 450423470 449729958 449194336 448712578 447653580
1201.6D47653580j582642j245079q61359j112899j172257j176300n59311J08338J46293
$$ 447653580 446070938 444825859 443964500 442851601 441679344 440503044 439943733 440052071 440198364
1210.3D40198364j07994n67322m68368o95381q57201p15065p08733p9536J4038l1700
$$ 440198364 440090370 439523048 439054680 438359299 437502098 436787033 436078300 435998764 436012802 435981102
1220D35981102K35710l4790m64325o89926m83284m56200o42585q59986p86209k85263
$$ 435981102 436216812 436182022 435717697 435027771 434544487 434088287 433445702 432585716 431799507 431514244
1229.6D31514244J6747r8458p66754n84946j95961p72361l72620K27585K57187J66321
$$ 431514244 431530991 431432533 430665779 430080833 429884872 429112511 428739891 428967476 429224663 429390984
1239.3D29390984k02752k03285l14483l69683j44424j95313k16674m98238q71277j52626
$$ 429390984 429188232 428984947 428670464 428300781 428156357 427961044 427744370 427246132 426374855 426222229
1248.9D26222229K93083l39508q5640R7237m09775m08478k78778l32336j85623J81617
$$ 426222229 426515312 426175804 426090164 426187401 425777626 425369148 425090370 424758034 424572411 424754028
1258.5D24754028j58424j5564L63731M0207L25699R422k80456K93312Q16841J324997
$$ 424754028 424595604 424580040 424943771 424983978 425309677 425319099 425038643 425331955 426148796 427473793
1268.2D27473793J213951M68292O19660J291199R85145J076737P99446M88739J139335
$$ 427473793 428687744 429156036 429775696 431066895 432052040 433128777 433928223 434416962 435556297
1276.9D35556297J238098J092682J015969J302337J441460J204834J114387J180268
$$ 435556297 436794395 437887077 438903046 440205383 441646843 442851677 443966064 445146332
1284.6D45146332Q13103N61981J061401J232071J476059J634483J464310P99065M21028
$$ 445146332 445959435 446521416 447582817 448814888 450290947 451925430 453389740 454188805 454609833
1293.3D54609833N13534M29917P53898M75846J48391K98272P80296N77164Q1482K82707
$$ 454609833 455123367 455553284 456307182 456783028 456931419 457229691 458009987 458587151 458668633 458951340
1302.9D58951340M2114j10321p79305q88900o35109n41725r6016k94609j48240m36782
$$ 458951340 458993454 458883133 458103828 457214928 456579819 456038094 455942078 455647469 455499229 455062447
1312.5D55062447r29680q68988o84052l81393k80533P934L14064Q36106P67364P07054
$$ 455062447 454132767 453263779 452579727 452198334 451917801 451925735 452239799 453075905 453843269 454550323
1322.2D54550323R21593P44400N21507j31301l0518O2904L7918j9950l49503p6523
$$ 454550323 455471916 456216316 456737823 456606522 456576004 456638908 456676826 456656876 456307373 456230850
1331.8D56230850j75361n11628p27310m65355m99954n19218P2059M85611Q07648L76892
$$ 456230850 456055489 455543861 454816551 454351196 453851242 453332024 453404083 453889694 454697342 455074234
1341.5D55074234O94656P65152L80402N22270M40026N88684K70767L69797M39872J19858
$$ 455074234 455768890 456534042 456914444 457436714 457876740 458465424 458736191 459105988 459545860 459665718
1351.1D59665718k53715l09983n5427n54352l82347o49338n03464j31607m41322l20931
$$ 459665718 459412003 459102020 459046593 458492241 458109894 457460556 456957092 456825485 456384163 456063232
1360.8D56063232j79061k12708j055641M4441R0981n96772m43267r63898k78816j54076
$$ 456063232 455884171 455671463 454615822 454660263 454751244 454154472 453711205 452747307 452468491 452314415
1370.4D52314415k98882r4451j57967K01683P9231L29132j06086o24085l20969M11759
$$ 452314415 452015533 451921082 451763115 451964798 452044029 452373161 452267075 451642990 451322021 451733780
1380.1D51733780K1706m96140l93295j033135q28132r77478j099778j026153o43196
$$ 451733780 451755486 451259346 450866051 449832916 449004784 448027306 446927528 445901375 445258179
1388.7D45258179m16985q05969n60227j216316j494865k343292k342987r52263j592369
$$ 445258179 444841194 444035225 443474998 442258682 440763817 438420525 436077538 435125275 433532906
1397.4D33532906j796074k945404j621476p96661j328888j244049j980934k656288
$$ 433532906 431736832 428791428 427169952 426373291 425044403 423800354 421819420 419163132
1405.1D19163132k082749j564293j991233k033844j440010j153946o36712j054496
$$ 419163132 417080383 415516090 413524857 411491013 410051003 408897057 408260345 407205849
1412.8D07205849j357689j150398j393357j733360j650810o76232j771774l12958N45731
$$ 407205849 405848160 404697762 403304405 401571045 399920235 399244003 397472229 397159271 397705002
1421.5C97705002k35100k17705k10228O63758J61018k71759L17497j66015L71284Q53615
$$ 397705002 397469902 397252197 397041969 397705727 397866745 397594986 397912483 397746468 398117752 398971367
1431.2C98971367J473732J153107J068191J385613N04455J057167J628494J996537
$$ 398971367 400445099 401598206 402666397 404052010 404556465 405613632 407242126 409238663
1438.9D09238663J131782J346398J868553J465454K145767J427651J249008Q50639
$$ 409238663 410370445 411716843 413585396 415050850 417196617 418624268 419873276 420723915
1446.6D20723915J563645J793899J323242J524773O97746J903877J199418J477127
$$ 420723915 422287560 424081459 425404701 426929474 427627220 429531097 430730515 432207642
1454.3D32207642J579208M81300J090660J369973M290619K189788K609711J886787
$$ 432207642 433786850 434268150 435358810 436728783 441019402 443209190 445818901 447705688
1462D47705688J146241K072525J058044K807579K022896K501526K654571K195816K270890
$$ 447705688 448851929 450924454 451982498 454790077 456812973 459314499 461969070 464164886 466435776
1470.7D66435776J213569K473526L447075M335175K776642J980743K996216K394791
$$ 466435776 467649345 470122871 473569946 477905121 480681763 482662506 485658722 488053513
1478.4D88053513J970863J138687J268234K117882J460381O81533O66962Q87909l53622
$$ 488053513 490024376 491163063 492431297 494549179 496009560 496691093 497358055 498245964 497892342
1487.1D97892342o63414L10516j396256K26670M61082j78909q84399j259041j354828
$$ 497892342 497228928 497539444 496143188 496369858 496830940 496652031 495767632 494508591 493153763
1495.8D93153763m428864L9406j252327j927795N0773j013260n71365j009178l69072
$$ 493153763 488724899 488764305 487511978 485584183 485634956 484621696 484050331 483041153 482672081
1504.5D82672081n62477k968254l287697J40381N22804q94699J029396m11415p07970
$$ 482672081 482109604 479141350 475853653 475994034 476516838 475622139 476651535 476240120 475532150
1513.1D75532150j03454r30062l25431k326432p83539P88155J76849k259369j102294
$$ 475532150 475428696 474498634 474173203 471846771 471063232 471851387 472028236 469768867 468666573
1521.8D68666573J583976O74820Q84972j637917O9008M73595j34316R995k63138J00670
$$ 468666573 470250549 470925369 471810341 470172424 470241432 470715027 470580711 470590706 470327568 470428238
1531.5D70428238q46863j094704p85179J469498N80902m31976l95088n433274M76303
$$ 470428238 469581375 468486671 467701492 469170990 469751892 469319916 468924828 463491554 463967857
1540.1D63967857J355667K87819j6555J308631P56150n96657K020073K49939M1733
$$ 463967857 465323524 465611343 465594788 466903419 467659569 467062912 469082985 469332924 469374657
1548.8D69374657j029854j089363R87701J38893P09229k611733K27127P53251j626244
$$ 469374657 468344803 467255440 468243141 468382034 469091263 466479530 466706657 467459908 465833664
1557.5D65833664m825821m378128N244904K14118R68667q37670j147117j917878j569328
$$ 465833664 461007843 456629715 461874619 462088737 463057404 462219734 461072617 459154739 457585411
1566.2D57585411n41496k181893j141700o969529j185569o79016k600098k515144k987557
$$ 457585411 457043915 454862022 453720322 446750793 445565224 444886208 442286110 439770966 436783409
1574.9D36783409j191749j0007477q85773j874924l200874k943153m594841k989617
$$ 436783409 435591660 425584183 424698410 422823486 419622612 416679459 412084618 409095001
1582.6D09095001m780960k980766m238167l567429l505554m528694k753258m799652
$$ 409095001 404314041 401333275 397095108 393527679 390022125 385493431 382740173 377940521
1590.3C77940521k218971m426994l315926l530388m001732j891823m286346j667976
$$ 377940521 375721550 371294556 367978630 364448242 360446510 358554687 354268341 352600365
1598C52600365l681908k463531k977791k564888j540985l431969r10912l168487j442375
$$ 352600365 348918457 346454926 343477135 340912247 339371262 335939293 335028381 331859894 330417519
1606.7C30417519k834244j320267r96933k763138k02903k637291l68863k198886o27480
$$ 330417519 327583275 326263008 325266075 322502937 322300034 319662743 319293880 317094994 316467514
1615.4C16467514r58748m425983J690883j490993O70242j297531N73559r92508k179718
$$ 316467514 315508766 311082783 312773666 311282673 311952915 310655384 311228943 310236435 308056717
1624C08056717J316929p12052J662293j824627P56931L47958M35161Q63305n59922
$$ 308056717 309373646 308661594 310323887 308499260 309256191 309604149 310039310 310902615 310342693
1632.7C10342693J776772o33621J111469j420574K002487J191502O59599K312965O8131
$$ 310342693 312119465 311485844 312597313 311176739 313179226 314370728 315030327 317343292 317411423
1641.4C17411423K287693L20072J675301R24911o43768K714500o72607M702224J170845
$$ 317411423 319699116 320019188 321694489 322619400 321975632 324690132 324017525 328719749 329890594
1650.1C29890594K402421J106910k224312N392647J75705M403458J559372K763939
$$ 329890594 332293015 333399925 331175613 336568260 336743965 341147423 342706795 345470734
1657.8C45470734J638794K292671K110977J404991L896141J351891L450813K409782
$$ 345470734 347109528 349402199 351513176 352918167 356814308 358166199 361617012 364026794
1665.5C64026794L026162K437286J565895K545090K094917N083046K618103L935928
$$ 364026794 367052956 369490242 371056137 373601227 375696144 380779190 383397293 387333221
1673.2C87333221L193512K646790L814850L577156M365463K384873L819351K753067
$$ 387333221 390526733 393173523 396988373 400565529 404930992 407315865 411135216 413888283
1680.9D13888283M084701M218369J216125O801949K537498N431862L871117M059906
$$ 413888283 417972984 422191353 423407478 430209427 432746925 438178787 442049904 446109810
1688.6D46109810M362221L932533M547233L909302M480019L773346M283790K289582
$$ 446109810 450472031 454404564 458951797 462861099 467341118 471114464 475398254 477687836
1696.4D77687836N078239N216103M482650M691048Q41904P744064N361328L794937
$$ 477687836 482766075 487982178 492464828 497155876 497997780 505741844 511103172 514898109
1704.1E14898109L451157L581085L563385L492737M270935K945442K932015K926292
$$ 514898109 518349266 521930351 525493736 528986473 533257408 536202850 539134865 542061157
1711.8E42061157K736817L006477J410675J845932L436050K232934j877060M067955
$$ 542061157 544797974 547804451 549215126 551061058 554497108 556730042 554852982 558920937
1719.5E58920937L840255K421303J970215J196747J504631K043648K161483J392365
$$ 558920937 562761192 565182495 567152710 568349457 569854088 571897736 574059219 575451584
1727.2E75451584J114998J501846L98369J688270L248482K880745j69144k022323L964691
$$ 575451584 576566582 578068428 578466797 580155067 583403549 586284294 586115150 584092827 588057518
1735.9E88057518L701706J859016K168312N76745K45399M201851K702522J120873K464523
$$ 588057518 591759224 593618240 595786552 596363297 596608696 600810547 603513069 604633942 607098465
1744.6F07098465L134117K458458K037621K886505K382316M340973K296982J362305
$$ 607098465 610232582 612691040 614728661 617615166 619997482 624338455 626635437 627997742
1752.3F27997742M583091L264542L176727K986565O71234J991577K857743K329025
$$ 627997742 632580833 635845375 639022102 642008667 642679901 644671478 647529221 649858246
1760F49858246K533340M12598J453018L364105K064362K024307J930695J209564q82492
$$ 649858246 652391586 652804184 654257202 657621307 659685669 661709976 663640671 664850235 663967743
1768.7F63967743K024155K813263j133729o03179J457672M098587K480011L07998K085419
$$ 663967743 665991898 668805161 667671432 667068253 668525925 672624512 675104523 675412521 677497940
1777.4F77497940Q35419J141357L49808O4621J866760J851730J096802m40445R71909
$$ 677497940 678333359 679474716 679824524 679889145 681755905 683607635 684704437 684263992 685235901
1786F85235901J901550J441727O53076Q28247k67410m29306j03073Q82034L401566
$$ 685235901 687137451 688579178 689232254 690060501 689793091 689363785 689260712 690142746 693544312
1794.7F93544312J143188L04108J533432J505050L21961r24759J701431K71378J001510
$$ 693544312 694687500 694991608 696525040 698030090 698352051 697427292 699128723 699400101 700401611
1803.4G00401611J903763R85642Q74862L29132R45511O61774L07159j086807P12662
$$ 700401611 702305374 703291016 704165878 704495010 705440521 706102295 706409454 705322647 706035309
1812.1G06035309J471100Q33511J839218N42832O81457M7531O32859J013870j33820
$$ 706035309 707506409 708339920 710179138 710721970 711403427 711450958 712083817 713097687 712963867
1820.8G12963867O84509l87344O17600R02252n29251O70852J254044J254806J2665
$$ 712963867 713648376 713261032 713878632 714780884 714251633 714922485 716176529 717431335 717444000
1829.4G17444000j039657N50308J388702J66779N65491Q93249M62647M44107r0638
$$ 717444000 716404343 716954651 718343353 718510132 719075623 719968872 720431519 720875626 720784988
1838.1G20784988J107483L31498M19921j65100J44120L02352l187637K815018K345352
$$ 720784988 721892471 722223969 722643890 722478790 722622910 722925262 719737625 722552643 724897995
1846.8G24897995L88260J2588J62506N92118k74964L41034j67694O11344O80542L63083
$$ 724897995 725286255 725298843 725461349 726053467 725778503 726119537 725951843 726563187 727243729 727606812
1856.4G27606812Q36105J2512M09393L6850L15705m54331j68304L89023M1885O17676
$$ 727606812 728442917 728455429 728864822 728901672 729217377 728763046 728594742 728983765 729025650 729643326
1866.1G29643326l76892Q46863j78757k53296J157761M53262O06613j21155J21536
$$ 729643326 729266434 730113297 729934540 729681244 730839005 731292267 731898880 731777725 731899261
1874.8G31899261l1662N94483O07300J99127K83203n0583M30222o94428P6065K10877
$$ 731899261 731867599 732462082 733069382 733268509 733551712 733501129 733931351 733236923 733312988 733523865
1884.4G33523865P5836N96237K70081J361084l21884j434327K39258Q08563J22986
$$ 733523865 733599701 734195938 734466019 735827103 735505219 734070892 734310150 735118713 735241699
1893.1G35241699k82135J10092k08892Q80050M63181L78265N4779m18854m8675j00556
$$ 735241699 734959564 735069656 734860764 735740814 736203995 736582260 736637039 736218185 736169510 736068954
1902.7G36068954P51114n6381J06201L8376J3428O17828j2817K4872M0970P32116o40335
$$ 736068954 736820068 736763687 736869888 736908264 736921692 737539520 737526703 737551575 737592545 738324661 737684326
1913.3G37684326o69937J01700M71649J209412j192170K39487R09348P1335k08741
$$ 737684326 737014389 737116089 737587738 738797150 737604980 737844467 738753815 738825150 738616409
1922G38616409j050567L1433K32849J97220K594N85403J74332P1869L57361m85840
$$ 738616409 737565842 737597275 737830124 738027344 738029938 738615341 738789673 738861542 739218903 738733063
1931.7G38733063K8991n07507q8272J06049L2653P9422p3928N48553k26822L19290
$$ 738733063 738762054 738254547 738166275 738272324 738304977 738384399 738310471 738859024 738632202 738951492
1941.3G38951492o29959r49325M38690l25699J9150K44598N71976j48773o2867L26081
$$ 738951492 738321533 737372208 737810898 737485199 737504349 737748947 738320923 738172150 738109283 738435364
1951G38435364l11585k30255n2261J67999n32455Q2245L8452j15509L13568j78833
$$ 738435364 738123779 737893524 737841263 738009262 737476807 737559052 737597504 737481995 737795563 737616730
1960.6G37616730L28064j24893k30484k58942k58408j66931k91061J65329K4185L00140
$$ 737616730 737944794 737819901 737589417 737330475 737072067 736905136 736614075 736779404 736803589 737103729
1970.2G37103729J37100M73481k10572n22689J36642k96249J39236l48892p4997J60446
$$ 737103729 737240829 737714310 737503738 736981049 737117691 736821442 736960678 736611786 736536789 736697235
1979.9G36697235j10779j54571k03171M89273l24860m47082l76206J9303O2637m26941
$$ 736697235 736586456 736431885 736228714 736717987 736393127 735946045 735569839 735589142 735651779 735224838
1989.5G35224838L22342j3122R460p4539M0130l16772m10995K66189p9574j4344k91977
$$ 735224838 735547180 735534058 735543518 735468979 735509109 735192337 734781342 735047531 734967957 734953613 734661636
2000.1G34661636J81656j57776j78833J82343n28717j56632m74014O5079P2708j72195
$$ 734661636 734843292 734685516 734506683 734689026 734160309 734003677 733529663 733594742 733667450 733495255
2009.8G33495255q7967m19007K02561n9967r2392n55725n87693k25372m1885R8953
$$ 733495255 733407288 732988281 733190842 733130875 733038483 732482758 731895065 731669693 731627808 731726761
2019.4G31726761j6556N11398n56717l51409o8360l06091m1809n14527n6533n09797
$$ 731726761 731710205 732221603 731664886 731313477 731245117 730939026 730897217 730382690 730326157 729816360
2029.1G29816360j31530J46942j21613o790j96304k8458n07736j72119l16773k55737
$$ 729816360 729684830 729831772 729710159 729703369 729507065 729478607 728970871 728798752 728481979 728226242
2038.7G28226242k56348k41928J65558l63998K07596k36512k43454k29416l73992j6633
$$ 728226242 727969894 727727966 727893524 727529526 727737122 727500610 727257156 727027740 726653748 726637115
2048.4G26637115k85263M17481J2436J7166k89612l36380J50375j68609J63498n80902
$$ 726637115 726351852 726769333 726781769 726798935 726509323 726172943 726323318 726154709 726318207 725737305
2058G25737305l11356j59225K62756L75900m60968L8834l32260N1193o8054k18506
$$ 725737305 725425949 725266724 725529480 725905380 725444412 725483246 725150986 725202179 725134125 724915619
2067.6G24915619l11127m51355J93939j8844M40979k66571j24665J74637m99420l31116
$$ 724915619 724604492 724153137 724347076 724328232 724769211 724502640 724377975 724552612 724053192 723722076
2077.3G23722076m14581K16293j14975l4713p2480j67007K42081l18527q3161j71738
$$ 723722076 723307495 723523788 723408813 723374100 723301620 723134613 723376694 723058167 722975006 722803268
2086.9G22803268k84957m74625j71509r460J77917M61121o73142l32794j96762k01950
$$ 722803268 722518311 722043686 721872177 721862717 722040634 722501755 721828613 721495819 721299057 721097107
2096.6G21097107O4850Q240j51520m79813K68021N6152j57699l95508o867J85700o74820
$$ 721097107 721161957 721170197 721018677 720538864 720806885 720863037 720705338 720309830 720302963 720488663 719813843
2107.2G19813843k35977o7368J23367l39431k11106O0730l7918J90125k19574L71399
$$ 719813843 719577866 719510498 719633865 719294434 719083328 719144058 719106140 719296265 719076691 719448090
2116.8G19448090k86332l75289k41776l99170J43128m09775K50244O2485l09678k74047
$$ 719448090 719161758 718786469 718544693 718145523 718288651 717878876 718129120 718191605 717881927 717607880
2126.5G17607880k10343K6093j16349M71650l49274m62418k04620J64719P41043o0883
$$ 717607880 717397537 717423630 717307281 717778931 717429657 716967239 716762619 716927338 717668381 717607498
2136.1G17607498l11813j48850J18866m63257J51825N35584q2169p9040n15061L03879
$$ 717607498 717295685 717146835 717265701 716802444 716954269 717489853 717407684 717328644 716813583 717117462
2145.8G17117462L75443J37176m07181m47921K65655k49176J85166P8506O9580k0370
$$ 717117462 717492905 717630081 717222900 716774979 717040634 716791458 716976624 717055130 717124710 717104340
2155.4G17104340J71508J35498o07070l0594l06092K20719J88141n9052J78909k90146
$$ 717104340 717275848 717411346 716804276 716773682 716467590 716688309 716876450 716817398 716996307 716706161
2165G16706161L19596L71933K71301m84009n14755m6463J63956N33218k3727L32412
$$ 716706161 717025757 717397690 717668991 717184982 716670227 716623764 716787720 717320938 717297211 717629623
2174.7G17629623P8507K12631J44348j41525K66418j88293j7014l42712J56784L59192
$$ 717629623 717708130 717920761 718065109 717923584 718190002 718001709 717984695 717641983 717798767 718157959
2184.3G18157959q4839R9869k823K22931j02005K20795j21231j75019L85590k060J50299
$$ 718157959 718073120 718172989 718170166 718393097 718291092 718511887 718390656 718215637 718601227 718599167 718749466
2194.9G18749466J97143O1570l15247L21655J37558k44751K84119J5717L80401o86
$$ 718749466 718946609 719008179 718692932 719014587 719152145 718907394 719191513 719207230 719587631 719586945
2204.6G19586945j1826k5482k06146J9226j46866J24512Q1481M82865M6463m4098K9983
$$ 719586945 719575119 719549637 719343491 719362717 719215851 719340363 719421844 719904709 719951172 719907074 719937057
2215.2G19937057m6615L53928m00467o2790j60981l7002J95846M1581M22821J84478
$$ 719937057 719890442 720244370 719843903 719781113 719620132 719583130 719778976 719820557 720243378 720427856
2224.8G20427856N11551k13394k78854k09427k56043N35584L72696J71127m74090J52282
$$ 720427856 720939407 720726013 720447159 720237732 719981689 720517273 720889969 721061096 720587006 720739288
2234.5G20739288R3384k80533O0501l10821M9133k95486N2032K41623J76926K86255
$$ 720739288 720832672 720552139 720612640 720301819 720350952 720055466 720107498 720349121 720526047 720812302
2244.1G20812302j6022m9057m27857L58124J91498l97949l22342K4414K48489j02691
$$ 720812302 720796280 720747223 720319366 720677490 720868988 720471039 720148697 720173111 720421600 720318909
2253.8G20318909J44424l50265J34735R0942k92969J43280J03074K56958m25263K17896
$$ 720318909 720463333 720113068 720247803 720338745 720045776 720189056 720292130 720549088 720123825 720341721
2263.4G20341721K84347k79007k02942M3488O35757k56653J12153J25122k75269J8463
$$ 720341721 720626068 720347061 720144119 720187607 720823364 720566711 720678864 720803986 720528717 720547180
2273G20547180o5536K46200J9760q6822m73480j29471M2038K04162L85209k30637m7760
$$ 720547180 720481644 720727844 720747604 720660782 720187302 720057831 720099869 720304031 720689240 720458603 720410843
2283.7G20410843k42767N3253k25144J81885L54004n04684j39618m90570K95333k20260
$$ 720410843 720168076 720221329 719996185 720178070 720532074 720027390 719887772 719397202 719692535 719472275
2293.3G19472275o15158m4174k76185M74930k07596k49862l37143j12763O104l24783
$$ 719472275 718857117 718812943 718536758 719011688 718804092 718554230 718217087 718104324 718110428 717785645
2302.9G17785645J30538q81881j44882P1563k39868k29339n47486j4953m17252k01111
$$ 717785645 717916183 717034302 716889420 716960983 716721115 716491776 715944290 715929337 715512085 715310974
2312.6G15310974n54123R2545O9961l55758J09939j111450p20367k26136L79486k82058
$$ 715310974 714756851 714849396 714919357 714563599 714673538 713562088 712841721 712615585 712995071 712713013
2322.2G12713013r33686n28793p91397k11182l68499N22766o35453r78241n0201O15158
$$ 712713013 711779327 711250534 710459137 710247955 709879456 710402222 709766769 708788528 708738327 709353485
2331.9G09353485P03812j433487k28348q34656l70025O35833J58539R9716j084671
$$ 709353485 710057297 708623810 708395462 707560806 707190781 707826614 707985153 708084869 707000198
2340.6G07000198J76010p96508M07104P83692L8223Q27942N82046J839447M65851o69632
$$ 707000198 707176208 706379700 706786804 707570496 707608719 708436661 709018707 710858154 711324005 710654373
2350.2G10654373j717834k205277o48880r91287q92029j417465p73544j73035J004410
$$ 710654373 708936539 706731262 706082382 705091095 704199066 702781601 702008057 701835022 702839432
2358.9G02839432J119842n18188j69831q22448J35956N9661J240693J490936O66809
$$ 702839432 703959274 703441086 703271255 702448807 702584763 702644424 703885117 705376053 706042862
2367.6G06042862K13928r85641L67202O63605O66351K62528O50635R28116N03234Q07114
$$ 706042862 706256790 705271149 705638351 706301956 706968307 707230835 707881470 708809586 709312820 710119934
2377.2G10119934K00653N37567N00183L34168j5564l67813J19400K07367M95758P0419
$$ 710119934 710320587 710858154 711358337 711692505 711676941 711309128 711428528 711635895 712131653 712202072
2386.8G12202072o10L7994j07574o0501n31083m44259l69339o2638N494Q7204L7765
$$ 712202072 712201462 712239456 712131882 712071381 711540298 711096039 710726700 710664062 710669556 710756760 710794525
2397.4G10794525j91727j92184m36478r3689l81775j48696k6246k81143l06320o10962
$$ 710794525 710602798 710410614 709974136 709880447 709498672 709349976 709323730 709042587 708736267 708125305
2407.1G08125305J89438n1193j41983j52436m75082k64740l81699L49198L4256m71344
$$ 708125305 708314743 708263550 708121567 707969131 707494049 707229309 706847610 707196808 707231064 706759720
2416.7G06759720m41513j49384L01209J70212Q5067n07354l27683m25491n38025l19443
$$ 706759720 706318207 706168823 706470032 706640244 706725311 706217957 705890274 705464783 704926758 704607315
2426.4G04607315m96979m17556m10462M39224K28043l14865k29340l73077m68369o97174
$$ 704607315 704110336 703692780 703282318 703721542 703949585 703634720 703405380 703032303 702563934 701866760
2436G01866760k52456n4551N0660k88392l03039q1024l25012q4229k99530k56577o34536
$$ 701866760 701614304 701559753 701610413 701322021 701018982 700937958 700612946 700528717 700229187 699972610 699338074
2446.6F99338074l31650o5918m44565M9820l24020p6828j26419j26114R994q72192
$$ 699338074 699006424 698940506 698495941 698545761 698221741 698144913 698018494 697892380 697902374 697030182
2456.3F97030182o51932l61099k28272l36837j75095N1117q7662j43127l78647k93427
$$ 697030182 696378250 696017151 695788879 695452042 695276947 695328064 695240402 695097275 694718628 694425201
2465.9F94425201k57797M1733m91638o07453k21862n73426l60641l67584R8648j44272
$$ 694425201 694167404 694209137 693717499 693110046 692888184 692314758 691954117 691586533 691685181 691540909
2475.6F91540909p56378l68653j48391k38800n34592l82309m07639l74603o76498m23203
$$ 691540909 690784531 690415878 690267487 690028687 689494095 689111786 688704147 688329544 687653046 687229843
2485.2F87229843L32413l6774m11911o30722j94015n45121r55963n56030k08511K77862
$$ 687229843 687562256 687525482 687113571 686482849 686288834 685743713 684787750 684231720 684023209 684301071
2494.8F84301071r4681k86102o82526m12521k36816p15256l71094l54385j55487p35474
$$ 684301071 684206390 683920288 683237762 682825241 682588425 681873169 681502075 681147690 680992203 680256729
2504.5F80256729n34592q2092n27038j89743k15836J3580l38058o85959p04193o37360
$$ 680256729 679722137 679640045 679113007 678923264 678707428 678721008 678382950 677696991 676992798 676355438
2514.1F76355438n6228k20871m57993m77829j9455m13360o45829j31378k37579j72348
$$ 676355438 676299210 676078339 675620346 675142517 675123062 674709702 674063873 673932495 673694916 673522568
2523.8F73522568j94474R8114m74166p55158m32739l13339O2179m40445k09503m82788
$$ 673522568 673328094 673426208 672952042 672196884 671764145 671450806 671512985 671072540 670863037 670380249
2533.4F70380249r10873l17841j72272j71127l52860k41394k61535k75192l93677k28729
$$ 670380249 669469376 669151535 668979263 668808136 668455276 668213882 667952347 667677155 667283478 667054749
2543.1F67054749j53885o64902l76282j98898k62833o13556m08783k25067p11441l01666
$$ 667054749 666900864 666235962 665859680 665660782 665397949 664784393 664375610 664150543 663439102 663137436
2552.7F63137436J44653J78452j89057j94168m84390o17065q3695l93906o37054o23093
$$ 663137436 663282089 663460541 663271484 663077316 662592926 661975861 661892166 661498260 660861206 660238113
2562.4F60238113j98898o4850Q9798M0055n38941o07681o63071o6070m87214q46405
$$ 660238113 660039215 659974365 660064163 660104218 659565277 658957596 658294525 658228455 657741241 656894836
2572F56894836l12423l47519k4567j0223m5243k25753r7046l77274q44116m82407n99746
$$ 656894836 656582413 656234894 656210327 656200104 656154861 655929108 655832062 655454788 654610672 654128265 653528519
2582.6F53528519m86222l10440J61209j4495m81720l03040l25546k70005p83767o80390
$$ 653528519 653042297 652731857 652893066 652878571 652396851 652093811 651768265 651498260 650714493 650034103
2592.2F50034103m43115j88904r6054m39834k9679n4168k33002p98416r05915o54068
$$ 650034103 649590988 649402084 649306030 648866196 648836517 648782349 648549347 647750931 646845016 646190948
2601.9F46190948m21981q3771m68903m09622n15900k10418j93405j59226k07367r72137
$$ 646190948 645768967 645685196 645216293 644806671 644290771 644080353 643886948 643727722 643520355 642548218
2611.5F42548218m14276n55649n25513o58493q85925J6441L2311k22283m66614p5378
$$ 642548218 642133942 641578293 641052780 640394287 639508362 639524803 639557114 639334831 638868217 638792839
2621.2F38792839n21202o38123j9111o93207q09517p20367k77138m75426o62460o0501
$$ 638792839 638271637 637633514 637614403 636921196 636111679 635391312 635114174 634638748 633976288 633915787
2630.8F33915787j74179n89333q80203m34761o45256m26178m8142l02963j98860o55899
$$ 633915787 633741608 633152275 632272072 631837311 631192055 630765877 630717735 630414772 630215912 629560013
2640.5F29560013n67627m81644m63524l17192k67334n09338o14700k9755l96385n84107
$$ 629560013 628992386 628510742 628047218 627730026 627462692 626953354 626338654 626308899 625912514 625328407
2650.1F25328407p52945n78231l36342n18113k2392l85780n26772l60336j87073k40707
$$ 625328407 624575462 623997231 623660889 623142776 623120384 622734604 622207832 621847496 621660423 621419716
2659.8F21419716n93224m39605n51110o84280o78673P6256j72768m72679n6877o45752
$$ 621419716 620826492 620386887 619835777 619151497 618472824 618549080 618376312 617903633 617846756 617201004
2669.4F17201004m95682l57399k52990k30103j90926k32086l83491L8070m07676l55568
$$ 617201004 616705322 616347923 616094933 615864830 615673904 615441818 615058327 615096397 614688721 614333153
2679F14333153l95928m06112n04990j107674o24923m35562j51940j99051m3411N0659
$$ 614333153 613937225 613531113 613026123 611918449 611293526 610857964 610706024 610506973 610463562 610514221
2688.7F10514221n14374l82042n25817m18702m68559n46303m79507l06282O103j10359
$$ 610514221 609999847 609617805 609091988 608673286 608204727 607658424 607178917 606872635 606878738 606768379
2698.3F06768379k15721n86090p362j49384j194420r15718k22854n2300k17247L46413
$$ 606768379 606552658 605966568 605959206 605809822 604615402 603699684 603476830 603424530 603207283 603553696
2708F03553696J81312o18477q45794n50156n90668p89718p8774j51787j65329m38690
$$ 603553696 603735008 603116531 602270737 601720581 601129913 600340195 600261421 600109634 599944305 599505615
2717.6E99505615m27513K18582K5482K06910m50974p64923m57649m33693m86908o74896
$$ 599505615 599078102 599296684 599322166 599529076 599078102 598313179 597855530 597421837 596934929 596260033
2727.3E96260033r6207k7123N2262k8420l41453m65355m90379o3286N2337j94473q22792
$$ 596260033 596163826 596136703 596188965 596160545 595819092 595353737 594863358 594800072 594852409 594657936 593835144
2737.9E93835144k47040K47460j4153l05824n44624K21710l08266o67877l17459k15454
$$ 593835144 593588104 593835564 593821411 593515587 592970963 593192673 592884407 592216530 591899071 591683617
2747.5E91683617r0714k99873N0087k60315m21753l36075j36719l8109m46014l50304
$$ 591683617 591592903 591293030 591343117 591082802 590661049 590324974 590188255 590150146 589704132 589353828
2757.2E89353828l71818k22206m47006k5750J89743l01170n43594j040917j47705J79863
$$ 589353828 588982010 588759804 588312798 588287048 588476791 588175621 587632027 586591110 586443405 586623268
2766.8E86623268k11372k91596L6011N7068o57654k59285m58984l46642k48375o84204
$$ 586623268 586411896 586120300 586156311 586213379 585555725 585296440 584837456 584490814 584242439 583558235
2776.4E83558235p08923m81072K15187j21612r6283o77033q60824k89421p21016l19405
$$ 583558235 582849312 582368240 582583427 582461815 582365532 581688499 580827675 580538254 579817238 579497833
2786.1E79497833l45802j59531k56614m97437l50075m78706l11928q74748o42891n65071
$$ 579497833 579152031 578992500 578735886 578238449 577888374 577409668 577097740 576222992 575580101 575015030
2795.7E75015030o12297k61612j86424j60294q29391o83709o33506n70832p18231j090622
$$ 575015030 574402733 574141121 573954697 573794403 572965012 572281303 571647797 571076965 570358734 569268112
2805.4E69268112o52695m57687m09698p07169j76926l49083r69123q67005j110267
$$ 569268112 568615417 568157730 567748032 567040863 566863937 566514854 565545731 564678726 563568459
2814E63568459q47207r36431m20342l17917n53474l63846r68132n19829k89078j118354
$$ 563568459 562721252 561784821 561364479 561046562 560493088 560129242 559161110 558641281 558352203 557233849
2823.7E57233849j538811r76677n71137n01670o05011j365624j013489m49180o67038
$$ 557233849 555695038 554718361 554147224 553645554 553040543 551674919 550661430 550212250 549545212
2832.4E49545212j158905r15032p18689j245041j237373j469803j127357j154595j540947
$$ 549545212 548386307 547471275 546752586 545507545 544270172 542800369 541673012 540518417 538977470
2841.1E38977470j692428k074967j734542k085686k335739k118416k036705k133980
$$ 538977470 537285042 535210075 533475533 531389847 529054108 526935692 524898987 522765007
2848.8E22765007k145004j669617j224289m92782m28124l06091m87328n51300k20642
$$ 522765007 520620003 518950386 517726097 517233315 516805191 516499100 516011772 515460472 515239830
2857.4E15239830n40886K2507J74026K31247k97661q27102k61040o41327q64143j016846
$$ 515239830 514698944 514721451 514895477 515126724 514829063 514001961 513740921 513099594 512235451 511218605
2867.1E11218605o41174o20270j023445m37355n46265n89981m43382n85251p05566
$$ 511218605 510577431 509957161 508933716 508496361 507950096 507360115 506916733 506331482 505625916
2875.8E05625916p46270q67500n74608l00522q94584o53191k78053m84352j042176
$$ 505625916 504879646 504012146 503437538 503137016 502242432 501589241 501311188 500826836 499784660
2884.4D99784660j270904j007309q52585l58467p08618j068535j108666j114997q77457
$$ 499784660 498513756 497506447 496653862 496295395 495586777 494518242 493409576 492294579 491417122
2893.1D91417122o85234o65055j187095p94983r33495j209983o94390o74667m03710
$$ 491417122 490731888 490066833 488879738 488084755 487151260 485941277 485246887 484572220 484168510
2901.8D84168510n57212p12815j158294j277352r01871j134834q88672j009063j110955
$$ 484168510 483611298 482898483 481740189 480462837 479560966 478426132 477537460 476528397 475417442
2910.5D75417442r48791r62563j001281j275330j607018j719474j450005j451454j231346
$$ 475417442 474468651 473506088 472504807 471229477 469622459 467902985 466452980 465001526 463770180
2919.2D63770180j239090p97959k51998p69539k66648N0392l05786l43895p5760L3875
$$ 463770180 462531090 461733131 461481133 460711594 460444946 460495338 460189552 459845657 459769897 459803772
2928.8D59803772m6310N40733P04994N58548J72119K12670P00073L79028L78380O96907
$$ 459803772 459757462 460298195 461003189 461561737 461733856 461946526 462646599 463025627 463404007 464100914
2938.5D64100914N06630L11508P80983R99184J022491J062546N82352L66478K45056
$$ 464100914 464607544 464919052 465700035 466699219 467721710 468784256 469366608 469733086 469978142
2947.1D69978142K18429K67754M23126M39758L13530O91491P14454o0196m14123N47142
$$ 469978142 470196571 470464325 470887451 471327209 471640739 472332230 473046684 472986488 472572365 473119507
2956.8D73119507P84454K67220R7847K19001J047287R07021K41394L01476O57577M60892
$$ 473119507 473903961 474171181 474269028 474488029 475535316 476442337 476683731 476985207 477642784 478103676
2966.4D78103676K32925Q86002R31511M84352L36914N64499M98199N19905P37305L80631
$$ 478103676 478336601 479222603 480154114 480638466 480975380 481539879 482038078 482557983 483295288 483675919
2976.1D83675919N05027P16744O89125K52914K90070K76604m35601Q6823K50320j1673
$$ 483675919 484180946 484897690 485586815 485839729 486129799 486406403 485970802 486057625 486307945 486296272
2985.7D86296272L2463K76986N66444L12462K05917r6016k8267n2452m8027j24092
$$ 486296272 486328735 486605721 487172165 487484627 487690544 487594528 487566261 487513809 487465782 487341690
2995.3D87341690m60319k32621n45807l38859l25127n68008j48964l52440m46243k69928
$$ 487341690 486881371 486648750 486102943 485764084 485438957 484870949 484721985 484369545 483923302 483653374
3005D83653374j83106m15535n49469n09529m85534n90134p37877k55928l08418n49202
$$ 483653374 483470268 483054733 482505264 481995735 481510201 480920067 480182190 479926262 479617844 479068642
3014.6D79068642l05672l65601j084518j093102o26030j050453q29735n44357m05578
$$ 479068642 478762970 478397369 477312851 476219749 475593719 474543266 473713531 473169174 472763596
3023.3D72763596m65508p78541p66831r11331l48206j2207l81584j332550j227035
$$ 472763596 472298088 471519547 470752716 469841385 469493179 469480972 469099388 467766838 466539803
3032D66539803o81801j143532k59018n37910j055489o74858r29299m14886n66864j001701
$$ 466539803 465858002 464714470 464455452 463917542 462862053 462187195 461257896 460843010 460276146 459274445
3041.6D59274445j098862o17218J82762n41038j482773j025582l35655p64274r13239
$$ 459274445 458175583 457558365 457741127 457200089 455717316 454691734 454356079 453591805 452678566
3050.3D52678566q99963j027871q26873p50962o42051p75299p34978r20258q87336
$$ 452678566 451778603 450750732 449923859 449172897 448530846 447755547 447020569 446100311 445212975
3059D45212975n12162o85463n51910m22554o17828q59452q03795n33371m58183p44324
$$ 445212975 444700813 444015350 443463440 443040886 442423058 441563606 440759811 440226440 439768257 439023933
3068.6D39023933j040153p59392n79834r52301r95712j34926j20850p16552o29692
$$ 439023933 437983780 437224388 436644554 435692253 434696541 434561615 434440765 433724213 433094521
3077.3D33094521n23758n57938r11369q30994r51614j037255o46209o24543m88510
$$ 433094521 432570763 432012825 431101456 430270462 429318848 428281593 427635384 427010841 426522331
3086D26522331n66253l40348p24334r63974k85759n68848p37839p70454q23212p86018
$$ 426522331 425956078 425615730 424891396 423927422 423641663 423072815 422334976 421564522 420741310 419955292
3095.6D19955292p65839q58955p26357l4981m61235p57141m47197n88607r00307j136742
$$ 419955292 419189453 418330498 417604141 417569160 417107925 416350784 415903587 415314980 414414673 413277931
3105.3D13277931q58726l79105l41759q50486p92008o63376l77044k52533r97200r81255
$$ 413277931 412419205 412040100 411698341 410847855 410055847 409392471 409015427 408762894 407765694 406784439
3114.9D06784439p62062o18858o48499n96962q00133j327514r97963p72896k89803
$$ 406784439 406022377 405403519 404755020 404158058 403357925 402030411 401032448 400259552 399969749
3123.6C99969749l21960p89986r34791p69730l31917q89969j082000q93746m94995
$$ 399969749 399647789 398857803 397923012 397153282 396821365 395931396 394849396 393955650 393460655
3132.3C93460655m92363q69064m66728q95882q34885n24520n92804n40581j018562
$$ 393460655 392968292 392099228 391632500 390736618 389901733 389377213 388784409 388243828 387225266
3141C87225266j099854p50732m35181o99921q66966r57413p63702l69187p61871q50677
$$ 387225266 386125412 385374680 384939499 384239578 383372612 382415199 381651497 381282310 380520439 379669762
3150.6C79669762q99315o15044p53822j054497k07252k77443j135140j214485n28450
$$ 379669762 378770447 378155403 377401581 376347084 376139832 375862389 374727249 373512764 372984314
3159.3C72984314o72989j276779r04884l31841o37817j065331n31349n84106q20847
$$ 372984314 372311325 371034546 370129662 369797821 369160004 368094673 367563324 366979218 366158371
3168C66158371p51801o48269p81784j175461n47142p55043j129723n20706k44255m96902
$$ 366158371 365406570 364758301 363976517 362801056 362253914 361498871 360369148 359848442 359604187 359107285
3177.6C59107285p81899m05998p28684r44442q54798r37652m77867q51059j394196
$$ 359107285 358325386 357919388 357190704 356246262 355391464 354453812 353975945 353124886 351730690
3186.3C51730690o48727J26342m35333q63037r74579j090584p43942p46841n50042
$$ 351730690 351081963 351208305 350772972 349909935 348935356 347844772 347100830 346353989 345803947
3195C45803947n21545m67339n31387p90176p04537r21783o62613o15311n47752m72145
$$ 345803947 345282402 344815063 344283676 343493500 342788963 341867180 341204567 340589256 340041504 339569359
3204.6C39569359o82526m20189o85425p66334n78423p46269q35647o60553o62537p61948
$$ 339569359 338886833 338466644 337781219 337014885 336436462 335690193 334854546 334193993 333531456 332769508
3214.3C32769508l69148j79443m60587q37631n32417q11920j323548p80601l21465
$$ 332769508 332400360 332220917 331760330 330922699 330390282 329578362 328254814 327474213 327152748
3222.9C27152748n4817o23398p30095m16679m75655l17459o01578n35888p67098q82034
$$ 327152748 327097931 326474533 325744438 325327759 324852104 324534645 323933067 323397179 322630081 321748047
3232.6C21748047n99785k84805k66228j096172n81360l40100q57219n46894n76401
$$ 321748047 321148262 320863457 320597229 319501057 318919697 318579597 317722378 317175484 316599083
3241.3C16599083o36730l27587k71149o48022l33576j81980q31013q57525k47230q6384
$$ 316599083 315962353 315634766 315363617 314715595 314382019 314200039 313369026 312511501 312264271 312177887
3250.9C12177887n96733m64401j26095l61653p10372o95210q45470o66733K95830o2066
$$ 312177887 311581154 311116753 310990658 310629005 309918633 309223423 308377953 307711220 308007050 307944984
3260.5C07944984n09243o88438q60844j24836j98440m78363m69685n93414o77929j45474
$$ 307944984 307435741 306747303 305886459 305761623 305563183 305084820 304615135 304021721 303343792 303198318
3270.2C03198318J31588p23285m95911n2204k29149m14085o96697n50938m36154k24838
$$ 303198318 303329906 302606621 302110710 302058506 301829357 301415272 300718575 300167637 299731483 299506645
3279.8B99506645k47650m78306l13453j86749j75857j19839m66004r02137n41497o9122
$$ 299506645 299258995 298780689 298467236 298280487 298104630 297984791 297518787 296616650 296075153 296006031
3289.5B96006031J09730J68876l92875j037941m86145k58484n16300N6839m63982o69479
$$ 296006031 296115761 296284637 295891762 294853821 294367676 294109192 293592892 293649731 293185749 292516270
3299.1B92516270r9774m27818m52251j10398J98746l66936p72075p41730q38719k65979
$$ 292516270 292416496 291988678 291536427 291426029 291624775 291257839 290485764 289744034 288905315 288639336
3308.8B88639336j55220l70293m39243l5763j56689r40189q06732p08218m46148m08783
$$ 288639336 288484116 288113823 287674580 287638817 287482128 286541939 285735207 285026989 284580841 284172058
3318.4B84172058j62125K41490n10006q00762q85659p57484m0474k97642j044845q02860
$$ 284172058 284009933 284251423 283741417 282940655 282054996 281297512 281257038 280959396 279914551 279111691
3328.1B79111691m41304o24332k49424k05307n67970n20611p95059q40550l78551p0076
$$ 279111691 278670387 278046055 277796631 277591324 277023354 276502743 275707684 274867134 274488583 274418507
3337.7B74418507l56236r64088o46897l33671q90694o43101n21297p30591j07422k19002
$$ 274418507 274062271 273098183 272451286 272117615 271226921 270583820 270062523 269331932 269224510 269005508
3347.3B69005508p55271m82312j64699o10123p34119l78399n79243l94917k73075n26828
$$ 269005508 268250237 267767925 267603226 266993103 266258984 265880585 265301342 264906425 264633350 264106522
3357B64106522k95926r6931n79491p38315l8815p4177k86464l29438m76932m87232
$$ 264106522 263810596 263713665 263134174 262395859 262357044 262282867 261996403 261666965 261190033 260702801
3366.6B60702801m31500j06640m55646o09646m93278m23508j11447k68840n8213j42040
$$ 260702801 260271301 260164661 259709015 259099369 258606091 258182583 258071136 257802296 257744083 257602043
3376.3B57602043o28567n37681K0962K06852n36137o49510l07712k69966j34697J9264
$$ 257602043 256973476 256435795 256456757 256663609 256127472 255477962 255170250 254900284 254765587 254784851
3385.9B54784851j40667k97298m6559l18546m51145J46026l06949o93093L61367J25007
$$ 254784851 254644184 254346886 254300327 253981781 253530636 253676662 253369713 252676620 253037987 253162994
3395.6B53162994k39772k2316p11937n6172K30313N645J59130m79183l1013Q2931m10537
$$ 253162994 252923222 252900906 252188969 252132797 252363110 252368755 252527885 252048702 252017689 252100620 251690083
3406.2B51690083m73519j22452N20821J0071o96163n16453M24900M31290J80683L42197
$$ 251690083 251216564 251094112 251614933 251625004 250928841 250412388 250837288 251268578 251449261 251791458
3415.8B51791458m69799l98159K9240J50776J93138j84269P0782L58676L64609K56348
$$ 251791458 251321659 250923500 250952740 251103516 251296654 251112385 251183167 251541843 251906452 252162800
3425.5B52162800J10702K8973K13718K70958J74408J52321j52798J8540K28653K68001
$$ 252162800 252273502 252302475 252516193 252787151 252961559 253113880 252961082 252979622 253208275 253476276
3435.1B53476276K86026L61634L82976K65732M78630K39716L02219L4638L8127P59640
$$ 253476276 253762302 254123936 254506912 254772644 255251274 255490990 255793209 255827847 255865974 256625614
3444.7B56625614L94688N36003L04012L36170J015072P42646M02393m76818M7188R79633
$$ 256625614 257020302 257556305 257860317 258196487 259211559 259954205 260356598 259879780 259926968 260906601
3454.4B60906601L74622N63507P13940M94614O37588L42293K05746N15308N62286O62766
$$ 260906601 261281223 261844730 262558670 263053284 263690872 264033165 264238911 264754219 265316505 265979271
3464B65979271O94866N64346M61045M57535M34722J68820P94678R39254L28923O55155
$$ 265979271 266674137 267238483 267699528 268157063 268591785 268760605 269555283 270494537 270823460 271478615
3473.7B71478615Q64124P33643M78573O66160P29504K43816N80597J266995P58171
$$ 271478615 272342739 273076382 273554955 274221115 274950619 275194435 275775032 277042027 277800198
3482.3B77800198n2891P30457Q21552M98887J096267J056786Q57181P21188P10716
$$ 277800198 277747307 278477764 279299316 279798203 280894470 281951256 282808437 283529625 284240341
3491B84240341N02854N36975Q95749O91604N69191N07107Q77018Q46767M88434O10352
$$ 284240341 284743195 285280170 286175919 286867523 287436714 287943821 288820839 289667606 290156040 290766392
3500.7B90766392R67941J077480M47808P43541J220780Q75778L91312J173572J648598
$$ 290766392 291734333 292811813 293259621 294003162 295223942 296099720 296491032 297664604 299313202
3509.4B99313202M37908P41520O29444N56202R59148O65417P57523O21776Q86917J145249
$$ 299313202 299751110 300492630 301122074 301678276 302637424 303302841 304060364 304682140 305569057 306714306
3519C06714306J430092J248188Q22220P65266L38783R32808J079064J115455J172066
$$ 306714306 308144398 309392586 310214806 310980072 311318855 312251663 313330727 314446182 315618248
3527.7C15618248Q31699R18351R91230J275673J287078J209641R64088J627236J292991
$$ 315618248 316449947 317368298 318359528 319635201 320922279 322131920 323096008 324723244 326016235
3536.4C26016235J19934R74274J104126J109924Q77724J505470J893387J359101J237297
$$ 326016235 326136169 327110443 328214569 329324493 330202217 331707687 333601074 334960175 336197472
3545C36197472K90451J350631R45778J229286J737290Q05130J809959J268158J060906
$$ 336197472 336487923 337838554 338784332 340013618 341750908 342556038 344365997 345634155 346695061
3553.7C46695061R22470J534271K233353R04007J457596J662635J821060J124497R31892
$$ 346695061 347617531 349151802 351385155 352289162 353746758 355409393 357230453 358354950 359286842
3562.4C59286842R38645P63626K825470J116180J029473K014007J376991K806321K018432
$$ 359286842 360225487 360989113 363814583 364930763 365960236 367974243 369351234 372157555 374175987
3571.1C74175987J634369R60465J165390J772918K009316K323799R63669J715545J953431
$$ 374175987 375810356 376770821 377936211 379709129 381718445 384042244 385005913 386721458 388674889
3579.7C88674889J990280K098999J269722J803703J886330K557945J558762O43234
$$ 388674889 390665169 392764168 394033890 395837593 397723923 400281868 401840630 402483864
3587.5D02483864K243385P97081K351761L102264K648354K472076J961975J777268
$$ 402483864 404727249 405524330 407876091 410978355 413626709 416098785 418060760 419838028
3595.2D19838028K03438K397918L127747R32159K731095K437897J122436K501793K552567
$$ 419838028 420041466 422439384 425567131 426499290 429230385 431668282 432790718 435292511 437845078
3603.9D37845078K347030K866097L191185R65919K673454J998215L09982M998055K467842
$$ 437845078 440192108 443058205 446249390 447215309 449888763 451886978 452196960 457195015 459662857
3612.5D59662857J17035L582725J474343L545532L323021J300278K382507J417694
$$ 459662857 459779892 463362617 464836960 468382492 471705513 473005791 475388298 476805992
3620.3D76805992K314682L332214K988740K440872L362846K670822K114411N107421
$$ 476805992 479120674 482452888 485441628 487882500 491245346 493916168 496030579 501138000
3628E01138000K295304k972107L816337M925576M871635K548714Q41179K934532M006805
$$ 501138000 503433304 500461197 504277534 509203110 514074745 516623459 517464638 520399170 524405975
3636.6E24405975L390389J708450K299042L001251L004799K615242J801071K707443
$$ 524405975 527796364 529504814 531803856 534805107 537809906 540425148 542226219 544933662
3644.4E44933662L044129M113731K038613J42974N121079L326378J557464O13900L818779
$$ 544933662 547977791 552091522 554130135 554273109 559394188 562720566 564278030 564891930 568710709
3653E68710709M493599M617004N954018l611107J275444N099716K747459K809258J547356
$$ 568710709 573204308 577821312 583775330 580164223 581439667 586539383 589286842 592096100 593643456
3661.7E93643456K861824K166175J895180K193375J553917M332084K468872k56385
$$ 593643456 596505280 598671455 600566635 602760010 604313927 608646011 611114883 610858498
3669.4F10858498M90150j471062L077927O093941O563873j187439r607201L785592
$$ 610858498 611348648 609877586 612955513 619049454 625613327 624425888 614818687 618604279
3677.1F18604279P469635M561843j292228J474075K908821J775551J479454O93092
$$ 618604279 626073914 630635757 629343529 630817604 633726425 635501976 636981430 637674522
3684.9F37674522N73578L403969N300675n901490j693725P054977k816620l11279M437942
$$ 637674522 638248100 641652069 646952744 641051254 639357529 646412506 643595886 643284607 647722549
3693.5F47722549J223221J399002M08173k69165J587906J064377K408294K184143l919754
$$ 647722549 648945770 650344772 650752945 650483780 652071686 653136063 655544357 657728500 653808746
3702.2F53808746r54971M293594J997757L9292Q56094K616882L055573n671692J938553
$$ 653808746 652853775 657147369 659145126 659184418 660040512 662657394 665712967 660041275 661979828
3710.9F61979828M934997q092269L045883L442764Q32291J697082J640625Q08716k531128
$$ 661979828 666914825 658822556 661868439 665311203 666143494 667840576 669481201 670289917 667758789
3719.6F67758789Q12073M364242k316894l582840L260193J420517J78146m97513M09775
$$ 667758789 668570862 672935104 670618210 667035370 670295563 671716080 671894226 671396713 671806488
3728.3F71806488K102737P6905L721161j326828o708069N465927J645050m755325j57471
$$ 671806488 673909225 673986130 677707291 676380463 669672394 675138321 676783371 672028046 671870575
3736.9F71870575K589493K010650J291428J893921k759323J663360Q960953o209869
$$ 671870575 674460068 676470718 677762146 679656067 676896744 678560104 687521057 681311188
3744.7F81311188j3619461P235717M981156N253219O0502r301758N721206j689376
$$ 681311188 667691727 674927444 679908600 685161819 685222321 675920563 681641769 679952393
3752.4F79952393l764878M508820K813263J840210l745575J605758M123078m886017
$$ 679952393 676187515 680696335 683509598 685349808 681604233 683209991 687333069 682447052
3760.1F82447052j69678L252411Q07953o83365J863022j041489l469009K232132L881226
$$ 682447052 682277374 685529785 686337738 685654373 687517395 686475906 683006897 685239029 689120255
3768.8F89120255N11474o709442J307983L148575M66843R10339K14920P33948k26669
$$ 689120255 689631729 682922287 684230270 687378845 687845688 688756027 688970947 689704895 689478226
3777.4F89478226J426925K82822n542145J371765J696091P83386J548386j388626k66266
$$ 689478226 690905151 691187973 685645828 687017593 688713684 689497070 691045456 689656830 689390564
3786.1F89390564J044922O39267O24466N5694n53131l83453O52389l05099K57034J977844
$$ 689390564 690435486 691074753 691699219 691754913 691201782 690818329 691470718 691165619 691422653 693400497
3795.8F93400497k602920k672119J931610K892761L840866m812393p166595L023681
$$ 693400497 690797577 688125458 690057068 692949829 696790695 691978302 684811707 687835388
3803.5F87835388J602860L343353M888687o879959l588486M117890J928863M85077
$$ 687835388 689438248 692781601 697670288 690790329 687201843 691319733 693248596 693733673
3811.2F93733673J88675o97861L21808L474884j039581r481125L984833M232712K346496
$$ 693733673 693922348 693224487 693546295 697021179 695981598 686500473 690485306 694718018 697064514
3819.9F97064514J493912j2215347P62863M041748J617737K328109K98615j946640
$$ 697064514 698558426 686343079 687105942 691147690 692765427 695093536 695392151 693445511
3827.6F93445511k1210L85895J353683K09504n140915K499466N271911m202423j024780
$$ 693445511 693424301 693810196 695163879 695373383 690232468 692731934 698003845 693801422 692776642
3836.3F92776642M508056o919403k483368O979065j934127j142273M466705j912689
$$ 692776642 697284698 690365295 687881927 694860992 692926865 691784592 696251297 694338608
3844F94338608k476502K232132R26209K16751M23889j557083J199417L764801m036865
$$ 694338608 691862106 694094238 695020447 695237198 695661087 694104004 695303421 699068222 695031357
3852.7F95031357J486130q783341j246414P426529L39966n67322J674881O20956J426697
$$ 695031357 696517487 687734146 686487732 693914261 694254227 693686905 695361786 695982742 697409439
3861.3F97409439l607407n79223M308853k827454l633880K132263L439331L419876
$$ 697409439 693802032 693222809 697531662 694704208 691070328 693202591 696641922 700061798
3869.1G00061798o059112o066056L277054N155182L221130o944885m31595L246155
$$ 700061798 694002686 687936630 691213684 696368866 699589996 692645111 692213516 695459671
3876.8F95459671K65579J321564J985474n062180m174957M435348R39560R58786M779587
$$ 695459671 695725250 697046814 699032288 693970108 689795151 694230499 695170059 696128845 700908432
3885.4G00908432q169174j004029K615891L70026L082962n86014n916519J086578K755890
$$ 700908432 692739258 691735229 694351120 694721146 697804108 697218094 691301575 692388153 695144043
3894.1F95144043l13797J58081K0447J737747J626816o692276L547821K437515m575500
$$ 695144043 694830246 694988327 695008774 696746521 698373337 691681061 695228882 697666397 693090897
3902.8F93090897K598571j808548j638794M80576O60095J498871j39618M6997J09329
$$ 693090897 695689468 693880920 692242126 692722702 693382797 694881668 694742050 694789047 694898376
3911.5F94898376L40729j70975l67355Q16651M93698k297745j293640L487854m80423
$$ 694898376 695239105 695068130 694700775 695517426 696011124 693713379 692419739 695907593 695427170
3920.2F95427170l723679J207199P79877Q15048K51694j419220O51245M68903j47629
$$ 695427170 691703491 692910690 693690567 694505615 694757309 693338089 693989334 694458237 694310608
3928.8F94310608r64584j71738J470489r77020o98929J006546K37732M47922J40762
$$ 694310608 693346024 693174286 694644775 693667755 692968826 693975372 694213104 694661026 694801788
3937.5F94801788q34503m94613j87912Q19168P31964k195893m13665Q79364L79486
$$ 694801788 693967285 693472672 693284760 694103928 694835892 692639999 692226334 693105698 693485184
3946.2F93485184M75464j671067p858P07779l52554J523361K6703r79080K8915L90778
$$ 693485184 693960648 692289581 692281723 692989502 692636948 694160309 694187012 693207932 693236847 693627625
3955.8F93627625K1972n78384K93045k69547j99508O4773o77414M02756O17065l8070
$$ 693627625 693649597 693071213 693364258 693094711 692895203 692959976 692282562 692685318 693302383 693264313
3965.5F93264313K74963K05765m20685l23334J24207K59094m56924k13013O16760J15509
$$ 693264313 693539276 693745041 693324356 693001022 693125229 693384323 692927399 692714386 693331146 693446655
3975.1F93446655K22168J39618L38745m6692j038284n12466K13241M78058l12652K95410
$$ 693446655 693668823 693808441 694147186 694100494 693062210 692549744 692762985 693241043 692928391 693223801
3984.8F93223801Q39386M10232K62375n46188j32675p35322n13000L68118j40686O07605
$$ 693223801 694063187 694473419 694735794 694189606 694056931 693321609 692808609 693176727 693036041 693643646
3994.4F93643646k10953p71408P34253R10035l85514o71387
$$ 693643646 693432693 692661285 693395538 694305573 693920059 693248672
4000.2F93248672
$$ 693248672
##END=$$ End of the data block
