##TITLE=$$ Begin of the data block
##JCAMP-DX=5.00 $$ ACD/SpecManager v 10.08
##SPECTROMETER/DATA SYSTEM=Varian
##DATE=14 Jan 2013 09:28:18
##DATA TYPE=INFRARED SPECTRUM
##DATA CLASS=XYDATA
##ORIGIN=
##OWNER=
##NPOINTS=3735
##FIRSTX=399.26403809
##LASTX=4000.35498047
##MAXX=4000.35498047
##MINX=399.26403809
##MAXY=69.36598206
##MINY=18.79473114
##XFACTOR=1.0000000000
##YFACTOR=0.000000100000000
##FIRSTY=42.76969147
##DELTAX=0.96440572
##XUNITS=1/CM
##YUNITS=TRANSMITTANCE
##XYDATA=(X++(Y..Y))
399.3 427696915 413920517 402058792 411323128 419108696 407086525 390302238 385637741 389225044
407 389225044 399026031 403250656 403103905 402225304 398364754 400346184 402123070 396062508 390019455
415.7 390019455 393625984 397552452 400006523 405376511 397078247 400326729 400610886 391523552 395240517
424.3 395240517 401902122 398970375 394837456 403026886 406523514 396964569 388203201 382260437
432.1 382260437 388369637 398834839 399828987 393058472 385867882 387387428 389399300 391281624
439.8 391281624 392866211 389652977 389812698 392982216 396223297 397091064 392362862 390192490 393893547
448.4 393893547 396588745 391162682 383761444 384558907 386968613 389302406 389746056 386610336 389508820
457.1 389508820 393818588 388008385 383859444 385422897 391126289 392944260 389057579 386875114
464.8 386875114 387618980 386753922 385795670 383315048 383758850 387815857 389197159 384704628 376118774
473.5 376118774 376067543 378819313 376175156 374003830 376940384 378561440 377259369 378019600 375143356
482.2 375143356 370604858 368867264 370250320 374908447 376894073 375258675 372813454 373294830 373861542
490.9 373861542 372328491 372546043 372943077 375434532 377606049 376324654 373511391 372613907 374021149
499.6 374021149 374008484 371743813 367188492 368167305 370612640 369944382 369664536 368573990 366713371
508.2 366713371 365468369 365401802 364543304 364586143 365731468 365394478 365501099 363374214 362010651
516.9 362010651 364539032 363607635 360373573 359411697 359263153 358825417 358733444 358124924 357873077 358777084
526.6 358777084 359602928 359830475 359825668 359426651 359658661 360730324 360258408 360730782 361675186 360331039
536.2 360331039 360050011 361067772 359866714 358627167 359521942 358062477 356674919 357134819 356287193
544.9 356287193 355716705 354842987 354227638 354019165 354010887 353369064 352013664 351440277 349953728 349603767
554.5 349603767 349932556 350390816 350665550 350001450 349922333 349145241 349501839 349087601 347936363 348299370
564.2 348299370 348277473 349322472 350004158 349702988 349279938 348895035 348832397 348261642 348426247 348440552
573.8 348440552 347990303 348138542 348251343 347300835 346086617 345889969 346396408 347158470 347851334 347813835
583.5 347813835 346805077 347693291 348429451 347168579 348117332 349336700 349562759 350464821 350695038
592.1 350695038 350953522 352169189 353076782 352629471 351570625 350757599 350431137 350962791 351396255
600.8 351396255 350879631 351133423 352231636 352179146 350693283 349248619 349979706 351011009 350296631
609.5 350296631 349946747 349391174 348095665 347752571 347378731 346424789 346383247 346415215 346309967 346823387
619.2 346823387 346494789 345739250 346193199 347469788 348118668 348144455 347837486 348798180 351285973 352534714
628.8 352534714 353558846 354323654 354463387 355861015 357994804 359708939 360858841 362166519 363127975
637.5 363127975 363997116 365390091 366657753 367266541 367349091 367681580 368383675 370261154 372736282
646.2 372736282 374691734 375658455 375425262 375336723 375360565 375775795 376421356 376708679 378125648 380140953
655.8 380140953 380988274 380145226 378936272 378329315 378002434 378482437 378187332 377186813 377430534
664.5 377430534 378390884 379798660 379363747 375312691 378553658 379980431 380123482 379972191 380470161
673.2 380470161 381944466 382892189 384019012 385151176 386536827 388095474 388713112 390195236 391846428
681.8 391846428 392451591 393519287 394548836 395317802 396531868 397423439 398364525 399185753 400037384
690.5 400037384 401678391 402539253 402939110 402828560 402385063 403244743 404689636 405513382 405080223
699.2 405080223 405733299 407971268 409110680 409374390 409171944 408777504 409263535 410581970 411574097
707.9 411574097 412382545 413661499 414602394 414903526 415292511 416015167 416360054 416786346 417342491 418156357
717.5 418156357 419878349 421001625 421065788 420582390 420288353 420982018 422012138 422953682 424667130
726.2 424667130 427139091 428360901 428564987 429747391 430655632 430134850 430468216 432220840 433527451
734.9 433527451 433550339 433701630 435149727 436369781 437337265 437609215 437203674 437754402 438852615
743.6 438852615 440209122 440655136 440481949 440681648 441474838 442308807 442202454 443159866 444980698
752.2 444980698 445982895 446246338 446745491 447441788 448379288 450071449 450826035 451262741 451928787
760.9 451928787 453347092 455389404 456851692 458183479 458760719 459613724 459960365 459558258 459125862
769.6 459125862 458789253 459792595 460512810 460744324 460688896 460781746 460618553 459581680 459516373 460529709
779.2 460529709 461522369 461426239 462064896 463306808 463561172 463476334 463610001 464197655 464265251 464685707
788.9 464685707 465457191 466707573 467177162 466679726 467172050 466888275 467059860 467093277 465521889 463343773
798.5 463343773 462673531 463358231 462759209 462212296 460172653 458288612 457803535 456079407 453968582
807.2 453968582 451933022 451126709 449932823 448367920 447168007 444983215 442895851 441402740 440953331
815.9 440953331 440173302 438485336 437799339 438371315 438678246 438745918 439413643 440603867 443347321
824.6 443347321 446122818 448207474 450390701 452960396 456080704 458686562 461993103 465092773
832.3 465092773 467739754 470645638 473864861 476774673 478480911 481021004 482503281 483596992
840 483596992 485522232 487136803 488755875 490311890 492668228 494917870 496754112 497420807 498836975
848.7 498836975 500662880 501061935 501975937 502547874 504400406 506601295 507891731 508448639 508762589
857.4 508762589 510725517 512289162 513255119 513726845 514729691 516113701 517189903 517695770 516339073
866 516339073 515045586 514455299 514230461 513033600 511570168 509699554 507278366 505749550 504252510
874.7 504252510 503166656 502005463 501959076 501730957 500614967 499522362 498551292 498836517 497283287
883.4 497283287 496595459 496831017 495222206 494274597 493951683 494309654 494098892 493552017 493439026 493865929
893 493865929 493592796 492945786 493999863 494337959 494823074 495822678 496235466 495810852 495273857 495369568
902.7 495369568 495565796 497532845 499549294 501819801 504614792 506881790 509005775 510584602 512263603
911.4 512263603 511938400 510835342 509674644 508514290 507756538 506694298 505940399 503566704 501087532
920 501087532 498639336 495457802 491671524 487680931 484869576 481982346 479159927 475624046 472782669
928.7 472782669 470772209 467374725 464181862 461856880 459728279 457368317 455564804 454311752
936.4 454311752 454192200 454292030 453166161 452192879 450643654 448926811 447212944 446092262 445681725
945.1 445681725 444872322 444622688 444384232 444691658 445380630 445907784 445841141 444917908 444218292 442909546
954.8 442909546 441864586 440852699 439131851 437071571 434997597 433349571 430998383 428351097
962.5 428351097 425959778 424455528 423836060 422530746 420515671 418081322 415596924 413910255 412221565
971.2 412221565 409524269 406973267 404306450 401160469 398132629 395053940 391867905 387894707
978.9 387894707 383753967 379605446 374668579 369307442 364054184 359481010 354928513 349729004
986.6 349729004 344769096 339709358 334775124 330659027 326739502 323386192 319991970 316620293
994.3 316620293 312947979 309073105 305874767 302623100 299656944 296349869 293152294 290245380
1002 290245380 287862263 285920258 283443947 281015835 278062859 276239052 275262356 274098587 272166805
1010.7 272166805 269631310 268271294 266071301 263485813 261438751 260155449 258524227 255830364
1018.4 255830364 253320961 250798607 249017277 246342258 244098606 242571030 240450096 238454151
1026.1 238454151 236956577 236821613 235696659 234378338 232886238 232126713 231897717 230592632 230655575
1034.8 230655575 231038380 232112751 233161659 235353050 237429142 237694454 239336433 240823002 241855965
1043.5 241855965 241918278 242287216 243152180 243659191 243495903 241796322 241236019 240505829 239740849 238428383
1053.1 238428383 237183723 236862469 235397301 234508495 233785839 234059029 234107742 234584751 236410046
1061.8 236410046 238454685 240555058 241602688 244357357 246249123 247045441 248193398 249313965
1069.5 249313965 250686150 250458317 250627937 251043396 251906700 252284164 252221279 253065224 253831463 254979610
1079.2 254979610 254952335 255236244 256368103 258254719 259820843 260401878 261556263 262737885 264795971
1087.9 264795971 266019821 267380371 268943043 270283413 272316132 273636837 275263824 276651001
1095.6 276651001 278396759 279620056 280794544 282700348 283849220 285330162 286827831 288710175
1103.3 288710175 290208836 291873970 293461399 294859066 296700592 297473736 298496971 299193115 300094261
1112 300094261 300788822 301170712 302439327 303225441 304154854 304267788 304243622 304405651 304417953 304461155
1121.6 304461155 303968735 303820477 303807678 305362835 307186527 308401337 309509335 310723686 312959270
1130.3 312959270 314748306 316759052 318312836 320077896 323015289 325820503 328654213 331293335
1138 331293335 333623924 335230980 336639328 337812691 339147339 340501709 341301689 342318153 342728920
1146.7 342728920 343150635 343909912 344460678 344906616 345227089 345204849 344884071 345087738 344735985 344124794
1156.3 344124794 343766632 343180618 342724342 341871300 341052475 340313911 340366058 341512108 342617569
1165 342617569 343566513 345215454 348009224 350686302 353268318 355467491 357777786 360979233 364374313
1173.7 364374313 367445030 369958763 372837906 376027298 378585472 380812836 383177185 384992752
1181.4 384992752 386839142 389120102 391072083 392391014 393425331 394504585 395228920 395831757 395868950
1190.1 395868950 396303024 397267761 397134056 396194458 394839058 393674393 392783203 391955605 390646744
1198.8 390646744 389018555 388027992 387069664 385779228 384566765 383345718 381987076 380917244 380066948
1207.4 380066948 379318848 378373718 377463684 377373123 377139740 376821060 376540337 376031075 375913010 375550385
1217.1 375550385 375261307 375107346 374869766 374760857 374317513 373796806 373260422 372803040 372064056 371194611
1226.7 371194611 370820847 370366859 369300041 367826843 366977158 366552505 365820465 365081291 364659081
1235.4 364659081 364388885 363930664 363620834 363076630 362616425 362603035 362292099 361797562 361168060 360689659
1245 360689659 360254936 360166245 360077515 359294853 358889847 358608246 358201866 357566223 357043800 357022629
1254.7 357022629 356698189 356289368 356042290 356243629 356374092 356649132 357068901 356960716 357199669 357584343
1264.3 357584343 358030968 358227768 358611832 359433403 360221405 361097832 361505585 362358665 363290939 363966713
1274 363966713 364947586 366138000 367685928 369039154 370203629 371129723 371968307 372813339 373840408
1282.7 373840408 375174065 376660576 378319817 379896355 381559677 383053894 384180069 385003014
1290.4 385003014 385995865 386729889 387301979 387898369 388375053 389429703 390053940 390831833 391613121
1299 391613121 391975365 392465134 392354507 392216263 391928940 392009697 392288704 392439079 392554207 391898689
1308.7 391898689 391417847 390776520 389776688 389016380 388722916 388459244 387918625 387916756 388191223 388758698
1318.3 388758698 389488754 389989815 390606728 391545906 392611618 393579025 394405785 394725952 395176697
1327 395176697 395749969 396312408 396138344 395494156 395349159 394808235 394144630 393515968 393553429 393675537
1336.7 393675537 393475761 394015236 394121094 394202118 394433136 395167770 395932503 396334457 397264633 397840767
1346.3 397840767 398556175 399211617 399591064 399734497 399771423 399368744 398578568 398693275 398626633 398319817
1355.9 398319817 397761002 397408752 397232018 396874046 396718292 395701370 395177917 394597664 394352951
1364.6 394352951 394513283 393993759 393624191 392885017 392091217 391390686 390971756 390811195 390795937 391320877
1374.3 391320877 390888023 390194092 390034790 390466003 389962196 389315071 388835297 387580681 386454010
1382.9 386454010 384813843 383431587 382303658 381125412 379672050 378094635 376675034 374632568
1390.7 374632568 372946625 371170235 369414940 366828766 363568306 361998978 360258446 358735924
1398.4 358735924 356336517 353414917 351344032 349102821 346870842 344782600 342693863 340582657
1406.1 340582657 338870811 337056389 335217743 333924561 332126694 330333633 328879547 327947731
1413.8 327947731 327364845 326177673 325419998 324837189 324639931 323151932 322681923 323594551 323689499
1422.5 323689499 324531937 324896049 325449333 326285973 326758995 328053970 329013023 330225792 330985451
1431.2 330985451 332648468 334425316 335831146 337833900 339321327 341203880 342417793 345012856
1438.9 345012856 346795959 347923431 349674034 351019707 352993889 354228477 355880051 357245712
1446.6 357245712 358710861 360017014 360830612 362866783 364114189 365694618 366693535 367969055 369412231
1455.3 369412231 370507927 372753181 373175774 376378059 377384911 379295273 381193771 382397003
1463 382397003 384607735 385888100 388419838 390121841 392152939 394397545 396962624 400170670 402735901
1471.7 402735901 406694679 409338722 412399559 415542831 418491516 420742836 422977448 425172577
1479.4 425172577 427037392 429735260 431877060 433717651 435511780 437048950 438995171 440547638
1487.1 440547638 441582832 442950401 442907448 442488708 443348312 443589401 443114128 442769585 442570152
1495.8 442570152 439001427 438512840 437595825 434479980 433725700 432577286 430845795 429380150 429864540
1504.5 429864540 430449524 427147484 423374825 423848076 425702209 425095444 425256615 424539871 422783241
1513.1 422783241 422622986 422207794 422366905 421652794 419029808 419203033 420632668 419766159 417163124
1521.8 417163124 417752762 418373489 420144844 420470428 420340614 421068459 421617088 421855316 422324867
1530.5 422324867 423313789 423906593 424614487 423699150 424904289 425890999 426005936 427352409 426477661
1539.2 426477661 424773293 425860596 428056641 428899841 429559555 430580521 429176064 429931793 430184441
1547.9 430184441 430741577 430950813 430433960 431292877 431580620 432426376 430308189 430058403 431487045
1556.5 431487045 433237953 432800026 423524742 424496307 424391174 425000114 423812256 422614021 419699211
1565.2 419699211 416387177 415142365 413032494 412290115 404955482 402262878 400023766 396449966
1572.9 396449966 393774567 390526695 388987579 377661057 375425911 372085419 367715874 363783226
1580.6 363783226 358210030 354323845 348364792 344642601 339244576 334888878 330757217 325385818
1588.4 325385818 321824722 315623741 312401905 307045650 303345051 299245186 294355011 291622200
1596.1 291622200 286745434 284732685 279950085 277271080 273698235 270206318 267763729 263308125
1603.8 263308125 262508278 259575443 258748608 255235386 253054256 251984825 249312992 249431458 246985435
1612.5 246985435 247175732 245241795 245392857 245007648 240128689 242235184 240974865 242046757 240656948
1621.1 240656948 241997681 242842350 241543331 242607784 241774750 244024906 243325539 244497757 244869251
1629.8 244869251 245774708 247159767 247225571 249592342 249137440 251792355 251973305 254861183 256612720
1638.5 256612720 257694817 260213432 260827656 263884335 264474659 266567059 268511143 268514061 270588188
1647.2 270588188 269888058 273335323 273943443 276585140 277926559 276429710 280688934 280043297 283139114
1655.9 283139114 283608265 285493431 286048565 287515373 289560661 291451778 295090771 295261211 298622456
1664.5 298622456 300689850 303434467 306129189 308920784 313691406 315167274 319652157 321701584
1672.3 321701584 325483742 328991051 332800522 336339989 338925858 343862190 347304497 352247086
1680 352247086 355694389 359839706 364883804 368653603 375879478 376432953 382211990 386745682 391214638
1688.6 391214638 396317940 400863876 405969810 410377960 415417900 419854317 424856262 428955536
1696.4 428955536 435110855 441265106 445851936 448693466 451234169 458459663 463377876 467556992
1704.1 467556992 471136703 474981651 479208641 482461014 486458588 489289436 491821175 494600639
1711.8 494600639 497320786 500526276 502225227 503931198 507849960 511174202 508114128 510137329
1719.5 510137329 513477135 515680885 517467918 519046707 520519714 522167473 523962250 525503044
1727.2 525503044 527204628 529363785 529846954 530101051 533259125 536828995 536864700 534367867 537637291
1735.9 537637291 541377678 543340874 546115837 547792473 546905823 550514717 553599739 555354691
1743.6 555354691 558027115 561726685 565038185 567427444 570517807 572249031 576049690 578786430
1751.3 578786430 580609779 585373344 588939819 592235222 595289078 596387787 598485794 601100845
1759 601100845 603670959 607428246 608402481 608578606 611718102 613788376 615376167 617423286 619657631
1767.7 619657631 618717308 620695076 625184326 626374474 625699005 624408760 627716980 630211411 629789886
1776.4 629789886 631367912 632327805 634162445 635300789 635364227 636461487 638059807 639816666 639634399
1785.1 639634399 639871063 641200180 642403183 643253021 644958496 646220627 647401886 646854782 645534286
1793.8 645534286 648501816 649667130 649776917 650970230 652410202 653592072 653056870 654677505 654881744
1802.4 654881744 655373611 656768951 657386322 658367920 658895569 659638214 660592422 662126999 661678009
1811.1 661678009 661868210 662787094 662928467 664247437 664904175 666293564 666548080 666557312 667527771 667711945
1820.8 667711945 668194962 668082886 669741135 671014557 669248352 669317322 671071472 672866211 673106308
1829.4 673106308 671120453 671303482 673238220 673371124 673723297 674749451 675360260 675905533 675328140
1838.1 675328140 675956192 676077576 676768417 677502747 678625031 680253677 676656036 677965012 679887543
1846.8 679887543 680011597 679277039 679251938 680430832 680983582 681867676 681568909 681967621 682441788 682564926
1856.4 682564926 683222885 682888870 683150024 683052139 683489380 683608322 684094391 684983368 685081024 685744400
1866.1 685744400 685409393 686297989 685667801 684165192 685401917 686358414 686778870 686713562 687263031
1874.8 687263031 686912079 686731262 687051163 687484741 687926941 687643051 687900009 687657318 688426895 688574600
1884.4 688574600 688427277 688920898 688417053 689432220 689734268 688859558 689128647 689921188 690198441
1893.1 690198441 690030289 689642487 688723297 689652939 690009460 689969559 690375900 690710144 691136551 690787659
1902.7 690787659 690925217 690709381 690799332 691028061 691113815 691315155 691467285 691788940 691607513 692322159
1912.4 692322159 692119064 692187119 692208557 691804657 692860260 691761475 691464233 692109756 692463913 693066635
1922 693066635 692705917 692208405 692037659 692604218 692651215 692837067 692648163 692449875 692875061 692635574
1931.7 692635574 692586365 692082062 692468109 692647018 692507248 692688065 692453766 692748871 692529068 693527603
1941.3 693527603 693659821 691750946 691635056 691842499 691960220 691914139 692299271 692266312 692107620 691992569
1951 691992569 692094574 692303314 691852875 691761856 691282730 691319809 691313553 691228943 691357040 691105881 691256409
1961.6 691256409 691019135 691578369 691602631 691042862 690938339 690694504 690885696 690633240 690764923 690824127
1971.2 690824127 690977173 690872726 690524750 690741577 690666580 690797653 690472870 690519333 690270920 689970779
1980.8 689970779 690231323 689839783 689972000 690025711 690253220 690016479 689875336 690033417 689219284 689380569
1990.5 689380569 689755325 689582672 689223709 689234238 689076843 688816605 689191360 689233856 689049530 688438492
2000.1 688438492 688338089 688439102 688384628 688337402 688240662 688476410 688067856 687792282 687433319 687588654
2009.8 687588654 687783890 687127686 686928329 686767502 686688690 686291275 686293411 686001663 685489426 685706329
2019.4 685706329 685905304 686198578 685506592 685284271 685082169 684769135 684857559 684391556 684573975 684365845
2029.1 684365845 684173813 683947983 683896561 684032516 683679886 683558502 682811356 682689056 682828522 682609787
2038.7 682609787 682209015 682207184 682579041 682181168 682140427 681618423 681686859 681836624 681544342 681737900
2048.4 681737900 681355667 681413651 681293945 681291351 681081314 680719986 680805435 680797119 681053696 680728912 680706177
2059 680706177 680282364 679826431 679641953 679319458 679604263 679442825 679923019 680127563 679855118 679505615
2068.6 679505615 679300156 679698715 679465179 679251785 678749390 678835754 679121017 679002914 678822937 678658142
2078.2 678658142 679314194 679150925 678811874 678319244 678048553 678159409 677980576 678163757 677718048 677732849
2087.9 677732849 677873688 678158569 677996292 677002182 676762619 676573715 676779556 676656189 676526489 676278915
2097.5 676278915 676137085 676266174 675749359 675912781 675694122 675791092 675773773 675106735 675088196 675072098
2107.2 675072098 675018539 674766693 675054016 674841690 674540176 674498215 674230118 674025497 673164368 673182144
2116.8 673182144 673208084 673372345 673443146 673136520 673619537 673421249 673074417 672519226 672434540 672667542
2126.5 672667542 672855377 673366165 673256531 672994919 672455215 672696915 672675095 672164459 672250671 672289352
2136.1 672289352 672523499 672649536 673099899 672863464 672497025 672297516 671951828 672092514 671854019 672070084
2145.8 672070084 672316284 672552185 672520905 672558670 672789612 672217331 671910400 671468124 671662064 672061844
2155.4 672061844 672442322 672854614 672696152 672586136 671998825 672077332 671960220 671818619 672088623 672277985
2165 672277985 672853699 672942734 673120117 672698288 672468948 672188263 671774750 672159958 672364273 672820663
2174.7 672820663 672583618 672970886 673284760 672894363 672965164 672628326 672782898 672790985 673113403 673295288
2184.3 673295288 673401413 673654556 673423157 673557510 673005447 672869568 672822037 673004379 673534927 673582153
2194 673582153 673896255 673736801 674004135 673875961 673465118 673127823 672860107 673434906 673754501 674104233
2203.6 674104233 673882294 673769302 673696671 673559036 673915100 673918533 673779221 673592911 674263535 674356079
2213.3 674356079 674252319 674467163 674260483 674416580 674002533 673760986 673568039 673886719 674160004 674236679
2222.9 674236679 674783173 674542389 674781189 674447327 674186249 674455948 674597397 674910355 674374695 674356613
2232.5 674356613 674348755 674490967 674615555 674466934 674444504 673879395 673800278 674034424 674580841 674469452
2242.2 674469452 674172287 674057388 673834076 674326401 674522934 674675598 674159012 673809967 673598404 673316574
2251.8 673316574 673804398 673763885 673949509 673856049 673938293 674071579 673726273 673555679 673375092 673797531
2261.5 673797531 673734436 673916779 674268951 674160233 673801193 673597870 673934631 673536301 673424149 673086929
2271.1 673086929 673041992 673438263 673424530 673519897 673068695 672945938 672661209 672945175 673124619 672656479
2280.8 672656479 672882004 672898254 672941437 672767487 672959671 672403564 671768265 672010345 671712494 671904907
2290.4 671904907 671642609 671420517 671192932 671286621 671510010 671070633 671438370 671406555 671361237 670598755
2300 670598755 670318680 670910721 670380173 670074921 669666977 669998627 669735641 668891754 668902588 669106750
2309.7 669106750 669259262 668426208 668349762 668272934 668075867 667909851 667425385 667150955 666652374 667025299
2319.3 667025299 666568298 665914078 664962616 663849716 664087982 664991760 665549545 664165192 664203110
2328 664203110 664322510 664141998 664290009 663643646 663478241 661968918 661927872 662213287 661772308 661276169
2337.7 661276169 660617828 660926819 661060715 662056732 661481323 660188828 659850769 660481949 661245270
2346.3 661245270 661309204 662003250 662123718 662263336 661989670 661383896 660650864 659681854 659614716 658979645
2356 658979645 659510956 658781891 657967987 657994995 657302856 656912613 656014709 656437759 655894165 656348877
2365.6 656348877 657708817 657767868 657001877 657375717 658587875 657434464 657444000 658133698 658594666 658698730
2375.3 658698730 658671494 659154358 658524094 658353500 658217545 658379974 658671265 658694992 659097214 658798981
2384.9 658798981 658575439 658189163 657972031 657791672 657185745 656945343 656853638 657056351 656984329 656929703
2394.6 656929703 656456604 655946426 655753937 655171127 654930038 654664307 654719315 654489136 654059525 654028702
2404.2 654028702 653874283 653507156 652702789 652430191 652358246 652404709 652313461 652003479 651752014 651238861
2413.8 651238861 651100540 650380783 649715576 649716110 649696503 649329605 648933563 648983994 648767776 648840637 648086166
2424.5 648086166 647047195 646889648 646614609 646549759 646465149 646539536 646084747 645287323 644939194 644621735
2434.1 644621735 644178467 643808060 643882294 643665543 643565369 643495865 643227768 642454224 641471634 641177597
2443.7 641177597 640821915 641061325 640911865 640480652 640336075 639762154 639296951 638694649 638620834 638210030
2453.4 638210030 637706566 637466850 636941185 636702843 636289635 636247826 635827789 635282936 634845314 634345322
2463 634345322 634181976 633456154 633227348 633110809 632584190 632043648 631707497 631631241 631114616 630549698
2472.7 630549698 630295753 630351486 629825706 629217072 628738365 628155174 627612343 626901817 626856308 626252518
2482.3 626252518 625873375 626018448 625507965 625070152 624344673 623684845 622968216 622714157 622716560 622251663
2492 622251663 621700096 620997391 620663338 620113983 619540977 619140015 618969955 618879585 618336411 617650642
2501.6 617650642 616979790 616888275 616374207 615703659 615261078 614620361 614221344 614050026 614235153 613731575
2511.2 613731575 613051529 612505836 612047806 611383705 610410881 610458870 610044250 609637871 609654732 609347496
2520.9 609347496 608962593 608193169 607444115 606660461 606458244 606090622 605771866 605844307 605511246 605293503
2530.5 605293503 604740372 604333458 603820953 603375244 603064423 602856560 602878952 601945839 601379128 601020164
2540.2 601020164 600703773 600536804 599728966 599191971 599042664 598802834 598192787 597922363 597480164 597153816
2549.8 597153816 597150192 596455116 595889473 595095024 594500160 594417152 594573860 594533882 593780746 593249054
2559.5 593249054 592821236 592328300 591682434 591501274 591450806 590985260 590601501 590142250 589889183 589419785
2569.1 589419785 588948441 588199654 587683487 587740936 587282715 587048531 586753273 586375809 585792809 585174599
2578.7 585174599 584818268 584360237 584433556 584205399 583623352 583146057 582760620 582185669 581458817 581013641
2588.4 581013641 580728455 580794334 580222359 579538765 579216270 578875771 578783875 578246460 577419853 576787796
2598 576787796 576535492 575986977 575392838 574981155 574644547 574754639 574344864 573713303 572793427 571922264
2607.7 571922264 571633263 571373291 570993385 570280571 569821396 569404907 569278069 569146271 568406143 567625580
2617.3 567625580 567000999 566593132 565962029 565616264 565119095 564501190 564146576 563464165 562921448 562399750
2627 562399750 561970024 561402664 561229057 561286392 560753098 560130844 559390640 558542900 557639046 557590027
2636.6 557590027 557288094 556545029 556070862 555025291 554609985 554272346 553843956 553453064 552958374
2645.3 552958374 552524414 551840172 551677017 551197510 550896873 550567780 549834328 549369469 548692551 548328552
2654.9 548328552 547851028 547573967 547266998 546936646 546837463 546320381 546090622 545681267 545013390 544204826
2664.6 544204826 543729134 543473167 543158417 543342514 543032608 542230949 541520844 541497383 541185532 540369682
2674.2 540369682 540105743 539983063 540160217 539953728 539611702 539197159 538599129 538054695 537539215 537451019
2683.9 537451019 536909599 536649475 536262741 535503731 535241432 534722672 534237213 533896942 533789978 533274384
2693.5 533274384 532602043 532501106 532682076 532617989 531668434 530982895 530581474 530362892 530051422 529581032
2703.1 529581032 529666405 529487000 529236603 528787842 528260422 527832832 527378845 527141724 526852341 526655846
2712.8 526655846 526318970 526095047 525689507 525202560 524849167 524401588 524310493 523996124 523820152 523773956
2722.4 523773956 523435974 522964516 522652512 522633591 522045631 521463051 521215706 520846977 520597878 520731888
2732.1 520731888 520768242 520435562 520026016 519608421 519625702 519346886 518889542 518742828 518569984 518531609
2741.7 518531609 518326683 518175659 517993584 517967873 517947960 517729530 517653389 517409554 517100143 516598549
2751.4 516598549 516281815 515894737 515499001 515471878 515316429 515158882 514733620 514294167 513871803 513833427
2761 513833427 513851700 513288040 512903557 512453499 512024422 511499100 511215591 511141663 510874290 510809860
2770.7 510809860 510469284 509931145 509349785 509211617 508979187 508435364 508108559 507845230 507738609 506911125
2780.3 506911125 506441460 506091347 505216789 505022163 504646454 504189758 503835297 503391953 502834129 502269974
2789.9 502269974 501847954 501369667 500852966 500147972 500127182 499811325 498734779 497976799 497275124 496821480
2799.6 496821480 496296539 495831757 495408821 494687347 494257927 494084282 493428688 492364616 491631432
2808.3 491631432 490958214 490269928 489521484 488785896 488102608 487384567 486963158 486387749 485465546 484418526
2817.9 484418526 483648033 482638245 481715240 481588974 481089096 480382843 479438591 478259926 477459869
2826.6 477459869 476793823 476017303 474973946 473969917 473201637 472801170 472188110 471395416 470387344
2835.3 470387344 468788910 467661209 466713066 465491943 463910828 462125130 460911026 459765320
2843 459765320 457992516 456032524 454400330 452491035 450160980 447897606 446103172 444477577 443021698
2851.7 443021698 442285881 441628799 440974007 440335159 439981537 439694672 439209328 439268036 439120979 438694077
2861.3 438694077 438514519 438409195 437796593 436867142 435891533 434709587 434242783 433992538 433460312
2870 433460312 432433891 431290092 430719032 430127373 429668922 429083977 428545570 427855186 427088051 426578865
2879.6 426578865 425656776 424837646 424069977 423367882 422539444 421545601 420516090 419378052 418616791
2888.3 418616791 417869453 417406235 416461945 415106697 414380913 413778725 413090744 412025375 410988617
2897 410988617 409932404 409055595 408378754 407730446 407365227 406644630 406105576 405446968 404538460 403774452
2906.6 403774452 402837448 401950645 401130257 400315666 399195023 397986374 396165848 394401360 393681564
2915.3 393681564 392787514 391398964 389629555 388049965 386698761 385684052 384937592 384166565 383665771
2924 383665771 383049278 383078461 383078117 382795639 382985878 383097992 383254776 383355751 383362770 383210869 383429146
2934.6 383429146 384043884 384722595 385353889 385882759 386649170 387113609 387774239 388477440 389371605 390327721
2944.2 390327721 390370789 390911598 391880112 392495193 392779274 393406448 394306335 394931564 395529747 395122299
2953.9 395122299 394755669 395270767 396075554 396894722 397608337 398694649 399784508 400659790 401006393
2962.6 401006393 401310539 401868248 402611771 403397369 403586617 404014626 404733887 405741806 406996117
2971.2 406996117 407850075 408142624 408484230 409327164 409865074 410490799 411008034 411258545 411632881 412119751
2980.9 412119751 412861557 413027382 412884560 412939835 413241043 413381462 413466377 413679276 413639832 413994026
2990.5 413994026 414050903 413956795 413866119 413536797 413398819 412911873 412716713 412556381 412210884 412067375
3000.2 412067375 411729088 411212807 410711441 410390816 409708214 408967743 408483505 408044052 407807770 407283096
3009.8 407283096 406207771 405696526 405526657 404504662 403946724 403482018 402519150 401757240 401070747
3018.5 401070747 400745544 399819260 398902779 398568192 397969360 397312241 396651993 395968781 394965363
3027.2 394965363 394019737 393190422 392627831 391925240 390841026 390359116 389743233 389106255 388251305
3035.9 388251305 387099915 386382103 385714684 385013084 384027138 383219643 382572441 381563377 380551643
3044.5 380551643 379958382 379291954 378298492 377480774 376459236 375926590 375620461 374822235 373778992
3053.2 373778992 372569199 371913834 371192665 370201187 369144936 368265953 367670975 366951447 366467323
3061.9 366467323 365640030 364725113 363874969 363050575 362517662 361711655 360971336 360426292 359936218 359149246
3071.5 359149246 358305321 357624168 356978302 356477470 355650291 354823265 354010010 353310127 352691803 352086601
3081.2 352086601 351820717 351473427 351041069 349974632 348762283 348142052 347642097 347081413 346105804
3089.9 346105804 345131836 344586411 344225349 343651009 342827110 341964149 341422539 341096382 340384521 339556770
3099.5 339556770 338582840 337722397 336949997 336113701 335430984 334691544 334170227 333488197 332880478 332370415
3109.1 332370415 331562767 330670204 329819450 329438400 328614922 327747231 327475204 326795731 325970154 325243416
3118.8 325243416 324465103 323651657 322902679 321941452 321124535 320749207 320101585 319242897 318442383 317859707
3128.4 317859707 317147808 316201344 315370159 314519577 313569794 312971096 312819252 311984558 310731659
3137.1 310731659 310185280 310036201 309104462 307665081 306883659 306015263 305121212 304369240 303512249
3145.8 303512249 302843075 302095032 301518898 300948658 300426655 299770794 298735943 297928696 297330647
3154.5 297330647 296733665 295852261 294912758 294068756 293490086 292951393 291862564 291013546 290253181
3163.1 290253181 289136963 288415985 288087749 287388134 286497974 285769424 284989834 284563332 284071941
3171.8 284071941 283226910 282507896 281624012 280839024 280214233 279187393 278317032 277881336 277308178
3180.5 277308178 276673851 275793056 274944153 274626751 274082165 273032951 272044792 271512241 270858250
3189.2 270858250 269794083 269101715 268759098 268187599 267389507 266557541 265669174 265019035 264464912
3197.9 264464912 263898125 263405209 262821751 262292652 261540089 260992832 260514755 259634914 259128227 258948650
3207.5 258948650 258628387 257848778 257093639 256554852 255767536 254927921 254258785 254035206 253695621 253037739
3217.2 253037739 252560539 252236290 251679993 250804558 250066833 249669170 249490032 248716679 247664986
3225.8 247664986 247166061 246655293 246164722 246072388 245913429 245377216 244842529 243847923 242936649 242657642
3235.5 242657642 241947422 241282806 240659370 240060768 240095463 240086918 239409332 238620014 238520622 238122444
3245.1 238122444 237230606 236588840 236378288 236169853 235366669 234810810 234424133 234286098 234342899 233996716
3254.8 233996716 233579655 232904510 232427387 231993809 231284504 230946865 230955238 230726891 229983139 229233322
3264.4 229233322 228538074 228209419 228318729 228186016 227683372 227221146 227185650 226673584 225960884 225922928
3274 225922928 225459080 224701633 224268265 223758297 223575611 223596344 223255901 222727318 222170601 221957760
3283.7 221957760 221841488 221745338 221415825 220700302 220757179 220918331 220765114 220496883 219845810 219637527
3293.3 219637527 219409714 218796272 218300838 218053875 217849789 217577915 217414360 217023354 216570988 216270294
3303 216270294 216062794 215854816 215551167 215339336 215187798 214690838 214037971 214022388 213810368 213183250
3312.6 213183250 212643471 212078857 211921368 211852741 211761551 211345043 210866776 210594559 209815922 209216805
3322.3 209216805 208868141 208822899 208729191 207927132 207120781 206383171 205854912 205407925 205177631 205226784
3331.9 205226784 204857693 204295826 203759212 203324661 202946129 202290916 201376991 200781345 200396671 199715042
3341.6 199715042 199364243 199290600 198982048 198526611 198055496 197479668 196904736 196800117 196840382 196658859
3351.2 196658859 196425438 196090431 195698109 195693169 195691013 195318794 195263958 195031090 194404869 194161377
3360.8 194161377 193759327 193092880 192933064 192870331 192848339 193248596 193314362 192907658 192286320 191864853
3370.5 191864853 191694469 191136284 190784817 190585899 190527153 190829849 190717373 190550823 190114250 189594746
3380.1 189594746 189824696 189819660 189545078 189663086 189860859 189464073 188828392 189154949 189554825 189288349
3389.8 189288349 189194241 189335308 189227448 188806477 188717365 188495502 188419209 188891201 188582325 188264408
3399.4 188264408 188227520 188168907 188232822 187989979 188302116 188802891 188729668 188342113 188192406 188221951
3409.1 188221951 187947311 188233223 188603439 188675709 188852787 188772507 188776112 189160862 189429226 189118423
3418.7 189118423 189285221 189700413 189466553 189638119 190107460 190475159 190968666 191533470 191670723 191557999
3428.3 191557999 191812229 192389069 192968864 192877998 192548580 192818203 193651943 194114056 193755169 193573208
3438 193573208 194253750 195142250 195380535 195602951 195677376 195614491 196012669 196671963 197559452 197855778
3447.6 197855778 198257351 198760166 199103680 199972134 200745640 201523762 201495132 201074276 201584225 202337360
3457.3 202337360 202999535 203565540 204052486 204526157 205320950 205723114 206417007 207911644 208755589
3466 208755589 209097385 208846912 209260426 210336094 210820751 211640377 212328053 212906837 213843994 214840107
3475.6 214840107 215412426 215360031 215785084 216836338 217282619 217704906 218987617 219661884 220468597
3484.3 220468597 221545525 221989498 222737808 223539391 224356995 224986992 225716801 226732502 227342339
3493 227342339 227920475 228540058 229409847 230266266 231170025 232064381 232673512 233629932 234823952 235799522
3502.6 235799522 236397362 237209587 237977161 238702011 239603252 240524368 241588211 242567768 243573742
3511.3 243573742 244089546 245029945 246253796 246665497 247425785 248675251 250158939 251461792 252504711
3520 252504711 253217964 253991375 254943981 255466881 256488419 257734280 259248219 260212955 260852718
3528.6 260852718 261982307 262956562 264167747 265327053 266846180 267690964 268737469 270509586 271066570
3537.3 271066570 271950321 273219318 274743156 275739803 276819172 278312054 279438801 280861969 281948776
3546 281948776 283853416 284547634 285652142 287619038 288756962 290508919 291006489 292864704 294818287
3554.7 294818287 295912647 297443485 297984333 299772644 301697845 303653469 305041599 306340885
3562.4 306340885 307710915 308491821 311976547 314317970 315477028 316102180 316121769 318828354 320973930
3571.1 320973930 323272705 325242462 327018929 328524933 330187263 332332153 333271980 335527229
3578.8 335527229 337031364 338481331 341060448 342980232 344482460 345679169 349592743 352566872
3586.5 352566872 352733192 354415207 355302811 358253784 361310234 364032898 365127754 365945892 369455376
3595.2 369455376 370396996 372558937 375812187 376897278 379627533 381890793 383407860 386197815
3602.9 386197815 388701553 390871849 393612404 396450386 397188873 399783020 401032829 401653862 407519875
3611.6 407519875 410321922 410436172 414599762 415448303 418508911 422442207 423876953 426684456 428036156
3620.3 428036156 430031853 433258858 435823250 438081970 441225243 443882141 446391029 453113289
3628 453113289 456640129 451123657 454119873 458279533 463421783 465648041 464951744 467534256 471485558
3636.6 471485558 475299110 477515335 479841919 482894669 486186218 488583221 489754791 492235374
3644.4 492235374 495841255 501605377 503734550 503132591 507996445 507993698 507862129 508688889 513161049
3653 513161049 517274437 520857201 526658134 522444496 523884888 529123993 531144409 533565369 534731827
3661.7 534731827 537221565 539304657 541395836 543882484 544866371 548934364 552219429 553428955
3669.4 553428955 554718399 549263725 550385132 557332535 566722794 569870796 556174850 557272110
3677.1 557272110 563370857 567604370 566423454 566604462 569075813 571144943 573096428 574129143
3684.9 574129143 574769516 578373909 584747086 579101753 575848732 583707161 579673157 578013992
3692.6 578013992 583075638 584138603 585056190 585825500 585950394 587022476 587584953 589876938 593248100
3701.3 593248100 589902496 586974068 591023102 593135529 592997513 592902527 595181427 600444641 595329437
3709.9 595329437 596739845 602145729 591850700 594194794 598393402 599112358 599727211 601010017
3717.7 601010017 602063446 600439835 601538048 606427727 604627762 600148735 603998947 605580826
3725.4 605580826 605254402 603454361 602882233 605635376 606234016 611366844 611189156 603634300 610701141
3734 610701141 613528023 606424637 606334991 607587090 606861763 608774033 612116318 609221687 611439972
3742.7 611439972 623441010 621145401 600863380 607128372 612271080 619152832 619545174 608119049
3750.4 608119049 617968292 614959602 606285439 611298065 614867439 618215141 613607216 614836731
3758.2 614836731 621276627 615393867 612522659 615475235 616604347 616978798 620307426 618857193
3765.9 618857193 614593697 617052307 621360550 623160324 615955162 616144676 618720131 618435631 619130440
3774.5 619130440 619121590 619838791 620187683 622689743 624458237 618255310 618950958 620780067 621808777
3783.2 621808777 624198723 621939430 620279999 621462440 622431526 622580795 621804504 621976624 622222633
3791.9 622222633 622721138 622484665 623070259 626428490 623908463 620111542 621844521 625312386 632551003
3800.6 632551003 630437660 617876129 619035225 621335564 625476532 631780357 625663872 619779510
3808.3 619779510 623013077 624505005 624431000 625066910 625499077 626452942 630687866 630176659 617843132
3817 617843132 621210327 626438904 630591431 634819221 621549454 619868622 623637581 625380974
3824.7 625380974 627656021 628112183 625005455 624413948 625670395 628431091 631046257 624314003 624914398
3833.4 624914398 632216873 628815422 626394196 632880745 626625366 621594238 629045792 625632820
3841.1 625632820 624016342 630466995 628990059 624736099 626727638 627996521 627229347 627866364 627352943
3849.8 627352943 629008560 635108452 633393211 636866608 623498268 618865891 627821312 627768898
3857.5 627768898 625057755 626452446 628418236 630768051 626233902 626034927 632865295 629871483
3865.2 629871483 623626785 625841064 629594307 634795494 630751076 622461319 624215317 629184990
3872.9 629184990 634208679 626618996 624698753 627027092 626923676 629917603 634896660 631843109
3880.6 631843109 622880249 625699310 627997971 630132751 635369110 624452515 623760376 626912994
3888.3 626912994 626827927 630486641 631847839 626676102 626343384 628171883 626120567 626428185 627781563
3897 627781563 629898033 633161507 625486717 628296700 630630455 625341225 629416771 627478714 626104507
3905.7 626104507 626897163 626350136 627692261 627684746 627582855 627397270 627245102 627648621 627562904 627972336
3915.3 627972336 630391502 628976936 624925613 627952919 628783760 625694618 626752090 627560005 628905830
3924 628905830 628598785 625382462 625512352 626736832 627848511 627570419 627540741 630173340 629118614
3932.7 629118614 626602707 626944542 626905670 626844559 627362175 627533646 626655693 626183395 628047104 629538269
3942.3 629538269 626072617 624073334 625324554 626469231 627553024 626255074 626610527 627640152
3950.1 627640152 625728874 626521263 627080536 626461258 626314430 626374054 626374168 625226364 625727577 626446419
3959.7 626446419 626838570 626820259 625719986 625814056 625659065 625577240 625914688 626260681 626683121 626277466
3969.3 626277466 626004753 626459351 626215172 625145149 625037766 625721474 626037178 625563126 625754700
3978 625754700 626466331 626361351 625795212 625035667 625265121 625527802 625839615 626424217 626476364 626589203
3987.7 626589203 625912247 625547295 625741577 625747147 625538177 625685463 625885315 625465088 626120834 625907860
3997.3 625907860 625619011 626022644 625716362
4000.2 625716362
##END=$$ End of the data block
