##TITLE=$$ Begin of the data block
##JCAMP-DX=5.00 $$ ACD/SpecManager v 10.08
##SPECTROMETER/DATA SYSTEM=Varian
##DATE=14 Jan 2013 09:28:14
##DATA TYPE=INFRARED SPECTRUM
##DATA CLASS=XYDATA
##ORIGIN=
##OWNER=
##NPOINTS=3735
##FIRSTX=399.26403809
##LASTX=4000.35498047
##MAXX=4000.35498047
##MINX=399.26403809
##MAXY=69.44657135
##MINY=18.81329727
##XFACTOR=1.0000000000
##YFACTOR=0.000000100000000
##FIRSTY=40.70943451
##DELTAX=0.96440572
##XUNITS=1/CM
##YUNITS=TRANSMITTANCE
##XYDATA=(X++(Y..Y))
399.3D07094345j2764435L195534L282700n316697O736565n218201r182052O563720
407C94391479Q452187N303078L945732j406403q879890j158943L698921o468697j0241890
415.7C87635574L640328J0246200n09262M858132k309800n344429m945106p084312
423.4C86187325K845382N338707J452027Q15124Q35724l467102l506317m43268J590271
432.1C91647873L915939j513328m575806o19316J815453K135772J683464J251908K67181
440.7C96009140J780281J808548l773346k987709L727722M12102m427338k804031l855629
449.4C85889740L8948Q24471J836280L654709M86069n5122m358597k029305N058708
458.1C91345901j127815k249717k44599J427612p40852k984428m999314j69944L337326
$$ y = [407094345, 394329910, 397525444, 400808144, 395491447, 402228012, 397009811, 387827759, 394391479, 402843666, 408146744, 412092476, 410686073, 401806183, 400647240, 404346161, 397877464, 387635574, 391275902, 401522102, 401012840, 405870972, 403561172, 398216743, 393271637, 386187325, 389032707, 394371414, 395823441, 396638565, 397474289, 394007187, 390500870, 390057602, 391647873, 395563812, 394050484, 389474678, 388855362, 390670815, 392806587, 394490051, 395741959, 396009140, 397789421, 399597969, 395824623, 392836914, 396564636, 396976738, 392549400, 389745369, 385889740, 385928688, 386753159, 388589439, 392244148, 392730217, 392675095, 388316498, 386287193, 391345901, 390218086, 387968369, 387723770, 389151382, 388410530, 385426102, 380426788, 380256844, 383594170]
466.8C83594170p90024L308334J938057n801430k176971L444519l201790n480232k71073
475.5C74563560O96488l264504J56594J224670M39110L953323R65767o98852p66030
484.1C77270126p7591J217041k187957m88320K65503K509613K645569m794006l433953
492.8C72926025j576576j025162O93856R47647J41258k476997P1907J149482k456703
501.5C68394737j270485L346443o97441l283958J258736L46870q19206k37465j358032
510.2C65680199k15493l6773q1826j403617j065560Q40988L26767K139740j96190m339714
519.8C61648521q00361L99475j670914K86789K499046K55318k693100j504745n86243
528.5C57833786M44489M09393J119575J911583q99925r04045J005020O11420j89896
$$ y = [383594170, 382804146, 386112480, 388050537, 382249107, 380072136, 383516655, 380314865, 374834633, 374563560, 375260048, 371995544, 372152138, 373376808, 373815918, 377769241, 378735008, 378036156, 377270126, 377192535, 378409576, 376221619, 375733299, 375998802, 378508415, 381153984, 376359978, 372926025, 371349449, 370324287, 371018143, 371965790, 372107048, 369630051, 369701958, 370851440, 368394737, 367124252, 370470695, 369773254, 366489296, 367748032, 368094902, 367275696, 367038231, 365680199, 365464706, 365427933, 365346107, 363942490, 362876930, 363717918, 364044685, 366184425, 365988235, 361648521, 360848160, 361247635, 359576721, 359863510, 362362556, 362617874, 359924774, 358420029, 357833786, 358278275, 358687668, 359807243, 361718826, 360818901, 359914856, 360919876, 361531296, 361341400]
537.2C61341400m7073o31218j095886q06542k534027r62830P78885p31964j33285l94898
546.8C54782562j172600j310310k17667L88604j52932l93791q06541L50761L2959K68288
556.5C51769333l51524j524392L37601m15993k040252r11217K043800Q18939m49180
565.1C49277115J244507n98069n13916j04599j313552r65500R6550J293754O63681
573.8C49079971O34461p08771k006912m3106L44352o60209p16286L05138j90850P0916
583.5C46108704J237907O42128K09503O72531O69785j30921O8398Q90961J07917j85051
593.1C50291862N67818L6011L20167Q14515k46354n74035o8894Q66051j82266r99031
602.8C50825844Q32100L53889q83636r57566j064338j18637N47294j11732j458740
$$ y = [361341400, 361294327, 360663109, 359567223, 358760681, 356226654, 355263824, 356042709, 355310745, 355177460, 354782562, 353609962, 352299652, 352081985, 352470589, 352317657, 351923866, 351117325, 351468086, 351501045, 351769333, 351417809, 349893417, 350231018, 349815025, 347774773, 346863556, 348907356, 349726295, 349277115, 350521622, 349923553, 349409637, 349305038, 347991486, 347025986, 347122536, 348416290, 349079971, 349714432, 349005661, 346998749, 346955643, 347299995, 346639786, 345923500, 346228638, 346037788, 346108704, 347346611, 347988739, 348198242, 348870773, 349540558, 349409637, 349478035, 350368996, 350476913, 350291862, 350859680, 350895691, 351215858, 352030373, 351784019, 351209984, 351141090, 352007141, 351824875, 350825844, 351657944, 352011833, 351128197, 350170631, 349106293, 348987656, 349534950, 349423218, 347964478]
611.4C47964478j446496k64282K77481m81338j386757K98996J733971Q04405M34074
620.1C47934532l77159q66814N23034J152114J128884N39245N90783O33583j26381
628.8C51131821J424789K007637J097832R58633P83158J204719J641312J649895K332305
637.5C64232101K405053J7051n22079P03201Q71620P93572O25152J196671J483345
646.2C71805687J768494J276588M12407K71606J0987J545067J706199k28119k43148
654.8C78325768J021385R67827k60201p08351o14472j08642k12860j069184j28631
663.5C77212639R98955L81355j71661j407700j442108L616333M36935n35164J159249
672.2C80248833K343712J538085j78108O59561J647301P64961O79512N57213J390839
$$ y = [347964478, 346517982, 346253700, 346531181, 346049843, 344663086, 344962082, 346696053, 347500458, 347934532, 347557373, 346690559, 347213593, 348365707, 349494591, 350033836, 350624619, 351258202, 351131821, 352556610, 354564247, 355662079, 356620712, 357403870, 358608589, 360249901, 361899796, 364232101, 366637154, 366654205, 366132126, 366835327, 367706947, 368500519, 369125671, 370322342, 371805687, 373574181, 374850769, 375263176, 375534782, 375545769, 377090836, 378797035, 378568916, 378325768, 379347153, 380314980, 380054779, 379346428, 378731956, 378623314, 378410454, 377341270, 377212639, 378211594, 378592949, 378421288, 377013588, 375571480, 379187813, 379624748, 379089584, 380248833, 382592545, 384130630, 383952522, 384612083, 386259384, 387024345, 387703857, 388261070, 389651909]
680.9C89651909K295189J097069Q71582J871490J136627L46680N48325n1537L49121
689.6C98116455J698647J328125R39674J066322K87514P4806N76935J280556Q60138
698.2D06229172k87972N10750J195870R38262n1498m04358R56841J314773Q95806J91268
707.9D11488914O02379J668358J370964J130944Q22448K1630j30349P48558K12326
716.6D17936172O8818J577987J413918P75184o3819n03159O45943J299972P58400J014862
726.2D24924278J759148J512642P52601j80091j7319O66885J390228J140900M44603
734.9D32393875R47113Q03452J442146J356697N20363j2817o03753P68624R86862P56226
744.5D39358788J035194J016846R94224L16124L1548J23520R85946J233139N86472
$$ y = [389651909, 391947098, 393044167, 393915749, 395787239, 396923866, 397270546, 397818871, 397767334, 398116455, 399815102, 401143227, 402082901, 403149223, 403436737, 403511543, 404088478, 405369034, 406229172, 405941200, 406451950, 407647820, 408586082, 408534584, 408130226, 409087067, 410401840, 411297646, 411488914, 412091293, 413759651, 415130615, 416261559, 417084007, 417105637, 416975288, 417723846, 417936172, 418004990, 419582977, 420996895, 421772079, 421708260, 421205101, 421851044, 423151016, 423909416, 424924278, 426683426, 428196068, 428948669, 428768578, 428751259, 429418144, 430808372, 431949272, 432393875, 433340988, 434144440, 435586586, 436943283, 437463646, 437450829, 436847076, 437615700, 438602562, 439358788, 440393982, 441410828, 442405052, 442721176, 442752724, 442876244, 443862190, 445095329, 445681801]
753.2D45681801K2125J351204K420959Q19130J36261m8408J101951J215783P60917
761.9D53461723J514969J175270J888390Q24394K40250O21032J74675N01595q4572
770.6D60317726N50194N29709K87666M11186p36580r24377j33019O72303N52292M77066
780.2D62004166N8174L87573J050491O9809l79333Q8310R09958L34549m03404M49905
789.9D64570198J253166J389656J339226K92664j335144j070710m61197n80215j100578
798.5D64297066R9563m01535k090530j35384r97467j666794r10263j583023j227722
807.2D55383911j587524k012368k475013j565171j099968j560211j580009k407837
814.9D41095810r84421L36838l11050n21851J23062K90146J00059M61007P21321K336807
$$ y = [445681801, 445703926, 447055130, 449476089, 450295219, 450431480, 450383072, 451485023, 452700806, 453461723, 454976692, 456151962, 458040352, 458864746, 459104996, 459726028, 459900703, 460402298, 460317726, 460867920, 461397629, 461685295, 462096481, 461359901, 460435524, 460302505, 460974808, 461527100, 462004166, 462062340, 462449913, 463500404, 463570213, 463190880, 463279190, 464189148, 464523697, 464120293, 464570198, 465823364, 467213020, 468552246, 468844910, 467509766, 466439056, 465977859, 465397644, 464297066, 464396629, 463995094, 461904564, 461769180, 460771713, 459104919, 458194656, 456611633, 455383911, 453796387, 451784019, 449309006, 447743835, 446643867, 445083656, 443503647, 441095810, 440111389, 440448227, 440137177, 439615326, 439738388, 440028534, 440128593, 440589600, 441310921, 443647728]
824.6D43647728K763824J985360K056770K470970L204727K737770K752190L033905
832.3D64653244L520203K990226K384682L081093K586708K624550K041702J435433
840D85317841J087226J803093K136460J310234J953621J203766J369514J293831J195831
848.7D98671417J245117P86477J398849N37911J429939J637268J375809J756401J760597
857.4E10599785K079811N46303Q18672J024322O90308R40170J006089l9940j336365
866E16329155l69034o25191j240425j523857q62350j482163k034416j169395j819878
874.7E05202446q83827j178932j492882j570282o04019M72603j359787m61693o75965
883.4D97447662q60786q91190j591453P8926k6894l72658l33328K49176r6779m35218
$$ y = [443647728, 446411552, 448396912, 450453682, 452924652, 456129379, 458867149, 461619339, 464653244, 468173447, 471163673, 473548355, 476629448, 479216156, 481840706, 483882408, 485317841, 486405067, 488208160, 490344620, 491654854, 493608475, 494812241, 496181755, 497475586, 498671417, 499916534, 500703011, 502101860, 502639771, 504069710, 505706978, 507082787, 508839188, 510599785, 512679596, 513225899, 514044571, 515068893, 515759201, 516699371, 517705460, 517665520, 516329155, 515960121, 515334930, 514094505, 512570648, 511708298, 510226135, 508191719, 507022324, 505202446, 504318619, 503139687, 501646805, 500076523, 499472504, 499945107, 498585320, 498123627, 497447662, 496586876, 495695686, 494104233, 494183159, 494156265, 493783607, 493450279, 493699455, 493602676, 493167458]
893D93167458M90341J96914J28899R7046J002350J108589N18990k60659o08864n0621
902.7D95790443k38952J342506K201576K703782K843246K444038K365113J177101R75265
911.4E11604118j69181m51851r07708j457977j238403j494637o59637j795387k514306
920E00915031k598648l034401l433990l377609k788201l339195k964706l259468k999611
928.7D73119202k589989l043404k899513l278618k460937j590920j426620j422806
936.4D54406395p39670k38342q52738r98954j867218j725121r05189o58684r25369
945.1D45495110j106759K7314K48756L73688M80537Q7281n46151p64503L1662m07028
954.8D43919907j079483j532097j923104k387085k490730k038307k164764j904450
$$ y = [493167458, 493657799, 493854713, 493983612, 494080658, 495083008, 496191597, 496710587, 496449928, 495841064, 495790443, 495551491, 496893997, 499095573, 501799355, 504642601, 507086639, 509451752, 510628853, 511604118, 511434937, 510983086, 510075378, 508617401, 507378998, 505884361, 505224724, 503429337, 500915031, 498316383, 495281982, 491847992, 488470383, 485682182, 482342987, 479378281, 476118813, 473119202, 470529213, 467485809, 464586296, 461307678, 458846741, 457255821, 455829201, 454406395, 453666725, 453428383, 452575645, 451576691, 449709473, 447984352, 447079163, 446420479, 445495110, 444388351, 444415665, 444664421, 445038109, 445518646, 445605927, 445059776, 444295273, 444326935, 443919907, 442840424, 441308327, 439385223, 436998138, 434507408, 432469101, 430304337, 428399887]
962.5D28399887j614456j727295j606674j485176k345200k581138j509133j202583
970.2D14328232k086754l235054k700119k292366k682266k898903l578034l597412
977.9C91257324l700027m221916m429474m770546n254441m935836m718094m909096
985.6C54317894m884605m837838m564056m531326m188500l645897l335228l584747
993.3C20745697m199905m241124l345546l058167l458404l409291l568763k792302
1001.1B92672195k800121k844200k094498j844062j917668k705517k288284k230797
1008.8B73947048j298637j031304k045898j735401k178154j663876j715050j885070
1016.5B60393658k555294k629128j680031k598972k427502k138652r99871k299614
$$ y = [428399887, 426785431, 425058136, 423451462, 421966286, 419621086, 417039948, 415530815, 414328232, 412241478, 409006424, 406306305, 404013939, 401331673, 398432770, 394854736, 391257324, 387557297, 383335381, 378905907, 374135361, 368880920, 363945084, 359226990, 354317894, 349433289, 344595451, 340031395, 335500069, 331311569, 327665672, 324330444, 320745697, 316545792, 312304668, 308959122, 305900955, 302442551, 299033260, 295464497, 292672195, 289872074, 287027874, 284933376, 283089314, 281171646, 278466129, 276177845, 273947048, 272648411, 271617107, 269571209, 267835808, 265657654, 263993778, 262278728, 260393658, 257838364, 255209236, 253529205, 250930233, 248502731, 246364079, 245364208, 243064594]
1024.2B43064594l023548q61187j154384j219864j686020o43845q57944j054840l10460
1032.9B32252502j175384j57375M26273J572094J267185J345654J278209P93515J949920
1041.6B39552593J184349J453667Q86765M76551n06669p66201R18599L2539r21955
1050.2B42310238j952152r57871o47278q02746j094264j897049n31903m35562M82350
1058.9B34473763l11337R13811K826862K016354J359462L00999K338181J895980J255703
1067.6B47069778R82171P01313J411132P35455J344643k08512N1995J47056N27191
1076.3B52762222J012936j39656J543331N5103O53057J290722O08197J554985P16991
1085B60057888P81155R26857K250766J780777J667824J858616R91650J185054R72023
$$ y = [243064594, 240041046, 239179859, 238025475, 236805611, 235119591, 234475746, 233617802, 232562962, 232252502, 231077118, 230919743, 231346016, 232918110, 234185295, 235530949, 236809158, 237602673, 239552593, 240736942, 242190609, 243077374, 243553925, 243047256, 242281055, 243199654, 243232193, 242310238, 240358086, 239400215, 238752937, 237950191, 236855927, 234958878, 234426975, 233991413, 234473763, 234162426, 235076237, 237903099, 239919453, 241278915, 241579914, 243918095, 245814075, 247069778, 248051949, 248753262, 250164394, 250899849, 252244492, 252035980, 252087975, 252235031, 252762222, 253775158, 253635502, 255178833, 255233936, 255886993, 257177715, 257785912, 259340897, 260057888, 260839043, 261765900, 264016666, 265797443, 267465267, 269323883, 270315533, 271500587, 272472610]
1093.6B72472610K178898J361981J749611K175636J167526J727905J609421J837502
1101.4B86281090Q96568J173210J936760K273388J760407O63776J416626Q55064R16825
1110B98173714O43234P5893O39515J573048K123032J068019O67115m3335M68044J80912
1119.7C05569191j033001n42469m59423K76661M04796J027165J183624J056290J722736
1128.4C09205570J751499K102375J843758K130890J784763J937599K675858K703094
1136.1C26135406K790528J625976J758690K217980J467819J153488J192055J238365
1143.8C39580307J436462J347008M21372M62379Q30917M47731L28522K47727l61824
1152.5C44740601m67034J96305j00937l07083l18680m70429l24707q25577r67559o30951
$$ y = [272472610, 274651508, 276013489, 277763100, 279938736, 281106262, 282834167, 284443588, 286281090, 287177658, 288350868, 290287628, 292561016, 294321423, 294985199, 296401825, 297256889, 298173714, 298816948, 298892841, 299532356, 301105404, 303228436, 304296455, 304963570, 304920235, 305388279, 305569191, 304536190, 303993721, 303534298, 303810959, 304215755, 305242920, 306426544, 307482834, 309205570, 310957069, 313059444, 314903202, 317034092, 318818855, 320756454, 323432312, 326135406, 328925934, 330551910, 332310600, 334528580, 335996399, 337149887, 338341942, 339580307, 341016769, 342363777, 342785149, 343247528, 344078445, 344526176, 344854698, 345102425, 344740601, 344273567, 344469872, 344368935, 344061852, 343743172, 343272743, 342948036, 342122459, 341154900, 340523949]
1162.1C40523949K86445R28498Q74977J465301K173233K403603K136268K027245K370567
1170.8C55190086L163185K971039K670670K778587K695313K839126K668419K493363
1178.5C77469788K470131K851638K203255K038727K798767K183456J304627Q99048
1186.2C94219437O46209L44696P60842M17328l30773k11181N0087J86119n85213j043892
1195.9C94453659j040649j242981j120339j189918j701775j368675r61533j163826
1203.6C84663963j218643j527138j395836j208724o47393j57814l24631J30425m56963
1212.3C77857246n72280k938n08156l75747n41573l42140L09486Q9798m34456p72628
1221.9C74706612n29290n53627l58162m35752r61113p25975p37305j132507j131173
$$ y = [340523949, 340810394, 341738892, 342613869, 344079170, 346252403, 348656006, 350792274, 352819519, 355190086, 358353271, 361324310, 363994980, 366773567, 369468880, 372308006, 374976425, 377469788, 379939919, 382791557, 384994812, 387033539, 389832306, 392015762, 393320389, 394219437, 394865646, 395210342, 395971184, 396388512, 396057739, 395846558, 395896645, 396082764, 395497551, 394453659, 393413010, 392170029, 391049690, 389859772, 388157997, 386789322, 385827789, 384663963, 383445320, 381918182, 380522346, 379313622, 378666229, 378508415, 378183784, 378314209, 377857246, 377284966, 377282028, 376773872, 376398125, 375856552, 375514412, 375823898, 375913696, 375479240, 374706612, 374177322, 373623695, 373265533, 372829781, 371868668, 371142693, 370405388, 369272881, 368141708]
1230.6C68141708o42356l64304q79326j554718q43124J84135k51274k66266j19209
1239.3C63405266k50054l48701n54237j47286l51410m87709n52864n77278j98708o03218
1248.9C59333801n16166k91596k48184j38970k13432k58484m93240l70178q1597J91346
1258.5C56913300L3569K16942R9182m45824K13776N27992N28565L11965L72468O72035
1268.2C59443970P56149J014938P60956Q76541O02646P05757J145707J102752J238136
1276.9C67647552J021424J064300J051293J272621J360054R82056R51385J392861J875457
1285.5C78619003J797142J413956R14574J237144J394196R66339M33349L85132O78902
1294.2C87839737R36661J218300M42009M07257M18663L85322N06859j86005M7036K12326
$$ y = [368141708, 367499352, 367135048, 366255722, 364701004, 363857880, 364042015, 363790741, 363524475, 363405266, 363155212, 362806511, 362252274, 362104988, 361753578, 361265869, 360713005, 360135727, 359937019, 359333801, 358817635, 358526039, 358277855, 358138885, 357925453, 357666969, 357173729, 356803551, 356721954, 356913300, 356946869, 357163811, 357262993, 356817169, 357030945, 357558937, 358087502, 358399467, 358771935, 359443970, 360200119, 361215057, 361976013, 362852554, 363455200, 364160957, 365306664, 366409416, 367647552, 368668976, 369733276, 370784569, 372057190, 373417244, 374399300, 375350685, 376743546, 378619003, 380416145, 381830101, 382744675, 383981819, 385376015, 386342354, 386775703, 387160835, 387839737, 388776398, 389994698, 390436707, 390843964, 391262627, 391647949, 392154808, 391968803, 392015839, 392228165]
1303.9C92228165M86068K78817k43454l94135o92863l72849n62591n99785p30095o86417
1313.5C88710861k6016j92452j68037L93105P83195L78227M79660J042786P98950M90494
1323.2C92690773P15714R32846N98640O95114M36440J46255l10325o04668k98958n46074
1332.8C94455757j75590j19629l44467k17743L74031P30171P2594J09748j66816M25949
1342.4C95144005R73129P53479P32575O26258Q77419K92740N14030M08402j79711k73208
1352.1C99869118p20940k23808j59302l18756l06320j58882m68293m04090l01018q84400
1361.7C95923309p7858p49435n43671j92032n22766k76794n00755l47786q45833l06168
1371.4C91560211J35155m10690n49546m03099K40860j93290j85662m10461m15116n43632
$$ y = [392228165, 392714233, 392993050, 392749596, 392355461, 391662598, 391289749, 390727158, 390127373, 389397278, 388710861, 388684845, 388492393, 388324356, 388717461, 389500656, 389878883, 390358543, 391401329, 392200279, 392690773, 393406487, 394339333, 394937973, 395633087, 396069527, 396215782, 395905457, 395300789, 395001831, 394455757, 394280167, 394160538, 393816071, 393598328, 393972359, 394702530, 394775124, 394884872, 394718056, 395144005, 396117134, 396870613, 397603188, 398229446, 399106865, 399399605, 399913635, 400322037, 400142326, 399869118, 399148178, 398924370, 398765068, 398446312, 398139992, 397981110, 397512817, 397108727, 396807709, 395923309, 395845451, 395096016, 394552345, 394360313, 393837547, 393560753, 393059998, 392712212, 391866379, 391560211, 391695366, 391284676, 390735130, 390332031, 390572891, 390379601, 390193939, 389783478, 389368362, 388824730]
1381C88824730r89342j228218j752701r14421r70115q70133k098389k144966p64198
1389.7C77092247j934662k099609k148857j632729k159920l249664j147003j554070
1397.4C61165733j860122k988663k627029j764107k392044k068367k253571k653770
1405.1C42558060k028771j496086j750450j899910j388473j815148j378937j138038
1412.8C29662247j392632j135406r09043l99360j115914o42967j025124K82708J006927
1421.5C24331436k12478P01904L19366O46096R68132L58123Q61550N07812J654167
1430.2C30136108J125412J489602J863708J487427J819381J373139K268257J201477
1437.9C42764511K271271J859665J584892J920242J286812J970177J143455J438599
$$ y = [388824730, 387835388, 386607170, 384854469, 383940048, 382969933, 382099800, 380001411, 377856445, 377092247, 375157585, 373057976, 370909119, 369276390, 367116470, 363866806, 362719803, 361165733, 359305611, 356316948, 353689919, 351925812, 349533768, 347465401, 345211830, 342558060, 340529289, 339033203, 337282753, 335382843, 333994370, 332179222, 330800285, 329662247, 328269615, 327134209, 326225166, 325825806, 324709892, 324066925, 323041801, 323324509, 324331436, 324118958, 324820862, 325140228, 325786324, 326754456, 327112579, 327974129, 328481941, 330136108, 331261520, 332751122, 334614830, 336102257, 337921638, 339294777, 341563034, 342764511, 345035782, 346895447, 348480339, 350400581, 351687393, 353657570, 354801025, 356239624]
1445.6C56239624J454392J600379J084137Q18520J812668J002579J604385J114387
1453.3C66731071J878777J900902N62134J302299P58019L571090J104164J733857J398162
1462C80940475J344033K370720N84755K816619K232132K380219K270393K401772L075828
1470.7D00416946K750588M153633J623116L060302K992249L336105L447342K187424
1478.4D23967705K161293K026329K192726J805267J915436J799584J656036K133980
1486.1D39658356J664467Q34198R88769O10085M6348R2087l4447o48193n26924k85759
1495.8D42398987l580666k36664n40886l013343j185608j450730j390152j141929K20909
1504.5D30079918j67351m157867k332039J308136J312637r25445J17034p80296j295547
$$ y = [356239624, 357694016, 359294395, 360378532, 361197052, 363009720, 364012299, 365616684, 366731071, 368609848, 370510750, 371072884, 372375183, 373133202, 376704292, 377808456, 379542313, 380940475, 382284508, 384655228, 385239983, 388056602, 390288734, 392668953, 394939346, 397341118, 400416946, 403167534, 407321167, 408944283, 412004585, 414996834, 418332939, 421780281, 423967705, 426128998, 428155327, 430348053, 432153320, 434068756, 435868340, 437524376, 439658356, 441322823, 442157021, 443145790, 443755875, 443802223, 443894310, 443859863, 443211670, 442684746, 442398987, 438818321, 438581657, 438040771, 435027428, 433841820, 432391090, 431000938, 429859009, 430079918, 429912567, 425754700, 423422661, 424730797, 426043434, 425117989, 425235023, 424454727, 423159180]
1513.1D23159180n7106p88575k72331j091461k161674K83813J158409n01404k004928
1521.8D17723923J037521J122894J338730k2659K52876Q2474L80974Q86230M24958
1530.5D23227921N49888J28861O20117j93405J222610Q21419L3569J355248l35427
1539.2D27430801j395835R84344J673164L61634P04574R31702j055489P42646O3209
1547.9D30440750O61850K75459o35681O73104R2010R01566j235466L7307J186753R22546
1557.5D33320198m822388o820297M356308n13954O60629j476326j795082l045502k968673
1566.2D16894913j173897k254753r24149p333183k208977k182655l928604k992630
1573.9C93896065l210488p12776j1236725k684631l243637m520493m080696n441513
$$ y = [423159180, 423102074, 422313499, 422041168, 420949707, 418788033, 419071846, 420230255, 419728851, 417723923, 418761444, 419884338, 421223068, 421200409, 421453285, 421535759, 421916733, 422802963, 423227921, 423777809, 423906670, 424526787, 424333382, 425555992, 426377411, 426410980, 427766228, 427430801, 426034966, 427019310, 428692474, 429054108, 429758682, 430690384, 429634895, 430377541, 430440750, 431102600, 431378059, 430742378, 431415482, 431507492, 432409058, 431173592, 431210899, 432397652, 433320198, 428497810, 421677513, 426033821, 425519867, 426180496, 424704170, 422909088, 419863586, 416894913, 415721016, 413466263, 412542114, 405208931, 402999954, 400817299, 396888695, 393896065, 390685577, 389972801, 378736076, 376051445, 372807808, 368287315, 364206619, 358765106]
1581.6C58765106l773765n958214l731537n485649m549790m275474n477333l482704
1589.3C22030640n981694l228206n492687l847828m280548n031605k730084m813442
1597B86624546k191067m858932k459450l523464l329621j822509m033337j137295l556499
1605.7B59712372j369553l211155j471615j176414k877693q5907k992497M5185j944770
1614.4B44627953J33209L74489m085007J434822j393585J087246j482983R74579M4994
1623.1B41715717r27810J918640l66287J833152j370182J521397K20508J117268J789303
1631.7B47451706J82209K772770M54426L708210k006550K126331J735192J016883K633095
1640.4B60074272L57990K959195R44309J930923J101208j31397L693809k59762K908211
$$ y = [358765106, 354991341, 349033127, 345301590, 339815941, 335266151, 330990677, 325513344, 322030640, 316048946, 312820740, 307328053, 303480225, 299199677, 294168072, 291437988, 286624546, 284433479, 279574547, 277115097, 273591633, 270262012, 268439503, 264406166, 263268871, 259712372, 258342819, 255131664, 253660049, 252483635, 249605942, 249520035, 246527538, 246572723, 244627953, 244761162, 245135651, 241050644, 242485466, 241091881, 242179127, 240696144, 241670723, 241715717, 240787907, 242706547, 242340260, 244173412, 242803230, 244324627, 244545135, 245662403, 247451706, 247633915, 250406685, 250861111, 254569321, 252562771, 254689102, 256424294, 257441177, 260074272, 260432262, 263391457, 264335766, 266266689, 267367897, 267236500, 270930309, 270670547, 273578758]
1649.1B73578758J01300K437458J579647O91909K099686q88386L801022M51679J898079
1657.8B85751152P46040J547661K017384J754112L847733J71318L310756K010804K546520
1666.5C03703480K542515K435569M578495J699009N146790K485504L754044L632965
1674.2C29978371K846756L554382L237648M600830L234863N265694L681221L927841
1681.9C60327606M555969K147141P797089K421989N662766M612846M857254M760513
1689.6C97143173M332657N200386M199944M887352M700660N197945L151360O091613
1697.3D34905090O266404M976081N691147J371155O082344M976997M547272L795052
1705D72611542L773422M108810K991906L949508L025780K062492K447052K912293L141670
$$ y = [273578758, 273680058, 276117516, 277697163, 278389072, 280488758, 279600372, 283401394, 283853073, 285751152, 286497192, 288044853, 290062237, 291816349, 295664082, 295835400, 299146156, 301156960, 303703480, 306245995, 308681564, 313260059, 314959068, 320105858, 322591362, 326345406, 329978371, 332825127, 336379509, 339617157, 344217987, 347452850, 352718544, 356399765, 360327606, 364883575, 367030716, 374827805, 377249794, 382912560, 387525406, 392382660, 397143173, 401475830, 406676216, 410876160, 415763512, 420464172, 425662117, 428813477, 434905090, 441171494, 446147575, 451838722, 453209877, 459292221, 464269218, 468816490, 472611542, 476384964, 480493774, 483485680, 487435188, 490460968, 492523460, 494970512, 497882805, 501024475]
1713.7E01024475J865807J640396L537636L779029k376251J972313K939797J874466
1721.4E16257668J869583J451492J351242J970749K238998J253319J092720K278061
1729.1E29763832R32388L35503K907791L259049J25846j618919L410492L294869J655883
1737.8E44066734K659645J230240o04553L877220L305435J940956K275582L138428
1745.5E61889687K936706K826576L659974J540756L776054L018227J812706M767685
1753.3E86228371L424835L126716L486367J381263J759415K530060K245407L287010
1761F07469444J235085J026039L293953J773910J477242J997909K045098p05223J957741
1769.7F21571198M018135J283302L5400j314048L390350K379875n25360J767845P42035
$$ y = [501024475, 502890282, 504530678, 508068314, 511847343, 509471092, 511443405, 514383202, 516257668, 518127251, 519578743, 520929985, 522900734, 525139732, 526393051, 527485771, 529763832, 530696220, 531031723, 533939514, 537198563, 537324409, 535705490, 539115982, 542410851, 544066734, 546726379, 547956619, 547352066, 551229286, 554534721, 556475677, 558751259, 561889687, 564826393, 567652969, 571312943, 572853699, 576629753, 579647980, 581460686, 586228371, 589653206, 592779922, 596266289, 597647552, 599406967, 601937027, 604182434, 607469444, 608704529, 609730568, 613024521, 614798431, 616275673, 618273582, 620318680, 619613457, 621571198, 625589333, 626872635, 626908035, 625593987, 628984337, 631364212, 630838852, 632606697, 633348732]
1778.3F33348732J440239R15337N09147J605721J304779J492271k28805o2256J314621
1787F41639786J571579J310425K010345J279221R40475o58417j541519K812271J212616
1795.7F50576782J8158J275559J732559J203232p43943J701203L40805J46255J319352
1804.4F57569962J059646J267700N94635N93033O40488J218185o28738L07464J205597
1813F63827972M10309J315918N79987J289673N6228m0359O17142j03608J099549J27258
1822.7F69180069J294708J551438j455307k40708J363983J652527P65305j556320L6621
1831.4F72592316J787948K97699M19998O19431M89578P86438r8724Q50830k94037K32239
1841F77683716P15637J477127J658630l842468J385193J837692J91040n19638P1793
$$ y = [633348732, 634788971, 635704308, 636213455, 637819176, 639123955, 640616226, 640387421, 640325165, 641639786, 643211365, 644521790, 646532135, 647811356, 648751831, 648093414, 646551895, 649364166, 650576782, 650594940, 651870499, 653603058, 654806290, 654062347, 655763550, 656104355, 656250610, 657569962, 658629608, 659897308, 660491943, 661084976, 661725464, 662943649, 662314911, 662622375, 663827972, 664238281, 665554199, 666134186, 667423859, 667480087, 667439728, 668056870, 667953262, 669052811, 669180069, 670474777, 672026215, 670570908, 670330200, 671694183, 673346710, 674112015, 672555695, 672592316, 674380264, 674677963, 675097961, 675717392, 676206970, 676993408, 676894684, 677745514, 677451477, 677683716, 678399353, 679876480, 681535110, 677692642, 679077835, 680915527, 681106567, 680586929, 680658722]
1849.7F80658722J129227L53927Q23517k37350L71856N56488P8583J32752m73099O49719
1859.3F84044342J45416N52292j0376M08097Q74023o1188P17697l10821O23016o67801
1869F86314697j166458J264649Q43505N99595Q4381M27932l10134k10953k1973M64554
1878.6F88289795P23953k07977M42123k14691N20554L5553l32489N61599m9514J237411
1888.3F91006317N84564r98382l18070O20728L56064J85013m9057j028748O83136L01666
1897.9F91343231K47803L43018J34506M11911o09970K01492K92892K09961k57187j59683
1907.6F92157974K60773N2872L21121k60544P76138j98669j0300K00653k94647J315384
1917.2F94320755j298294o99768R50012M91943L30277o56815P4311M85534K31476m65240
$$ y = [680658722, 681787949, 682141876, 682965393, 682728043, 683099899, 683656387, 683734970, 683867722, 683394623, 684044342, 684189758, 684742050, 684731674, 685139771, 686013794, 685952606, 686670303, 686359482, 686982498, 686314697, 685148239, 686412888, 687256393, 687855988, 687940369, 688368301, 688058167, 687847214, 687825241, 688289795, 689013748, 688805771, 689247894, 689033203, 689553757, 689589310, 689256821, 689818420, 689768906, 691006317, 691590881, 690592499, 690274429, 690895157, 691251221, 691436234, 691387177, 690358429, 691041565, 691343231, 691591034, 691934052, 692068558, 692480469, 691870499, 692071991, 692364883, 692574844, 692317657, 692157974, 692418747, 692471619, 692792740, 692532196, 693308334, 693109665, 693099365, 693300018, 693005371, 694320755, 693022461, 692322693, 693272705, 693764648, 694094925, 693438110, 693512421, 693997955, 694229431, 693764191]
1926.8F93764191N6457k07977O0272N27420n06210R0408k89001L63388J20620m79354
1936.5F93500214R3994k63825K22779m9057P80105J81504j278000L4942K45438J01471
1946.1F93569565k58026J35956J6632q5450m53949j85165L72391m0665O332p16934
1955.8F92360687K3117j9607k95563J41678J3428M33960l68042M425n9967j0071M11606
1966.4F92635651l07465k85263k94189L87496k4108J3885J11847j78528Q9493m79279
1976F91669540j4419J00403N1422m71115j46866M44412k04544n0354l56140J57089
1985.7F91179428n5771q0337J14593o18744R2316J58234j79444m71496K45132L30200
1995.3F90714111r6283J16883l99247k76489k91137L4866n4016l0823j82419l64990
$$ y = [693764191, 693820648, 693612671, 693672943, 694200363, 693694153, 693784561, 693495560, 693858948, 693979568, 693500214, 693594208, 693330383, 693553162, 693504105, 694284210, 694465714, 693187714, 693222656, 693468094, 693569565, 693311539, 693447495, 693464127, 693378677, 692924728, 692739563, 693111954, 693071289, 693077621, 692360687, 692383804, 692364197, 692068634, 692210312, 692223740, 692657700, 692289658, 692294083, 692234116, 692224045, 692635651, 692328186, 692042923, 691748734, 692136230, 692112122, 692126007, 692237854, 692059326, 692148819, 691669540, 691655121, 691755524, 691806946, 691335831, 691188965, 691633377, 691428833, 691378479, 691022339, 691179428, 691123657, 691043320, 691157913, 690539169, 690631485, 690789719, 690610275, 690138779, 690383911, 690714111, 690617828, 690734711, 690335464, 690058975, 689767838, 689802704, 689748688, 689717865, 689535446, 689170456]
2005F89170456K34680n67474k79541o8283R8114L7841m70047L5630q0033L6469l73612
2015.6F87774200j10092l58429l52783M28314k2888M8065o53076k22092m7760j34582
2025.2F86348877l9444n05981L06930l50876n10101l19824K5634J71738j83334O3095
2034.9F85006714p39441j15585J0833j64947j5717j33133j62277l42941M49142m12826
2044.5F83379822k33383j64414p13501j12839o4697M37775k35062k33688k55051j43890
2054.1F81661072J62201j43814K00882m23203J50452j43509k95334M2114k65732K57416
2063.8F81202545l82614L0975Q4381J65558J2665m03976J40991l78113j28403l05862
2073.4F80038147P5226J59149j55945J79367n0049K74353m75158l28903j31531j32294
$$ y = [689170456, 689405136, 688837662, 688558121, 688489838, 688587952, 688625793, 688155746, 688191376, 688111343, 688147812, 687774200, 687664108, 687305679, 686952896, 687381210, 687358322, 687406387, 686753311, 686531219, 686483459, 686348877, 686309433, 685803452, 686110382, 685759506, 685249405, 684929581, 684955215, 685126953, 684943619, 685006714, 684267273, 684151688, 684162521, 683997574, 683981857, 683848724, 683686447, 683343506, 683792648, 683379822, 683146439, 682982025, 682268524, 682155685, 682090988, 682528763, 682293701, 682060013, 681804962, 681661072, 681823273, 681679459, 681880341, 681457138, 681607590, 681464081, 681168747, 681210861, 680945129, 681202545, 680819931, 680850906, 680935287, 681100845, 681113510, 680709534, 680850525, 680472412, 680344009, 680038147, 680113373, 680272522, 680116577, 680295944, 680245895, 680520248, 680045090, 679716187, 679584656, 679452362]
2083.1F79452362J04218k76871j24054n63889j74484P0267M12292j36566o47659Q4228
2092.7F78199844k23541J96915k44446j75247j90659k67029L43934l90778k02942m31747
2102.4F76614304j48468j06125l13797Q9798k5635K31323j73340J62125r0866j82114
2112F76057205j26190n19028j73340k17819L83835k27203q0796J05515l63388J39694
2121.6F74978485k34756j59226m05426l0136r3765L662J98746m11148K00653m01764
2131.3F73645325Q6517J9760o14548k2354j36490N38254M42887M3945k19803K51465
2140.9F74034958J32675o50406l37143q6517M40750K6932L01132P629j89209L04108
2150.6F73984909k82898K4033l97415J77459J15586l25242L30582K01416J37253p70569
$$ y = [679452362, 679556580, 679279709, 679155655, 678591766, 678417282, 678487549, 678899841, 678763275, 678115616, 678199844, 677976303, 678173218, 677928772, 677753525, 677562866, 677295837, 677639771, 677248993, 677046051, 676614304, 676465836, 676359711, 676045914, 676135712, 676110077, 676341400, 676168060, 676330185, 676239319, 676057205, 675931015, 675411987, 675238647, 675020828, 675404663, 675177460, 675096664, 675202179, 674838791, 674978485, 674743729, 674584503, 674179077, 674148941, 674055176, 674058838, 674257584, 673846436, 674047089, 673645325, 673731842, 673751602, 673137054, 673114700, 672978210, 673516464, 673959351, 674003296, 673783493, 674034958, 674167633, 673517227, 673180084, 673093567, 673534317, 673561249, 673862381, 673870010, 673680801, 673984909, 673702011, 673726044, 673328629, 673506088, 673621674, 673296432, 673627014, 673828430, 673965683, 673195114]
2160.2F73195114j88446o2942O10N76172N3177L81317N7602M9438k76108j45950j56326
2170.8F73483658m45709J34353r9792O20117L36914J25809J87454j32675q469m31290
2180.5F73770370J53351k3040j36185Q0795M51813M11148n1880M25263l27302l53546
2190.1F74400787k57797K5406M34036K28195L02124j43051L38211k81906n60455j10779
2199.8F74374771J0300M55322J75018N12772K14310R6817l64991n61676L0976q8425
2209.4F74855194L08457r6894R9488J78298J14518R8877l02201R3155k49328M0664
2219F75140228J11466J74942O6528j14975L75061j17798M0436o8054J40381K52990
2228.7F76001205l433r7580m55856J74026J7548J31989P5378j4725q316m61426J2360
$$ y = [673195114, 673006668, 672943726, 672944336, 673520508, 673573685, 673955002, 674012604, 674062042, 673785934, 673639984, 673483658, 673037949, 673172302, 673072510, 673692627, 674029541, 674155350, 674342804, 674210129, 674201660, 673770370, 673923721, 673900681, 673764496, 673845291, 674297104, 674708252, 674656372, 675081635, 674754333, 674400787, 674142990, 674168396, 674602432, 674830627, 675132751, 674989700, 675327911, 675046005, 674485550, 674374771, 674385071, 674840393, 675015411, 675528183, 675742493, 675839310, 675474319, 674912643, 674943619, 674855194, 675163651, 675066757, 675166245, 675344543, 675459061, 675557938, 675255737, 675348892, 675099564, 675140228, 675251694, 675426636, 675493164, 675378189, 675753250, 675635452, 675675888, 675607834, 675748215, 676001205, 675997772, 675900192, 675444336, 675618362, 675635910, 675767899, 675843277, 675828552, 675820236, 675358810, 675371170]
2239.3F75371170J10092L82004k01111k69012p7133k35596N20630K43759K85873k23617
2248.9F75907059m17176j43508m19541l9749J41373L02505M7531K2049k67181l57514
2258.6F74775848k84423o6681L87191j15966L76587K67105j8845j01623k70081j40762
2268.2F74808350k75879L91922k365p4997j60294N1270J02844o25611J36719j17264
2277.9F74234695K88468J4572m74854r2697j76315N00717j78451j54953m22440j16119
2287.5F73422623M78210m20990o1416k67640K7314k18659j61209m9133m98963K03858
2297.2F72453995j36414L1433m68292j41525J20392l13263P8811n85327J55640j46866
2306.8F71048584l17307j16119k07291L00141m51660j34888k93121m6235m65393p35092
$$ y = [675371170, 675481262, 675863266, 675662155, 675393143, 675316010, 675080414, 675601044, 675844803, 676130676, 675907059, 675489883, 675346375, 674926834, 674887085, 675028458, 675330963, 675378494, 675400543, 675133362, 674775848, 674491425, 674424744, 674811935, 674695969, 675072556, 675339661, 675320816, 675219193, 674949112, 674808350, 674532471, 674924393, 674922028, 674847031, 674686737, 674738007, 674840851, 674215240, 674351959, 674234695, 674523163, 674537735, 674062881, 673970184, 673793869, 674294586, 674116135, 673961182, 673538742, 673422623, 673900833, 673479843, 673418427, 673150787, 673178101, 672959442, 672798233, 672749100, 672250137, 672453995, 672317581, 672349014, 671880722, 671739197, 671859589, 671546326, 671625137, 671039810, 671195450, 671048584, 670731277, 670615158, 670407867, 670708008, 670256348, 670121460, 669828339, 669782104, 669316711, 668581619]
2316.4F68581619k26974n36194K76642l12271k20642q76847q97064K5635o1646m0970
2326.1F65711288n58853M71115r80911o6070M20684l38516N12390j227111L01132m07563
2335.7F63837585o26602k90680l72085P15256j408158k88696k1362K35443O85043O15692
2345.4F63081436M02680m53797M11682J37329N12162l49198j553878j285019j074982
2354.1F59828415N70297p4539n22919j333542j071014o67191P17774J711426o1264
2362.7F59097443K3346j102906L30353J97983K35824K67334k36129Q79211p69195J30081
2372.4F59053345M93469N0125r8038K24152N22003m27017J49078m08706J68075M50211
2382F60176697p4692L95660K213N8212o45675n44587l70102m45404n6610k63519J20163
$$ y = [668581619, 668354645, 667818451, 668095093, 667782822, 667562180, 666685333, 665788269, 665813904, 665752258, 665711288, 665152435, 665623550, 664642639, 664576569, 664997253, 664658737, 665171127, 663944016, 664245148, 663837585, 663210983, 662920303, 662548218, 663263474, 661855316, 661566620, 661545258, 661780701, 662465744, 663081436, 663484116, 663030319, 663442001, 663579330, 664091492, 663742294, 662188416, 660903397, 659828415, 660398712, 660324173, 659801254, 658467712, 657396698, 656729507, 657447281, 659158707, 659097443, 659120789, 658017883, 658348236, 658546219, 658782043, 659049377, 658813248, 659692459, 658923264, 659053345, 659546814, 659596939, 659498901, 659723053, 660245056, 659818039, 659967117, 659558411, 659726486, 660176697, 660102005, 660497665, 660499878, 660558090, 659912415, 659367828, 658997726, 658552322, 658495712, 658232193, 658352356]
2392.6F58352356j72043L7842l40805m98276k13928o30798l04795l71551K14767k39715
2402.3F55833054l24021R308n12466k84882n84183j75247k19345r232j28936p00684
2411.9F52903366m64554m63791M18930l61709o66657K4872k9907j69220o80542j63422
2421.6F50347366k61917j93100n19562q01315j75857l98941k93427l30582R919j51596
2431.2F47230988m55323l51791n80826n27115m61807J52588j7548l75519n55343k80762
2440.8F43777542k00882j044922m98733m6158J86157P1411m64935o74973k46734o561
2450.5F40851212r05304l90664M7608k6779p15828q22487K34680o00738o44799m09813
2460.1F36617088n06324m12980m96254k18849j15547K46277n42831r19991n63736j67313
$$ y = [658352356, 658180313, 658218155, 657877350, 657379074, 657165146, 656534348, 656229553, 655858002, 656072769, 655833054, 655509033, 655518341, 655005875, 654720993, 654136810, 653961563, 653742218, 653732986, 653604050, 652903366, 652438812, 651975021, 652393951, 652032242, 651365585, 651390457, 651360550, 651191330, 650510788, 650347366, 650085449, 649892349, 649372787, 648571472, 648395615, 647996674, 647703247, 647372665, 647382584, 647230988, 646775665, 646423874, 645843048, 645315933, 644854126, 645006714, 644989166, 644613647, 644058304, 643777542, 643576660, 642531738, 642033005, 641986847, 642173004, 642244415, 641779480, 641104507, 640857773, 640851212, 639945908, 639555244, 639602852, 639576073, 638860245, 638037758, 638272438, 637671700, 637026901, 636617088, 636110764, 635697784, 635201530, 634982681, 634867134, 635113411, 634570580, 633650589, 633086853, 632919540]
2469.8F32919540j11656p46956k89840k24228k57263m53530m19731k89040p84835n33715
2479.4F28808746m76799l44352m75388k05612J564n20744o56929p37076o66046q43163
2489.1F23884201j1749O3858n36461j76354l84635n13535p76253p42073o58760l09715
2498.7F19838524k09847m93164l59344o78711k99568n24178o19926k40631k50206j18103
2508.3F16044846n42260n33256n31159r4833l89328q56895n14565n47867p1792n26772
2518F11436119m60586q4458k93655l82767o89659o76155q73757k88505l64380n96085
2527.6F06726112k79235j3619K39220n84374m64897p36046p83615j90163l17535j72996
2537.3F03422852m44489k17438m40254n33256k54517m37660n18456n14450J67389j09405
$$ y = [632919540, 632807884, 632060928, 631771088, 631546860, 631289597, 630836067, 630416336, 630127296, 629342461, 628808746, 628331947, 627987595, 627512207, 627306595, 627308159, 626787415, 626130486, 625393410, 624727364, 623884201, 623872452, 623936310, 623399849, 623223495, 622838860, 622325325, 621549072, 620806999, 620148239, 619838524, 619628677, 619135513, 618776169, 618097458, 617797890, 617273712, 616653786, 616413155, 616162949, 616044846, 615502586, 614969330, 614438171, 614343338, 613954010, 613097115, 612582550, 612034683, 611962891, 611436119, 610975533, 610891075, 610597420, 610214653, 609524994, 608848839, 607975082, 607686577, 607322197, 606726112, 606446877, 606433258, 606672478, 606088104, 605623207, 604887161, 604103546, 603913383, 603595848, 603422852, 602978363, 602760925, 602320671, 601787415, 601532898, 601095238, 600576782, 600062332, 600229721, 600120316]
2546.9F00120316n13993o41823n93757l60756o10771m32968o12641m69894k24915p0839
2556.6E95587959j08604m63219o04286p59048o00815q26149K2621K18086n66635j06430
2566.2E91793480j74446n08042q45336o63834l91693j06964p0992m25377k21481m88129
2575.9E87897186j69105l66631o63605n44433q50105k38038j38664l93295m81453k36168
2585.5E83815689m35142p93534m24461l63846l8261k62528l68156m73137n83382k82059
2595.1E79791183o29081o78482m53873q7624n86929q39691m17976k26708p9498n88455
2604.8E75202866o23932q62236m59748j81884o17562l46145n26772l43590n93643n51071
2614.4E70096283l88222p57255o19812p81784m17710k35786j78871j46828l32489q58345
$$ y = [600120316, 599606323, 598964500, 598370743, 598009987, 597399216, 596966248, 596353607, 595883713, 595658798, 595587959, 595479355, 595016136, 594411850, 593652802, 593051987, 592225838, 592248459, 592466545, 591899910, 591793480, 591619034, 591110992, 590265656, 589601822, 589210129, 589103165, 589032173, 588606796, 588385315, 587897186, 587728081, 587361450, 586697845, 586153412, 585303307, 585065269, 584926605, 584533310, 584051857, 583815689, 583380547, 582587013, 582162552, 581798706, 581760445, 581497917, 581129761, 580656624, 580073242, 579791183, 579162102, 578483620, 578029747, 577942123, 577355194, 576515503, 576097527, 575870819, 575791321, 575202866, 574578934, 573716698, 573256950, 573075066, 572457504, 572111359, 571584587, 571240997, 570647354, 570096283, 569708061, 568950806, 568330994, 567549210, 567131500, 566895714, 566716843, 566570015, 566237526, 565379181]
2624.1E65379181j177902m95377l51715j76353n11361m88853k93617p57752o16722
2632.8E60509529n21469j54724m48494m38080n15480p60117l51982o04019m89807q29391
2642.4E55395966m85077k98348o12945l44315o31828k53334n13420l75252k21138n24674
2652E51135635l46145q44689n68428k93388j55029m48800m58450r7961n44815m48799
2661.7E46929131n58625m48608p03697o28853j09749j66435J37024m33998q07572o34956
2671.3E42573662j11046L0556m24767m20723n12390j36528l81203n78270l37753m21677
2681E39279861n26161o98585m80843k06032K98539l51487p36084j17302m60014o27556
2690.6E35374336m64248r0180l06320k99530o1607n10064m20951l06664l20396m53339
$$ y = [565379181, 564201279, 563705902, 563354187, 563177834, 562666473, 562177620, 561884003, 561126251, 560509529, 559988060, 559833336, 559384842, 558946762, 558431282, 557671165, 557319183, 556715164, 556225357, 555395966, 554910889, 554612541, 553999596, 553655281, 553023453, 552770119, 552256699, 551881447, 551660309, 551135635, 550789490, 549944801, 549376373, 549082985, 548927956, 548479156, 548020706, 547922745, 547377930, 546929131, 546370506, 545921898, 545218201, 544589348, 544479599, 544313164, 544450188, 544016190, 543208618, 542573662, 542462616, 542493172, 542068405, 541647682, 541135292, 540998764, 540617561, 540039291, 539701538, 539279861, 538753700, 538055115, 537574272, 537368240, 537666779, 537315292, 536579208, 536461906, 536001892, 535374336, 534910088, 534819908, 534513588, 534214058, 534152451, 533642387, 533221436, 532914772, 532594376, 532141037]
2700.3E32141037l11470m12216m91257l04527n36499k79541m69971m25415j3046l63121
2709.9E28533974o88362k85492K07748o7825k55051m47349m59252m83551l95317k95334
2719.5E25364189k75993K19955j13144l37486n15099l14865k56729q54988l47328m21753
2729.2E22146759k18697k2087r5710J11579l27949r7504k81181n44739m90761l43704
2738.8E19836006p7667j57127k366q6860q5030j66969j66054k60391k29302l24173
2748.5E18280067n80024J1978k80686k14309j10207m76799j55716m4174o7596n60608
2758.1E15801926k85035k96707n50460k86065m60662j5870j46522n26467n90667m69246
2767.8E12174225m17519k17705J95122k14233j35155n02624n58548j37406m44412n45998
$$ y = [532141037, 531829567, 531417351, 530926094, 530621567, 530085068, 529805527, 529335556, 528910141, 528897095, 528533974, 527845612, 527560120, 527767868, 527700043, 527444992, 526997643, 526538391, 526054840, 525659523, 525364189, 525088196, 525308151, 525195007, 524857521, 524342422, 524027557, 523770828, 522915840, 522568512, 522146759, 521928062, 521905975, 521810265, 521921844, 521593895, 521496391, 521215210, 520670471, 520179710, 519836006, 519758339, 519601212, 519598846, 519511986, 519426956, 519259987, 519093933, 518833542, 518604240, 518280067, 517700043, 517712021, 517431335, 517217026, 517106819, 516630020, 516474304, 516430130, 516362534, 515801926, 515516891, 515220184, 514669724, 514383659, 513922997, 513907127, 513760605, 513234138, 512643471, 512174225, 511756706, 511539001, 511734123, 511519890, 511384735, 510882111, 510323563, 510186157, 509741745, 509195747]
2777.4E09195747o18705k91176m77257l20320j92108m83055l98102q62808o61622m34761
2787E04455833k06337k11029m47311l18642o84013o91109p74727n74989l36189l03345
2796.7D99908142l51143p03506n53742q15696r43222p96776l35770P7362l37944q36677
2806.3D94311028j246453o13899j89896p26776j103973q74367m83971n74302n20554
2815D87976837p53250r37653q63113m56352m43764j168327q53730n21011o10199q67729
2824.7D80501709r37500n93567q50487j122398j123047p65152n39856p06405p39403
2833.3D73123894p84683r39408j206779j337738j382065j403504j429443j387863j532822
2842D61719589j530685j429978j945610j947822j568070j874962k188606j871910j795349
$$ y = [509195747, 508577042, 508285866, 507808609, 507488289, 507296181, 506813126, 506415024, 505552216, 504890594, 504455833, 504249496, 504038467, 503591156, 503272514, 502588501, 501897392, 501122665, 500547676, 500211487, 499908142, 499556999, 498853493, 498299751, 497484055, 496540833, 495744057, 495408287, 495485649, 495147705, 494311028, 493064575, 492450676, 492260780, 491534004, 490430031, 489555664, 489071693, 488497391, 487976837, 487223587, 486285934, 485422821, 484966469, 484522705, 483354378, 482500648, 481979637, 481369438, 480501709, 479564209, 478970642, 478120155, 476997757, 475874710, 475109558, 474569702, 473863297, 473123894, 472339211, 471399803, 470193024, 468855286, 467473221, 466069717, 464640274, 463252411, 461719589, 460188904, 458758926, 456813316, 454865494, 453297424, 451422462, 449233856, 447361946, 445566597]
2850.7D45566597j415100p13577j032944q52318m48837k81220L1243o6223j74523l55072
2860.3D40258026k77367k61116k41966o69021j091538o53381p92847q02765o61583
2869D34806442q08868q50029n15213l82996q43239o18248p11898q84056r49555j146202
2878.7D27096138n59502j92413m60548r06945q56895r90639j031914o47010j012040
2887.3D20438232j131134o41937o25076j043244p94105q59146r09004l80211q19092
2896D13235283j175461j360435j084977m92820l70484m58107p47947m62647o03981
2904.7D06478424r67064j027717q76198p92427r90029q43734j335144j455269j412888
2913.4C96777954j126480o39763j403084j514473j453285j553306j407967r62906k02064
$$ y = [445566597, 444151497, 443437920, 442404976, 441552658, 441103821, 440822601, 440853844, 440787621, 440613098, 440258026, 439980659, 439719543, 439477577, 438808556, 437717018, 437063637, 436270790, 435468025, 434806442, 433997574, 433147545, 432632332, 432249336, 431406097, 430787849, 430075951, 429191895, 428242340, 427096138, 426536636, 426344223, 425883675, 424976730, 424119835, 423129196, 422097282, 421450272, 420438232, 419307098, 418665161, 418040085, 416996841, 416202736, 415343590, 414434586, 414054375, 413235283, 412059822, 410699387, 409614410, 409121590, 408751106, 408292999, 407545052, 407082405, 406478424, 405511360, 404483643, 403607445, 402815018, 401824989, 400981255, 399646111, 398190842, 396777954, 395651474, 395011711, 393608627, 392094154, 390640869, 389087563, 387679596, 386716690, 386514626]
2922.1C86514626n32837j210518q85697K41852r6054p03621n5618K63710J31264r6856
2931.7C83570251O32210R51042J65787J1406N58281L83911j49689O47736J031914Q73375
2941.3C88676224P18155M47426Q57620R17740N18379K56653N92422R43070P34062M57916
2951C95119667O39229O54106j67503k0562O51665P91664N74379M49944P00645N70259
2960.6C99963493P74193R90486O91719L58887O39801J006851N97115M20036N40276
2969.3D05982857P27653N65148N92842Q31299O43692P96356O42051K81029L22762M87327
2979D11873016M83895O31866O41785R4528k25601j49155M74510M55780M1161J10168
2988.6D14431953K16446L84903J48049J08871l57933n49850k13356m65851o3553L4409
$$ y = [386514626, 385981789, 384771271, 383885574, 384127426, 384031372, 383327751, 383272133, 383535843, 383667107, 383570251, 384202461, 385153503, 385319290, 385330696, 385888977, 386272888, 386123199, 386770935, 387802849, 388676224, 389394379, 389841805, 390699425, 391617165, 392135544, 392392197, 392984619, 393927689, 394661751, 395119667, 395758896, 396413002, 396245499, 396224937, 396876602, 397668266, 398242645, 398692589, 399393234, 399963493, 400737686, 401728172, 402419891, 402778778, 403418579, 404425430, 405022545, 405442581, 405982857, 406710510, 407275658, 407868500, 408699799, 409343491, 410139847, 410781898, 411062927, 411385689, 411873016, 412356911, 412988777, 413630562, 413725090, 413499489, 413350334, 413824844, 414280624, 414321785, 414431953, 414648399, 415033302, 415181351, 415290222, 414932289, 414382439, 414169083, 413703232, 413639679, 413674088]
2998.2D13674088k01111k44332m28238p22885q88481l35808k85606n42297o06499o21033
3007.9D08797798m49486n27954m96559k88849m68063q42400q37822p00760n10559n03769
3017.5D03171577l91197o89773j108589m38080m82750o44150p40509j006126p39480
3026.2C96930923p96165n86624j098175r89762k50549q85200r38988n56374l92036
3034.9C90437050q07610j221733j141281j030388p88307p98988m67759l87496o16379
3043.6C83177109p81441j112900j139450r92927q19130p35436n42869p44553q58345
3052.2C75450058p88155j069297p43447n98182j010781j102295p22999o72493q64868
3060.9C67877541p05414p23725p19947n47486k76336o67572j176224j013756q89740
$$ y = [413674088, 413472977, 413228645, 412800407, 412077522, 411189041, 410853233, 410567627, 410025330, 409418831, 408797798, 408348312, 407820358, 407323799, 407034950, 406566887, 405724487, 404886665, 404185905, 403675346, 403171577, 402780380, 402090607, 400982018, 400543938, 400061188, 399417038, 398676529, 397670403, 396930923, 396134758, 395548134, 394449959, 393460197, 393209648, 392324448, 391385460, 390829086, 390437050, 389629440, 388407707, 387266426, 386236038, 385447731, 384648743, 384180984, 383793488, 383177109, 382395668, 381282768, 380143318, 379150391, 378331261, 377595825, 377052956, 376308403, 375450058, 374661903, 373592606, 372849159, 372250977, 371240196, 370137901, 369414902, 368742409, 367877541, 367172127, 366448402, 365728455, 365180969, 364904633, 364237061, 363060837, 362047081, 361157341]
3069.6C61157341o66313o76537n71022o00013p87163p06559o81877n26390o39267n57174
3079.2C54745026n08004m90036n69534r67178q55828j028366q69064m02031m55322
3087.9C48599663p78275j146049p59774l87649m01039m14009n46494r04999j149864
3096.6C42111511p65915l33328n58128j316376q94051j33476o35605p43484m68216
3105.3C36262932p25670r30176n92003m90188j141777j347885n98069j64795p92122
3114C29480247r93194l09372m45061q86955q46481r72672p03850o57501r05838o17409
3123.6C22141914n41801p00111r66015p96471p26013q22926o03237p32212n79472j055755
3133.3C14617901j189976o57692o96888m7607k64492j212521j334247p05529m99572
$$ y = [361157341, 360491028, 359814491, 359243469, 358643456, 357856293, 357149734, 356467857, 355941467, 355302200, 354745026, 354237022, 353746986, 353177452, 352210274, 351354446, 350326080, 349457016, 349054985, 348599663, 347821388, 346675339, 345915565, 345527916, 345126877, 344712868, 344166374, 343261375, 342111511, 341345596, 341012268, 340454140, 339137764, 338243713, 338110237, 337474632, 336731148, 336262932, 335537262, 334607086, 334015083, 333524895, 332383118, 331035233, 330437164, 330272369, 329480247, 328487053, 328177681, 327732620, 326845665, 325999184, 325026512, 324322662, 323665161, 322759323, 322141914, 321600113, 320900002, 319933987, 319137516, 318411503, 317588577, 316985340, 316253128, 315673656, 314617901, 313427925, 312770233, 312073345, 312025738, 311761246, 310548725, 309214478, 308508949, 308009377]
3141.9C08009377j080590p00855n95875q00953o25267m38728m60014j114026r85736
3150.6C01207333o15845q50067r87969p57065p17391q36831l68118l87096r91288j234989
3160.3B93460674j004543p05147l82385o78082j199398p22999q12359p49664o27194
3168.9B86578903r87415m30012p72457j090775m35256l86582n60226j007614j374226
3177.6B79534340r42364k68211k77348r22165j022644m87385n45501q28343q33053
3186.3B73407326p29466l26481l86829j065140j235065m94232k01569o04877r66301
3195B67397366r04923m44546o66790n73940n59559p33623m08764p18823n25722n90668
3204.6B61270008q66394p85427q89206l04832l73459o71215o62499n65719j34449k40918
$$ y = [308009377, 306928787, 306227932, 305632057, 304831104, 304205837, 303767109, 303307095, 302193069, 301207333, 300591488, 299741421, 298753452, 297996387, 297278996, 296442165, 296074047, 295686951, 294695663, 293460674, 292456131, 291750984, 291368599, 290690517, 289491119, 288768120, 287955761, 287206097, 286578903, 285591488, 285161476, 284389019, 283298244, 282862988, 282476406, 281916180, 280908566, 279534340, 278591976, 278323765, 278046417, 277124252, 276101608, 275614223, 275068722, 274240379, 273407326, 272677860, 272351379, 271964550, 270899410, 269664345, 269170113, 268968544, 268363667, 267397366, 266492443, 266047897, 265381107, 264807167, 264247608, 263513985, 263105221, 262386398, 261860676, 261270008, 260403614, 259618187, 258728981, 258424149, 258050690, 257379475, 256716976, 256151257, 256016808, 255775890]
3214.3B55775890n88474q33568q50354p00969k96650l76912r49268q90941l56598j43643
3223.9B49788513q18443o62232l62720p39059m96274l10821l83320o86188n24654l51715
3233.5B44453087m96369n75485r86061p53651k89077N665j4515m43116p10106p34558
3243.2B39455814l43990j46923m19998p34844m99611l29495m52575n55077o83823l00617
3252.8B34988861k25754m19750o90517o99826k62966j97582n46131r66168m19159j94091
3262.5B30366917k49749k34165n88379n8174j80893n92003m34875k44503k83451o60458
3272.1B26840267n79033l66878K42157j22566j047478q90236k63691K82516n45177
3280.8B23549881q83293k33421J02405L7499n36118n77393l72295Q0509K00863o5021
$$ y = [255775890, 255187416, 254353848, 253503494, 252802525, 252505875, 252128963, 251179695, 250288754, 249932156, 249788513, 248970070, 248307838, 247945118, 247206059, 246709785, 246398964, 246015644, 245329456, 244804802, 244453087, 243956718, 243381233, 242395172, 241641521, 241352444, 241358109, 241343594, 240900478, 240190372, 239455814, 239111824, 238964901, 238544903, 237810059, 237310448, 236980953, 236528378, 235973301, 235289478, 234988861, 234763107, 234343357, 233652840, 232953014, 232690048, 232492466, 231946335, 230980167, 230561008, 230366917, 230117168, 229883003, 229294624, 229236450, 229055557, 228463554, 228028679, 227784176, 227500725, 226840267, 226261234, 225894356, 226136513, 226013947, 224966469, 224076233, 223812542, 224095058, 223549881, 222666588, 222433167, 222535572, 222573071, 222036953, 221459560, 221087265, 221167774, 221368637, 221303616]
3290.4B21303616o0120m80003r32637q55922q4877J73835m25129o60705l6793M15020
3300.1B18356285k32220p22618o79187k63997r3574n69935n72586J4667K480o61449
3309.7B14577866p24240o13556o0882K75345l75672m90131l75252k18677l23067m09260
3319.4B11262474m01916q26645m73500P0496j0452o33736r77535n04685k20718j33667
3329B07150116m67796j167164j137905n27516m3068K50378k06928p05090l68461l62530
3338.7B02414036o64349p93419o86149o91281n02109n9967k21119k28729l99285l56197
3348.3A97811432j4935l23658l82881k96879k9888j76353p17335o61049o29558j67027
3357.9A94411869K78988k27737m65241q392K07576L6145m77352q94051o17733n779
$$ y = [221303616, 221243496, 220763493, 219830856, 218974934, 218890057, 219063892, 218638763, 217978058, 217941265, 218356285, 218124065, 217401447, 216722260, 216458263, 216364689, 215794754, 215222168, 215236835, 215239315, 214577866, 213853626, 213240070, 213179188, 213454533, 213078861, 212588730, 212213478, 211994801, 211671734, 211262474, 210860558, 210033913, 209560413, 209630909, 209620457, 208986721, 208009186, 207504501, 207283783, 207150116, 206682320, 205515156, 204377251, 203849735, 203806667, 204057045, 203850117, 203145027, 202776566, 202414036, 201749687, 200956268, 200270119, 199578838, 199076729, 199016762, 198795643, 198566914, 198167629, 197811432, 197796497, 197472839, 197089958, 196793079, 196763191, 196586838, 195869503, 195208454, 194578896, 194411869, 194690857, 194463120, 193997879, 193989487, 194197063, 194233208, 193755856, 192861805, 192244072, 192238293]
3367.6A92238293N46798P6104o80542m11301j64700j75571O8264j92356n27573k2163
3377.2A90755253J38759j31855l42845j19324L53603j62659m02774l68500m57687J12037
3386.9A89374008L24993j08661m75178j99108J26724K36702Q907k93445r3842J28384
3396.5A89029484K67219k31399m59500k75764o4602L66154j0967l15857j71795J88560
3406.2A88321533K93217K0695J39122J18942J02959P7762K64988k9697l23010L08743
3415.8A89295254L06358K48795J93653Q2168K13070Q3180k03743k79579M32663N78899
3425.5A90950718L57609L59897J74275P4177j75362K66819P56988L44353R6245L12862
3435.1A93518581M58546L85532J74370J21765K13032L86791P20711K71511M50421O71920
$$ y = [192238293, 192785091, 192861195, 192180653, 191769352, 191604652, 191429081, 191497345, 191304989, 190777416, 190755253, 190894012, 190762157, 190419312, 190299988, 190653591, 190490932, 190088158, 189719658, 189261971, 189374008, 189699001, 189590340, 189115162, 188916054, 189042778, 189279480, 189288387, 188994942, 188901100, 189029484, 189296703, 189065304, 188605804, 188330040, 188265438, 188631592, 188620625, 188304768, 188132973, 188321533, 188614750, 188635445, 188774567, 188893509, 188996468, 189074230, 189339218, 189309521, 188986511, 189295254, 189601612, 189850407, 190044060, 190126228, 190339298, 190422478, 190218735, 189939156, 190371819, 190950718, 191308327, 191668224, 191842499, 191916676, 191741314, 192008133, 192765121, 193109474, 193205719, 193518581, 193977127, 194362659, 194537029, 194658794, 194871826, 195258617, 195979328, 196250839, 196701260, 197373180]
3444.7A97373180O3591M58393J04142K33001Q32539M92840N31807L09810M33865O29864
3454.4B01463032O07090O63452N26771J55468L7938Q59565P27368M14695N88265O32992
3464B06676636P82108M70200N42354O21300O40945N99900O78596O78253M56791J150475
3473.7B13297558Q13408M13227P93705K57377M38729J114673J036187R58519Q21991
3482.3B19945374N85613P27272J93653M64325J496544Q93440R8076M95205J434040
3491B26333542Q72555K81505Q19111Q19759R95865M14391N02205J207962Q34808O62594
3500.7B33744297J035805J444721P45506N34878J013432J157684J179314J396732J384888
3509.4B43637257L04355P66239Q59414L14998Q22392Q64124R59225J194839R12190
$$ y = [197373180, 197436771, 197895164, 197999306, 198232307, 199064846, 199557686, 200089493, 200399303, 200833168, 201463032, 202070122, 202733574, 203260345, 203415813, 203453751, 204313316, 205040684, 205455379, 206043644, 206676636, 207458744, 207928944, 208471298, 209092598, 209733543, 210333443, 211012039, 211690292, 212147083, 213297558, 214110966, 214524193, 215317898, 215575275, 216014004, 217128677, 218164864, 219123383, 219945374, 220530987, 221258259, 221451912, 221916237, 223412781, 224306221, 224404297, 224899502, 226333542, 227206097, 227487602, 228306713, 229126472, 230122337, 230536728, 231038933, 232246895, 233081703, 233744297, 234780102, 236224823, 236970329, 237505207, 238518639, 239676323, 240855637, 242252369, 243637257, 243941612, 244707851, 245567265, 245882263, 246704655, 247568779, 248528004, 249722843, 250635033]
3518B50635033M44946J062889J428452R73110P37114R47494J405411O38180Q19130
3526.7B59091759J404056J229706J173573J104660J261177O19335P46155J182651J840306
3535.4B69653378J484260K56443J130448J032276J545944K132530J592255Q95862N23262
3544.1B80246658J279946J155300J897468J328679R15050J463947J508656J875992
3551.8B91671696N77945J448098J520443J262741K069034J379986J810265J680622
3559.5C03420830J079635O99215K077294K064514R77745L211746J844330Q77476Q96721
3568.2C17149506Q34560L063030J768723J254043J690369K187881J991578J803093
3575.9C31742783J707267Q87566K413940K069283J582489J977615K023964J656723
$$ y = [250635033, 251079979, 252142868, 253571320, 254544430, 255281544, 256229038, 257634449, 258272629, 259091759, 260495815, 261725521, 262899094, 264003754, 265264931, 265884266, 266630421, 267813072, 269653378, 271137638, 271394081, 272524529, 273556805, 275102749, 277235279, 278827534, 279723396, 280246658, 281526604, 282681904, 284579372, 285908051, 286823101, 288287048, 289795704, 291671696, 292249641, 293697739, 295218182, 296480923, 298549957, 299929943, 301740208, 303420830, 304500465, 305199680, 307276974, 309341488, 310319233, 313530979, 315375309, 316252785, 317149506, 317984066, 321047096, 322815819, 324069862, 325760231, 327948112, 329939690, 331742783, 333450050, 334337616, 336751556, 338820839, 340403328, 342380943, 344404907, 346061630]
3583.6C46061630J024513L840561K905693K09198K221108M88434J807747K990265L304634
3592.3C64853783J730308J213341L405228Q56437K154541L601113J551895K603836
3600C81970482J752052J518936K749482K309188K432785K866326L024978R60236L003426
3608.7D02587891J294021m80995N842476L320160N7335L942795O75087L266296L468285
3617.4D23973351Q32443L283310J788139K530251L463974K450256J892319K574463
3625.1D42788506K799491K850609O594086L604889m948158L223381L391037M438820
3632.8D64742661K819175L81317K983704L725204L350411J468239J822815L293419
3640.5D84586945L474807K483559J400795K946205L744011M956474R41696q65364O431961
$$ y = [346061630, 347086143, 350926704, 353832397, 354041595, 356262703, 356751137, 358558884, 361549149, 364853783, 366584091, 367797432, 371202660, 372059097, 374213638, 377814751, 379366646, 381970482, 383722534, 385241470, 387990952, 390300140, 392732925, 395599251, 398624229, 399584465, 402587891, 403881912, 403400917, 409243393, 412563553, 412620888, 416563683, 417238770, 420505066, 423973351, 424805794, 428089104, 429877243, 432407494, 435871468, 438321724, 440214043, 442788506, 445587997, 448438606, 455032692, 458637581, 453689423, 456912804, 460303841, 464742661, 467561836, 467943153, 470926857, 474652061, 478002472, 479470711, 481293526, 484586945, 488061752, 490545311, 491946106, 494892311, 498636322, 503592796, 504534492, 503669128, 510101089]
3649.2E10101089K343064k16828k31628L590927M082260M170304N942802m686737O82182
3657.9E25777435N244179K880020K677155J079635K220421J763191K099266K141114
3665.6E45882416P69272L969955K725220P69501K071800l609581J208420O342964Q657264
3674.3E68787231L867608j3216629l65944O127090M457932o56853N28030K176705J895752
3682.9E73600922J588745N14526O57120M211235P217407n867500m337158Q058586l167115
3691.6E82476768k244644M424553J528321J673698N27496j57051J273117M59824K257423
3700.3E92219505L177147l092994k544175L817330K083282o4773N16853K175522L648224
3709F01935921n449028K262916O244583r808807J826820M218827O26754K83890J733971
$$ y = [510101089, 512444153, 512227325, 511995697, 515586624, 519668884, 523839188, 529781990, 525095253, 525777435, 531021614, 533901634, 536578789, 537658424, 539878845, 541642036, 543741302, 545882416, 546651688, 550621643, 553346863, 554116364, 556188164, 552578583, 553787003, 560129967, 568787231, 572654839, 559438210, 559072266, 565199356, 569657288, 569000435, 569528465, 571705170, 573600922, 575189667, 575704193, 576361313, 580572548, 587789955, 581922455, 577585297, 585643883, 582476768, 580232124, 584656677, 586184998, 587858696, 588386192, 588229141, 589502258, 589962082, 592219505, 595396652, 592303658, 589759483, 593576813, 595660095, 595595322, 596112175, 598287697, 601935921, 596486893, 598749809, 604994392, 595185585, 597012405, 601231232, 601857986, 602141876, 603875847]
3717.7F03875847J687012k501564O2408N208588r72634m653816L371620J177445N08804
3726.3F07763710j706352k133522K681999J617432N832557j52702p959099O932717
3734F12876740K281532o614189L45535K383499o42204M56428L259163k805328J933861
3742.7F13475037J1607399l378945j8617248O153221N219803O442718l70560j0174980
3750.4F10356445R134636j682396p439651L716469K756996L203125m106026J084671
3758.2F17024269O004410n413933k405014L284111R50775J9455L472252j368713m554520
3766.8F17013092K005692M265441J652871p637024R79347L198738L6125P20978q50143
3775.5F21385117p4578P00989L439064J338768o651688J254311J563911Q93708K625656
$$ y = [603875847, 605562859, 603061295, 603123703, 608332291, 607359657, 602705841, 606077461, 607254906, 607763710, 606057358, 603923836, 606605835, 608223267, 614055824, 613903122, 605944023, 612876740, 615158272, 608544083, 608889618, 611273117, 610630913, 611087341, 614346504, 611541176, 613475037, 625082436, 621703491, 603086243, 609239464, 614459267, 620901985, 620531425, 610356445, 619491081, 617808685, 610369034, 614085503, 616842499, 620045624, 615939598, 617024269, 623028679, 617614746, 615209732, 618493843, 619444618, 619464073, 622936325, 621567612, 617013092, 619018784, 623284225, 624937096, 617300072, 618279419, 621478157, 621514282, 622235260, 621385117, 621310539, 622011528, 625450592, 626789360, 620137672, 621391983, 622955894, 623849602, 626475258]
3784.2F26475258j972695j227455J060372N58738J17188l90472J40762j73645K98004
3792.9F24886055o33469L31688L601990k152061l600655J896629L712693O602096l696480
3801.5F30948486j0389785K041359J697807L695297N315437o360206m628220L892975
3809.3F26213150J990128l95852J7052n9166Q67195M934349l0708j2838402K991371
3817.9F23689117M910927L907051M601708j1954041j789322L767243J570053K118111
3825.7F30820847L78646m077758o80313J746864K508163K318955o169815O82716O842918
3834.3F34371223l630142k356567P155228m568902o691246N469361k754135o37169
3842.1F26357651O388435j132049m095536J724930J056938o68373P29866o45637J608658
$$ y = [626475258, 624502563, 623275108, 624335480, 624894218, 625011406, 624620934, 624761696, 624588051, 624886055, 624252586, 624584274, 628186264, 626034203, 622433548, 624330177, 628042870, 634644966, 630948486, 620558701, 622600060, 624297867, 627993164, 633308601, 626948395, 622320175, 626213150, 628203278, 627807426, 627824478, 627765312, 628632507, 633566856, 633536148, 620697746, 623689117, 628600044, 632507095, 637108803, 625154762, 623365440, 627132683, 628702736, 630820847, 631199493, 627121735, 626441422, 628188286, 630696449, 633015404, 626845589, 627528305, 634371223, 630741081, 628384514, 635539742, 630970840, 624279594, 629748955, 626994820, 626357651, 632746086, 631614037, 627518501, 629243431, 630300369, 629631996, 630361862, 629716225, 631324883]
3850.7F31324883M842681k841873N458145j1982803m682350Q234176j78985j902695
3858.4F28271179J458283J601829J875725m844666p20939O389885k863655o266442
3866.2F24901199K727471M617500O448364l583831j0278245J295968M665641M340363
3873.9F35134430p095070j132622K689553n33295J862411M778328j718864p982216
3881.6F26002655K801590J350594J711921O252556j0144386j200485L251838J63651
3889.3F30189934L137779Q90350n363922l42178K515755j672745k55013N98030J881981
3898F31579971L011742p689400L038597K946740m016572L896676k408982j787300L72544
3906.7F28944016o9237J405525m60053J35346M64897j95389O6529J36032N38253J923409
$$ y = [631324883, 636167564, 633325691, 638783836, 626801033, 622118683, 630352859, 630173874, 628271179, 629729462, 631331291, 633207016, 628362350, 627641411, 634031296, 631167641, 624901199, 627628670, 632246170, 638694534, 635110703, 624832458, 626128426, 630794067, 635134430, 628039360, 626906738, 629596291, 629062996, 630925407, 635703735, 633984871, 626002655, 628804245, 630154839, 631866760, 638119316, 627974930, 626774445, 630026283, 630189934, 633327713, 634218063, 628854141, 628511963, 631027718, 629354973, 629099960, 629697990, 631579971, 634591713, 626902313, 629940910, 632887650, 628871078, 632767754, 630358772, 628571472, 628944016, 628874779, 630280304, 629820251, 629955597, 630420494, 630225105, 630291634, 630427666, 630965919, 632889328]
3916.3F32889328j680756l675575K979469R03054l083458J028023J171798O07262j240006
3925F29899139k754478N03616J222344J185264R8343o02493J538925p89566j523247
3933.7F28777847O93131l1967K4871K74582r5214m71192o80618Q92830J627845k746200
3943.3F28265915j991654J484337J321297J203728j317940j2589N42946k215728J212120
3952F28492432J201553k38419l13263l99742P0420o52619N3139n94635P73354J106872
3961.6F29499092j401520o8092K84080J33210J29661L3531M11721k48986k93388P50465
3971.3F29229774M00620q39348o33736o63719j0872j54876o2409J368828N67055l10745
3980.9F28890572o56128k45209K0637L73154K70805r82208R041L92914L44658K11754
$$ y = [632889328, 631208572, 627532997, 630512466, 631415520, 628332062, 629360085, 630531883, 631139145, 629899139, 627144661, 627648277, 628870621, 630055885, 630154228, 629551735, 631090660, 630301094, 628777847, 629470978, 629439011, 629463882, 629738464, 629643250, 629172058, 628491440, 629384270, 631012115, 628265915, 626274261, 627758598, 629079895, 630283623, 628965683, 628953094, 629496040, 627280312, 628492432, 629693985, 629455566, 629142303, 628742561, 628812981, 628160362, 628213501, 627618866, 628392220, 629499092, 628097572, 628029480, 628313560, 628446770, 628576431, 628609962, 629021683, 628772697, 628479309, 629229774, 629630394, 628791046, 628157310, 627493591, 627482719, 627327843, 627265434, 628634262, 629201317, 628890572, 628234444, 627989235, 628009872, 628383026, 628653831, 627671623, 627680664, 628073578, 628418236, 628629990]
3990.6F28629990r0409K00081p5607P8354p51076k32239O14662K23885K41623j05629
4000.2F28733635
$$ y = [628629990, 628539581, 628739662, 628664055, 628742409, 627991333, 627759094, 628373756, 628597641, 628839264, 628733635]
##END=$$ End of the data block
