##TITLE=$$ Begin of the data block
##JCAMP-DX=5.00 $$ ACD/SpecManager v 10.08
##SPECTROMETER/DATA SYSTEM=Varian
##DATE=14 Jan 2013 09:28:10
##DATA TYPE=INFRARED SPECTRUM
##DATA CLASS=XYDATA
##ORIGIN=
##OWNER=
##NPOINTS=3735
##FIRSTX=399.26403809
##LASTX=4000.35498047
##MAXX=4000.35498047
##MINX=399.26403809
##MAXY=69.59037018
##MINY=18.83233643
##XFACTOR=1.0000000000
##YFACTOR=0.000000100000000
##FIRSTY=41.11369705
##DELTAX=0.96440572
##XUNITS=1/CM
##YUNITS=TRANSMITTANCE
##XYDATA=(X++(Y..Y))
$$ plain form
399.3 411136971 414847336 419923630 417067680 409350853 405955811 404365616 404048920 405272713 403779335
407.9 403779335 397641068 399302444 405923042 406605606 406067352 405569344 405250092 402129288 403091316
416.6 403091316 405177689 406600876 417429810 405692749 403832703 403789787 398534508 398070488 395354385
425.3 395354385 399432907 400999069 399754257 400317497 396268082 393633156 391990356 394460907 399659309
434 399659309 398514557 394966202 395393677 395860901 396206017 397319717 393120270 392297897 396130486
442.7 396130486 395121040 395236320 394466171 394678993 394975624 393219528 395102882 394953423 391555023
451.3 391555023 391199150 392650719 394780846 396435280 395839310 396345749 393787804 387168999 384454002
460 384454002 384199905 386552582 388887787 390688896 392476578 387673531 383667793 386470909 387095108
$$ packed form
399.3D11136971L710365N076294k855950p716827l395042j590195l16696J223793j493378
407.9D03779335o138267J661376O620598O82564n38254m98008l19252l120804R62028
416.6D03091316K086373J423187J0828934j1737061j860046m2916n255279m64020k716103
425.3C95354385M078522J566162j244812N63240m049415k634926j642800K470551N198402
434C99659309j144752l548355M27475M67224L45116J113700m199447q22373L832589
442.7C96130486j009446J15280p70149K12822K96631j756096J883354j49459l398400
451.3C91555023l55873J451569K130127J654434n95970N06439k557945o618805k714997
460C84454002k54097K352677K335205J801109J787682m803047m005738K803116O24199
$$ plain form
468.7 387095108 387453194 390852013 393000298 385218506 377451248 379268684 382485924 384487190 380757141
477.4 380757141 379015427 380954323 379388123 378783646 377991028 378434296 378572807 375525475 376052170
486.1 376052170 377869072 376143684 372731552 373059616 375475082 376532059 375190277 373414307 373107376
494.7 373107376 373767815 375519562 375991631 374579697 373144646 374093170 372351036 368933716 370626869
503.4 370626869 369301796 368561668 368627472 368539734 368047714 365401039 366916046 367405930 367186470 367919121
513.1 367919121 368032532 367751541 364620018 364220123 364153404 362794228 363329391 363445396 362329102
521.7 362329102 360958023 360993996 360668106 360600243 360395813 360400238 360955696 360588493 360000954 360508232
531.4 360508232 362346497 361498566 359703522 359529457 359637909 358862495 357507591 358253479 358405724
$$ packed form
468.7C87095108L58086L398819K148285p781792p767258J817436L217240K001266l730049
477.4C80757141j741714J938896j566200o04477p92618M43268J38511l047332N26695
486.1C76052170J816902j725388l412132L28064K415466J056977j341782j775970l06931
494.7C73107376O60439J751747M72069j411934j435051R48524j742134l417320J693153
503.4C70626869j325073p40128O5804q7738m92020k646675J515007M89884k19460P32651
513.1C67919121J13411k80991l131523l99895o6719j359176N35163J16005j116294
521.7C62329102j371079L5973l25890o7863k04430M425N55458l67203n87539N07278
531.4C60508232J838265q47931j795044j74065J08452p75414j354904P45888J52245
$$ plain form
540.1 358405724 358168106 358814926 359803810 359316292 356390381 355031166 354880257 355016823 355011177 356437225
549.7 356437225 356642532 354043694 352797775 350367012 349406128 349912186 350385704 351137238 350219841
558.4 350219841 350319099 350443039 350044594 348175316 346574745 347551613 348709221 349685936 349401398
567.1 349401398 349876480 350847092 350714035 350223274 349536285 350020752 350151062 349531250 349380074 349247208
576.7 349247208 348559875 349055862 349517708 348331795 347965164 347494278 347790222 348663216 348281784 348068275
586.4 348068275 348616371 349047394 348480988 348671303 350414391 352822456 353126602 351511955 350958900
595 350958900 351671066 351933899 351282463 351615982 352263527 352480888 352945595 353278236 352786751 351742783
604.7 351742783 352341156 351753273 350411072 351021347 351034584 350450554 349478951 348620415 347871704 347140961
$$ packed form
540.1C58405724k37618O46820R88884m87518k925911j359215j50909J36566n646J426048
549.7C56437225K05307k598838j245919k430763r60884N06058M73518P51534r17397
558.4C50219841R9258J23940l98445j869278j600571R76868J157608R76715k84538
567.1C49401398M75082R70612j33057m90761o86989M84467J30310o19812j51176j32866
576.7C49247208o87333M95987M61846j185913l66631m70886K95944Q72994l81432k13509
586.4C48068275N48096M31023n66406J90315J743088K408065L04146j614647n53055
595C50958900P12166K62833o51436L33519O47545K17361M64707L32641m91485j043968
604.7C51742783N98373n87883j342201O10275J3237n84030r71603q58536p48711p30743
$$ plain form
614.3 347140961 346147041 345291519 346228409 346034279 345207253 346247444 348161125 348711929 348090057
623 348090057 348018494 348568726 349527473 350280724 351537018 352925987 354770775 356445007 356367493 356706467
632.7 356706467 357455254 359428291 361668663 361875420 363493195 366404915 368090935 368800201 369294014
641.3 369294014 369605675 370131378 371363449 371921158 373005714 374916344 375707016 376139793 376262054
650 376262054 376219635 377187920 378463593 379105263 380078163 380777817 380354347 380341606 380101013 379605331
659.7 379605331 379608421 379235840 378694916 378789558 379149590 379355812 379559669 378142204 375803680 378912277
669.3 378912277 380443001 380827103 380757561 382241402 384069519 384767265 385635262 386686440 387877388
678 387877388 388852043 389078102 389380455 390983925 393459129 396124954 397666893 397607346 397964478 398414688
$$ packed form
614.3C47140961r93920q55522R36890j94130q27026J040191J913681N50804o21872
623C48090057p1563N50232R58747P53251J256294J388969J844788J674232p7514L38974
632.7C56706467P48787J973037K240372K06757J617775K911720J686020P09266M93813
641.3C69294014L11661N25703J232071N57709J084556J910630P90672M32777J22261
650C76262054m2419R68285J275673O41670R72900O99654m23470j2741k40593m95682
659.7C79605331L090l72581n40924R4642L60032K06222K03857j417465k338524L108597
669.3C78912277J530724L84102o9542J483841J828117O97746Q67997J051178J190948
678C87877388R74655K26059L02353J603470K475204K665825J541939n9547L57132M50210
$$ plain form
687.6 398414688 399311180 400505333 401487885 402688179 403076324 403688087 404504051 405410233 405896835
696.3 405896835 405478935 405882301 407088623 408716927 409768143 410417252 411228600 411789551 411202393
705 411202393 410442696 411880875 412709846 413435936 415462952 416433678 416469154 416566467 417514458 418227577
714.6 418227577 419221382 419906197 420108871 421855354 422489929 421940460 421936226 422551346 423706970 424288559
724.3 424288559 424840469 425941696 427462311 428697777 429696999 430892868 431387749 431903305 433074646
733 433074646 433811531 434431343 434825172 435500908 437103500 437679634 437610435 437393150 438107071 439493675
742.6 439493675 440246239 441434631 441411705 441996956 442996178 443453331 444550705 443865318 444080582 445177841
752.2 445177841 445890388 447076721 448161430 449773788 450474586 451688576 452975922 452662849 453360481
$$ packed form
687.6C98414688Q96492J194153R82552J200294L88145O11763Q15964R06182M86602
696.3D05896835m17900M03366J206322J628304J051216O49109Q11348N60951n87158
705D11202393p59697J438179Q28971P26090K027016R70726L5476R7313R47991P13119
714.6D18227577R93805O84815K02674J746483O34575n49469m234O15120J155624N81589
724.3D24288559N51910J101227J520615J235466R99222J195869M94881N15556J171341
733D33074646P36885O19812L93829O75736J602592N76134o9199k17285P13921J386604
742.6D39493675P52564J188392k2926N85251R99222M57153J097374o85387K15264J097259
752.2D45177841P12547J186333J084709J612358P00798J213990J287346l13073O97632
$$ plain form
760.9 453360481 455488472 457050896 457935257 459009781 459598541 460022697 459984932 460586472 461437836
769.6 461437836 461127205 461629715 462601128 462942810 462261086 462267952 462035942 461156273 461768875 462073250
779.2 462073250 462492371 462654305 462778015 463640556 464784317 465872765 465535812 465590134 465684013 466254196
788.9 466254196 467778473 468160858 467902489 467730064 468394203 469218216 468787727 467322884 466211586
797.6 466211586 464996071 464634171 464701004 463365021 462308426 460762062 459911842 459102440 456945457
806.2 456945457 454950523 452975731 451846619 450168076 448147469 446436424 444590874 442526588
814 442526588 441144562 441386032 440698471 439968758 439718666 440010643 440707932 440753937 441952820 442818031
823.6 442818031 444044456 446549644 449144020 451959839 454795456 458055573 460886002 463429527
$$ packed form
760.9D53360481K127991J562424Q84361J074524N88760M24156l7765O01540Q51364
769.6D61437836l10631N02510R71413L41682o81724O866k32010q79669O12602L04375
779.2D62073250M19121J61934J23710Q62541J143761J088448l36953N4322R3879N70183
788.9D66254196J524277L82385k58369j72425O64139Q24013m30489j464843j111298
797.6D66211586j215515l61900O6833j335983j056595j546364q50220q09402k156983
806.2D56945457j994934j974792j129112j678543k020607j711045j845550k064286
814D42526588j382026K41470o87561p29713k50092K91977O97289M6005J198883Q65211
823.6D42818031J226425K505188K594376K815819K835617L260117K830429K543525
$$ plain form
831.3 463429527 465634155 469149590 473018150 475215721 477264862 478922806 481404190 483391495
839 483391495 484918022 487246475 489484406 491279984 492585258 494042397 494979591 496945801 498354263
847.7 498354263 499036102 500655899 501641541 502582016 503624115 505543976 506888962 507855606 509052696
856.4 509052696 509718094 511506462 513443336 514806671 515640297 516273994 516906395 518248215 518264885
865.1 518264885 517050476 516775513 515467262 514806595 513639526 511604652 510052071 508680153 507376709
873.8 507376709 505526962 504603157 503252602 502444305 501883011 501318817 500937576 499433250 498551178
882.4 498551178 496728134 496428375 496695976 495352058 494917068 494542427 494600372 494524727 494879265 494462891
892.1 494462891 493866348 494327278 494366188 494941750 495279198 496351509 496688080 496222992 496287498 496052208
$$ packed form
831.3D63429527K204628L515435L868560K197571K049141J657944K481384J987305
839D83391495J526527K328453K237931J795578J305274J457139R37194J966210J408462
847.7D98354263O81839J619797R85642R40475J042099J919861J344986R66644J197090
856.4E09052696O65398J788368J936874J363335Q33626O33697O32401J341820J6670
865.1E18264885j214409k74963j308251o60667j167069k034874j552581j371918j303444
873.8E07376709j849747r23805j350555q08297n61294n64194l81241j504326q82072
882.4D98551178j823044k99759K67601j343918m34990l74641N7945p5645L54538m16374
892.1D94462891n96543M60930L8910N75562L37448J072311L36571m65088O4506k35290
$$ plain form
901.7 496052208 495857506 495056267 496124573 498564949 501735878 504952583 507038002 509549332 511465569
910.4 511465569 512907982 512365494 510613594 509550285 509039307 508674126 507800140 506234131 503281212
919.1 503281212 500979538 498754692 495887108 492038879 488152618 485548439 482353058 479679184
926.8 479679184 476600075 473522415 470926323 467345924 464054489 461258659 459033089 457553139
934.5 457553139 456960258 455801811 454581375 453930855 452556534 451442070 450378456 449464340 448142128
943.2 448142128 446992302 446389313 445305748 444690857 444623604 445241432 445409126 445472794 445332985 444975471
952.8 444975471 445191879 443755760 442237282 441190109 440038452 438255920 435201035 432942162 430928841
961.5 430928841 428669357 426820946 425324211 423285866 421328659 420001411 417990341 415839462
$$ packed form
901.7D96052208j94702q01239J068306K440376L170929L216705K085419K511330J916237
910.4E11465569J442413n42488j751900j063309n10978l65181q73986j566009k952919
919.1E03281212k301674k224846k867584l848229l886261k604179l195381k673874
926.8D79679184l079109l077660k596092l580399l291435k795830k225570j479950
934.5D57553139n92881j158447j220436o50520j374321j114464j063614r14116j322212
943.2D48142128j149826o02989j083565o14891o7253O17828J67694O3668j39809l57514
952.8D44975471K16408j436119j518478j047173j151657j782532l054885k258873k013321
961.5D30928841k259484j848411j496735k038345j957207j327248k011070k150879
$$ plain form
969.2 415839462 413853569 412071419 409491310 406402435 403843040 400829430 397841568 394885330
976.9 394885330 391509628 387185173 382664108 378818169 374393501 369562874 364374847 359428406
984.7 359428406 355062103 349952202 345024719 340183792 335474663 331449089 327213135 323396111
992.4 323396111 319626427 315910187 312421513 309048138 305569782 302426834 299920998 296656322
1000.1 296656322 293539658 290225735 287692375 285314484 282378311 280710049 278424168 276587868
1007.8 276587868 274641857 273194237 272013817 269010181 266850204 264811954 263127975 261663055
1015.5 261663055 260011997 258030186 255711613 253805122 251579933 249873409 247319927 245031166
1023.2 245031166 243169785 241778278 240794010 238776569 237867737 236511173 234984894 233182945 232204380
$$ packed form
969.2D15839462j985893j782150k580109l088875k559395l013610k987862k956238
976.9C94885330l375702m324455m521065l845939m424668m830627n188027m946441
984.7C59428406m366303n109901m927483m840927m709129m025574m235954l817024
992.4C23396111l769684l716240l488674l373375l478356l142948k505836l264676
1000.1B96656322l116664l313923k533360k377891k936173j668262k285881j836300
1007.8B76587868j946011j447620j180420l003636k159977k038250j683979j464920
1015.5B61663055j651058j981811k318573j906491k225189j706524k553482k288761
1023.2B45031166j861381j391507r84268k017441r08832j356564j526279j801949r78565
$$ plain form
1031.9 232204380 232096615 231174183 231525192 231918850 232809219 233302650 235139046 237477226 238218212
1040.6 238218212 240033226 241186237 242146721 242660084 243333206 243641491 243428650 243505611 242211475
1049.3 242211475 241047516 239508686 239229012 238584919 237016029 236430569 235608826 235498810 234666996
1058 234666996 234636650 235046043 236080284 237435379 238555527 240902805 242626534 245145226 246879539
1066.6 246879539 248183479 248845882 249811974 251764584 251689224 252865009 253246498 253172016 253605270
1075.3 253605270 253661423 254448662 254607811 255428314 255468826 255697727 256105728 256988468 259098148 260541744
1085 260541744 262504482 263614864 264497395 265522213 267163181 269391270 271040268 273022690 274730530
1093.6 274730530 276512280 277946529 279251881 280243473 281221542 282560730 283960552 285480518 286471348
$$ packed form
1031.9B32204380j07765r22432L51009L93658Q90369M93431J836396K338180P40986
1040.6B38218212J815014J153011R60484N13363O73122L08285k12841P6961j294136
1049.3B42211475j163959j538830k79674o44093j568890n85460q21743j10016q31814
1058B34666996l0346M09393J034241J355095J120148K347278J723729K518692J734313
1066.6B46879539J303940O62403R66092J952610p5360J175785L81489p4482M33254
1075.3B53605270N6153P87239J59149Q20503M0512K28901M08001Q82740K109680J443596
1085B60541744J962738J110382Q82531J024818J640968K228089J648998J982422J707840
1093.6B74730530J781750J434249J305352R91592R78069J339188J399822J519966R90830
$$ plain form
1102.3 286471348 288666782 290887909 292874603 294608307 295298862 296442413 297730675 298960247
1110 298960247 299374847 299827499 300778694 302067165 303595142 304592171 305100365 305020924 305576744 305519562
1119.7 305519562 305049782 304445724 303786259 304956341 305862827 306301498 306638584 307377853 308845139
1128.4 308845139 310884438 313236389 315146389 317555828 319055920 321231728 324488869 326904869
1136.1 326904869 329142151 331290817 333325729 334887581 336485519 337938881 339312401 340448418
1143.8 340448418 341726761 343059387 343336411 343824234 344116173 344443855 344663849 344700279 345285454
1152.5 345285454 345147934 344964256 344885788 344677544 344227905 343832855 343425369 342392654 341640625 341223564
1162.1 341223564 341974640 342567291 342901764 344364357 345877609 348224678 351132851 353664398 355986748
$$ packed form
1102.3B86471348K195434K221127J986694J733704O90555J143551J288262J229572
1110B98960247M14600M52652R51195J288471J527977R97029N08194p9441N55820n7182
1119.7C05519562m69780o04058o59465J170082R06486M38671L37086P39269J467286
1128.4C08845139K039299K351951J910000K409439J500092K175808L257141K416000
1136.1C26904869K237282K148666K034912J561852J597938J453362J373520J136017
1143.8C40448418J278343J332626K77024M87823K91939L27682K19994L6430N85175
1152.5C45285454j37520j83678p8468k08244m49639l95050m07486j032715p52029m17061
1162.1C41223564P51076N92651L34473J462593J513252K347069K908173K531547K322350
$$ plain form
1170.8 355986748 359188080 362193527 364744759 367851105 370370750 372909164 375231857 377455711
1178.5 377455711 380422440 383041344 384707413 387003746 389844666 391559143 393150635 394540939
1186.2 394540939 395008087 395652847 396791077 397221375 397010651 396923866 396401253 395496597 394972534 394334793
1195.9 394334793 393370514 392620010 391227570 389716530 388812370 387473907 385880737 384762039 383885994
1204.5 383885994 382629662 381327286 380396423 379714165 379251137 378660431 378229828 378207130 377887878
1213.2 377887878 377104263 376429901 376168022 376029282 375950623 375902672 375621223 375050316 374837914 375029221
1222.9 375029221 374464722 373445816 372690392 371996574 371123428 370156746 369433136 368677063 367959976
1231.5 367959976 367415276 366388092 365125351 364475937 364402809 364388809 364231911 363824921 363354416 362948494
$$ packed form
1170.8C55986748L201332L005447K551232L106346K519645K538414K322693K223854
1178.5C77455711K966729K618904J666069K296333K840920J714477J591492J390304
1186.2C94540939M67148O44760J138230M30298k10724q6785n22613r04656n24063o37741
1195.9C94334793r64279p50504j392440j511040r04160j338463j593170j118698q76045
1204.5C83885994j256332j302376r30863o82258m63028n90706m30603k2698l19252
1213.2C77887878p83615o74362k61879j38740p8659m7951k81449n70907k12402J91307
1222.9C75029221n64499j018906p55424o93818q73146r66682p23610p56073p17087
1231.5C67959976n44700j027184j262741o49414p3128j4000j56898m06990m70505m05922
$$ plain form
1241.2 362948494 362666664 362384644 361881104 361492653 360789871 360434151 360472984 359816933 359545631 359384460
1250.8 359384460 358860397 358384171 358002205 357852745 357650642 357568703 357227936 357018929 357167854 356993332
1260.5 356993332 356993484 357411804 357636337 357750168 358591957 359076614 359235229 360034904 360841560 361537552
1270.1 361537552 362105103 362879257 363959045 365092735 366011429 367008438 368096123 369088516 370191994
1278.8 370191994 370956612 371991234 373379478 374728394 376142235 377602272 379038963 380743141
1286.5 380743141 382328339 383142052 384351311 385535011 386797867 387836418 388137665 388547745 388973885
1295.2 388973885 389907799 390768661 391775093 392586174 392756310 392947540 392798042 392804413 392883759 393199654
1304.8 393199654 392941132 392470703 392683182 392267227 391500816 390598068 390084038 390032196 389690857 389288750
$$ packed form
1241.2C62948494k81830k82020n03540l88451p02782l55720L8833o56051k71302j61171
1250.8C59384460n24063m76226l81966j49460k02103q1939l40767k09007J48925j74522
1260.5C56993332J52M18320K24533J13831Q41789M84657J58615P99675Q06656O95992
1270.1C61537552N67551P74154J079788J133690R18694R97009J087685R92393J103478
1278.8C70191994P64618J034622J388244J348916J413841J460037J436691J704178
1286.5C80743141J585198Q13713J209259J183700J262856J038551L01247M10080M26140
1295.2C88973885R33914Q60862J006432Q11081J70136J91230j49498O371P9346L15895
1304.8C93199654k58522m70429K12479m15955p66411r02748n14030n1842l41339m02107
$$ plain form
1314.5 389288750 389187012 389382248 389581490 390186081 390595627 390818977 391638336 392856941 393792763
1323.2 393792763 394187584 394657707 395107269 395856400 396305656 396374130 396198692 395916214 395869370 395000648
1332.8 395000648 394392509 394461594 394474945 394284973 394166756 394598846 394870491 395182419 395416069 395882111
1342.4 395882111 396355286 396902008 397893105 398650551 399575272 400265694 400682945 400375366 400049324 399934692
1352.1 399934692 399481430 399426651 398941536 398654289 398532867 398250809 397951622 397767525 397364349 396148109
1361.7 396148109 395902023 395785713 395673027 395332680 394717407 394379539 393519058 393048401 392298203 391757812
1371.4 391757812 391809692 391990013 391853142 391135674 391079788 390713654 390685577 390347137 389801216 389127121
1381 389127121 387793655 386606979 385106544 384306488 383466835 382318153 380410957 378500557 377394142
$$ packed form
1314.5C89288750j01738J95236J99242O04591M09546K23350Q19359J218605R35822
1323.2C93792763L94821M70123M49562P49131M49256O8474j75438k82478m6844q68722
1332.8C95000648o08139O9085J3351j89972j18217M32090K71645L11928K33650M66042
1342.4C95882111M73175N46722R91097P57446R24721O90422M17251l07579l26042j14632
1352.1C99934692m53262n4779m85115k87247j21422k82058k99187j84097m03176j216240
1361.7C96148109k46086j16310j12686l40347o15273l37868q60481m70657p50198n40391
1371.4C91757812N1880J80321j36871p17468n5886l66134k8077l38440n45921o74095
1381C89127121j333466j186676j500435q00056q39653j148682j907196j910400j106415
$$ plain form
1389.7 377394142 375565491 373730278 371839828 370451126 368150940 364836121 363303490 361461105
1397.4 361461105 359615784 356350250 353717346 352047729 349755821 347674675 345546989 343054314
1405.1 343054314 340575294 339186859 337460861 335108986 333941307 332629204 331201820 329660454
1412.8 329660454 328307152 327680435 326966972 326500015 325473671 324971848 323685265 323447609 324525642
1421.5 324525642 324783745 325232811 324926605 325635376 326571465 327404671 328968201 329541740 330602150
1430.2 330602150 331605415 333311768 334888344 336219788 338125534 339278908 341138382 342750092
1437.9 342750092 345356789 347117653 348719711 350710144 351906967 353717270 354748535 356655540
1445.6 356655540 358281555 359768028 361101074 361666641 363409081 364717712 366354065 367161484 368735008
$$ packed form
1389.7C77394142j828651j835213j890450j388702k300186l314819j532631j842385
1397.4C61461105j845321l265534k632904j669617k291908k081146k127686k492675
1405.1C43054314k479020j388435j725998k351875j167679j312103j427384j541366
1412.8C29660454j353302o26717p13463m66957j026344n01823j286583k37656J078033
1421.5C24525642K58103M49066l06206P08771R36089Q33206J563530N73539J060410
1430.2C30602150J003265J706353J576576J331444J905746J153374J859474J611710
1437.9C42750092K606697J760864J602058J990433J196823J810303J031265J907005
1445.6C56655540J626015J486473J333046N65567J742440J308631J636353Q07419J573524
$$ plain form
1454.3 368735008 370378761 370908852 372897682 373734779 377290039 378305283 379952965 381580238 382767181
1463 382767181 385002365 386152878 388538666 390531235 393183632 395307922 397429543 400531082 403207626
1471.7 403207626 407281723 409586563 412942734 416110916 419235268 422099266 424482880 426706352
1479.4 426706352 428612862 431150055 432785683 434376907 436274414 438109360 440240898 441369095
1487.1 441369095 442008171 443245163 443517723 443618851 444073753 444132309 443734398 443441925 443173866 439716797
1496.7 439716797 439385223 438476486 435458031 434637947 433316612 431759148 430644379 430948563 430833168
1505.4 430833168 428483620 426670341 426317978 427180099 425901604 425812569 425193558 423664894 423394051
1514.1 423394051 423164825 423281631 421525040 419151344 419432678 420607986 420199318 418066254 418808517
$$ packed form
1454.3C68735008J643753N30091J988830Q37097L555260J015244J647682J627273J186943
1463C82767181K235184J150513K385788J992569K652397K124290K121621L101539K676544
1471.7D03207626M074097K304840L356171L168182L124352K863998K383614K223472
1479.4D26706352J906510K537193J635628J591224J897507J834946K131538J128197
1487.1D41369095O39076J236992K72560J01128M54902N8556l97911k92473k68059l457069
1496.7D39716797l31574r08737l018455q20084j321335j557464j114769L04184j15395
1505.4D30833168k349548j813279l52363Q62121j278495q9035o19011j528664k70843
1514.1D23394051k29226J16806j756591k373696K81334J175308m08668k133064P42263
$$ plain form
1522.8 418808517 419433556 421279716 421871643 421832848 422584648 423333664 423809891 423784142 424102745 424627151
1532.4 424627151 425447617 425211639 426141739 426859131 427314339 428674355 427572975 427585373 428853645
1541.1 428853645 429725342 429124603 429965286 431762962 430763168 431230927 431522217 432295952 432493248
1549.8 432493248 431793556 432417183 432584572 433243637 431322403 431595001 432967300 434465981 433308563
1558.5 433308563 426459732 427621269 426305313 426522789 425075150 423968925 421483421 418053818
1566.2 418053818 416484299 414220886 413853226 406590080 403777580 401712761 397772789 394682274
1573.9 394682274 391477699 389955482 378335419 376531067 373520966 368863106 364681664 359211273
1581.6 359211273 355437317 349492340 345704880 340302315 335759659 331612396 326333542 322691231
$$ packed form
1522.8D18808517O25039J846160N91927l8795P51800P49016M76227k5749L18603N24406
1532.4D24627151Q20466k35978R30100P17392M55208J360016j101380J2398J268272
1541.1D28853645Q71697o00739Q40683J797676r99794M67759K91290P73735J97296
1549.8D32493248o99692O23627J67389O59065j921234K72598J372299J498681j157418
1558.5D33308563o848831J161537j315956K17476j447639j106225k485504l429603
1566.2D18053818j569519k263413l67660p263146k812500k064819l939972l090515
1573.9C94682274l204575j522217j1620063j804352l010101m657860m181442n470391
1581.6C59211273l773956n944977l787460n402565m542656m147263n278854l642311
$$ plain form
1589.3 322691231 316644917 313321209 307931576 304455624 300234108 295410290 292628899 287093430
1597 287093430 284725323 280239487 277595234 273561001 270302677 268707390 264383087 262967358 259576607
1605.7 259576607 258632221 255689278 254301739 253258801 250094204 249562836 246732903 247057552 245148563
1614.4 245148563 245420113 245650063 241536217 242961121 241339569 242590179 241091690 241860924 241851063
1623.1 241851063 240826321 242714100 242232990 244370995 243360386 244815140 245108376 246076851 247814255
1631.7 247814255 247974606 250454960 250276814 252520142 251507816 254738407 256764336 257578621 260382385
1640.4 260382385 260867348 263558617 264375801 266390305 268083210 269032097 272317505 271220760 274075871
1649.1 274075871 274530411 277390347 279754753 280112057 280251770 279872990 283328457 283970985 286371593
$$ packed form
1589.3C22691231o046314l323708n389633l475952m221516m823818k781391n535469
1597B87093430k368107m485836k644253m034233l258324j595287m324303j415729l390751
1605.7B59576607r44386k942943j387539j042938l164597n31368k829933L24649j908989
1614.4B45148563K71550K29950m113846J424904j621552J250610j498489P69234r861
1623.1B41851063j024742J887779m81110K138005j010609J454754K93236R68475J737404
1631.7B47814255J60351K480354j78146K243328j012326L230591K025929Q14285K803764
1640.4B60382385M84963K691269Q17184K014504J692905R48887L285408j096745K855111
1649.1B74075871M54540K859936K364406L57304J39713l78780L455467O42528K400608
$$ plain form
1657.8 286371593 287296543 288711624 290522346 292167625 295816650 296409569 299861641 301754055 304618912
1666.5 304618912 307343102 309577808 314138737 316046391 320840607 323232918 327160492 330411110
1674.2 330411110 333328133 337361870 340434761 345161781 348381157 353813972 357650261 361631508
1681.9 361631508 366765823 369043350 375009232 377250443 383099327 387992744 393114128 398075523
1689.6 398075523 402216644 407150764 411567421 416836929 421285286 425588989 429513626 436180191
1697.3 436180191 442322083 447212372 452502899 453735123 459995079 464891624 469299927 473477592
1705 473477592 477556686 481323204 484072151 487966652 490953407 493617172 496631622 499164391 501789780
1713.7 501789780 503374825 505329742 509564095 513720093 511183968 512495995 515183907 517080078
$$ packed form
1657.8B86371593R24950J415081J810722J645279L649025N92919L452072J892414K864857
1666.5C04618912K724190K234706M560929J907654M794216K392311L927574L250618
1674.2C30411110K917023M033737L072891M727020L219376N432815L836289L981247
1681.9C61631508N134315K277527N965882K241211N848884M893417N121384M961395
1689.6C98075523M141121M934120M416657N269508M448357M303703L924637O666565
1697.3D36180191O141892M890289N290527J232224O259956M896545M408303M177665
1705D73477592M079094L766518K748947L894501K986755K663765L014450K532769K625389
1713.7E01789780J585045J954917M234353M155998k536125J312027K687912J896171
$$ plain form
1721.4 517080078 519118500 520833359 522193832 524100952 525876389 527064743 528541946 530461273
1729.1 530461273 531192169 531822128 534686737 537912636 538191261 536485596 539788628 543062897 544781342
1737.8 544781342 547735176 548987465 548293762 552360535 555658417 557716179 559890213 562934189
1745.5 562934189 566328392 569281082 572276993 573678169 577930298 581031151 582224312 586691360
1753.3 586691360 590329475 593770103 597182961 598425560 600244484 603077011 605821457 609666214
1761 609666214 611048622 611496544 614521828 616024132 617409554 619335136 621110191 620449409 622574463
1769.7 622574463 626904831 628396873 627774620 626357422 629642601 631760941 631539268 633767204 634762650
1778.3 634762650 636264763 637218819 637558060 639158363 640720520 642073288 641765518 641891327 643035126
$$ packed form
1721.4E17080078K038422J714859J360473J907120J775437J188354J477203J919327
1729.1E30461273P30896O29959K864609L225899K78625j705665L303032L274269J718445
1737.8E44781342K953834J252289o93703M066773L297882K057762K174034L043976
1745.5E62934189L394203K952690K995911J401176M252129L100853J193161M467048
1753.3E86691360L638115L440628L412858J242599J818924K832527K744446L844757
1761F09666214J382408M47922L025284J502304J385422J925582J775055o60782K125054
1769.7F22574463M330368J492042o22253j417198L285179K118340k21673K227936R95446
1778.3F34762650J502113R54056L39241J600303J562157J352768l07770J25809J143799
$$ plain form
1787 643035126 644269562 645173950 647060013 648556747 649742584 649301758 647859726 650757294 651731415
1795.7 651731415 651550522 652948456 654862671 656357727 655443573 656983185 657308578 657513733 658906403
1804.4 658906403 659661789 660778656 661455002 662073517 662790222 664209518 663896332 664165115 665008469
1813 665008469 665271606 666888657 667394409 668507080 668874283 668882675 669743652 669836884 670758743 671046524
1822.7 671046524 672289352 673456497 671546021 671385727 673154297 674767532 675188751 673523636 673541946
1831.4 673541946 675519867 675883865 676148148 677128906 678085022 678623810 677920685 678667450 678661728 678965607
1841 678965607 679617691 681138306 682911606 678852768 679924240 681733475 682059174 681855087 682000656
1849.7 682000656 682938995 683223648 684055710 684003296 684515152 685112991 685304337 685731964 685367508 685667953
$$ packed form
1787F43035126J234436R04388J886063J496734J185837m40826j442032K897568R74121
1795.7F51731415j80893J397934J914215J495056r14154J539612L25393K05155J392670
1804.4F58906403P55386J116867O76346O18515P16705J419296l13186K68783Q43354
1813F65008469K63137J617051N05752J112671L67203Q392Q60977R3232R21859K87781
1822.7F71046524J242828J167145j910476j60294J768570J613235M21219j665115J8310
1831.4F73541946J977921L63998K64283R80758R56116N38788p03125P46765n722L03879
1841F78965607O52084J520615J773300m058838J071472J809235L25699k04087J45569
1849.7F82000656R38339K84653Q32062n2414N11856N97839J91346M27627l64456L00445
$$ plain form
1859.3 685667953 685822830 686348953 686035461 686326828 687135162 687089539 687749405 687431870 687966614 687439575
1869 687439575 686854630 688150864 688884125 689260025 689231949 689766693 689496689 689577560 689579849 689597549 690278931
1879.6 690278931 690209656 690663986 690528870 690819092 690820007 690877304 691371765 691109467 692190857 692365952
1889.2 692365952 691408691 691622696 692365112 692479324 692612457 692698441 691690140 692286987 692460785 692426453
1898.9 692426453 692795334 693106079 693500824 693233871 693449936 693194046 693302689 693385544 693634720 694429169
1908.5 694429169 694662094 694579239 694047241 694493027 694249115 694398193 694493408 694434433 695903702 694573822
1918.2 694573822 693588333 694486923 695276108 695550995 694965820 694737091 694814453 695222855 695016403 695224228
1927.8 695224228 695111389 695087433 695414047 695087433 695233536 694939880 695290756 695127792 694775085 694928894
$$ packed form
1859.3F85667953J54877N26123l13492K91367Q08334m5623O59866l17535N34744n27039
1869F87439575n84945J296234P33261L75900k8076N34744k70004Q0871K289J7700O81382
1879.6F90278931o9275M54330j35116K90222R15N7297M94461k62298J081390J75095
1889.2F92365952r57261K14005P42416J14212J33133Q5984j008301N96847J73798l4332
1898.9F92426453L68881L10745L94745k66953K16065k55890J08643Q2855K49176P94449
1908.5F94429169K32925q2855n31998M45786k43912J49078R5215n8975J469269j329880
1918.2F94573822r85489Q98590P89185K74887n85175k28729P7362M08402k06452K07825
1927.8F95224228j12839k3956L26614l26614J46103k93656L50876j62964l52707J53809
$$ plain form
1937.5 694928894 694904709 695332108 695093765 695847244 695623093 694060440 694271164 694707108 694796600 694585037
1947.1 694585037 694810257 694545898 694584122 694326706 694230347 694641342 694492874 694809799 694356461 694311600
1956.7 694311600 694097137 693718491 693788147 693661270 694118958 694022980 694212494 693850861 693636856 693715286
1966.4 693715286 693215561 693440857 693354950 693676300 693495789 693378983 693507996 693591080 693766708 693053741
1976 693053741 693025436 692860565 692827606 692835464 693016434 693394852 692973862 692901077 692530746 692663956 692655792
1986.6 692655792 692497025 692353516 691847229 692268829 692367783 691982651 691372528 691667480 691892776 691778564
1996.3 691778564 692199631 691906815 691821365 691316605 690990753 690928574 690798645 690748978 690463715 690575485
2005.9 690575485 690172119 690106125 689923172 690006332 690117035 689597244 689861298 689873047 689740143 689210510
$$ packed form
1937.5F94928894k4185M27399k38343P53479k24151j562653K10724M35944Q9492k11563
1947.1F94585037K25220k64359L8224k57416r6359M10995j48468L16925m53338m4861
1956.7F94311600k14463l78646O9656j26877M57688r5978J89514l61633k14005P8430
1966.4F93715286m99725K25296q5907L21350j80511j16806J29013Q3084J75628p12967
1976F93053741k8305j64871l2959P858J80970L78418m20990p2785l70331J33210q164
1986.6F92655792j58767j43509n06287M21600R8954l85132o10123K94952K25296j14212
1996.3F91778564M21067k92816q5450n04760l25852o2179j29929m9667k85263J11770
2005.9F90575485m03366o5994j82953Q3160J10703n19791K64054J1749j32904n29633
$$ plain form
2015.6 689210510 689036484 688670731 688161545 688572617 688623428 688810196 688317413 688004761 687753296 687605515
2025.2 687605515 687719650 687089615 687188263 687156219 687142029 686764069 686675720 686715317 686071548 686227798
2034.9 686227798 685748215 685491943 685408783 685385742 685444412 685186310 685230408 684917526 685186157 684763947
2044.5 684763947 684251556 684065857 683726654 683781509 683801804 684281616 683846512 683700256 683618546 683094482
2054.1 683094482 683023453 682932281 683432465 683441544 683510971 683133850 682675552 682783051 682799301 683031616 682724304
2064.7 682724304 682911911 682577667 682285538 682300873 682042542 682469864 682410660 682236633 681742783 681636581
2074.4 681636581 681629028 681502380 681700592 681586380 681789703 681396179 681261826 681025314 680882034 681020355
2084 681020355 680472488 680332870 679965668 680096893 680352173 680456924 680292511 679821548 679572449 679297485
$$ packed form
2015.6F89210510j74026l65753n09186M11072N0811J86768m92783l12652k51465j47781
2025.2F87605515J14135o30035R8648l2044j4190l77960q8349L9597o43769J56250
2034.9F86227798m79583k56272q3160k3041N8670k58102M4098l12882K68631m22210
2044.5F84763947n12391j85699l39203N4855K0295M79812m35104j46256q1710n24064
2054.1F83094482p1029r1172N00184R079O9427l77121m58298J07499J6250K32315l07312
2064.7F82724304J87607l34244k92129J5335k58331M27322n9204j74027m93850j06202
2074.4F81636581p553j26648J98212j14212K03323l93524j34353k36512j43280J38321
2084F81020355n47867j39618l67202J31225K55280J04751j64413m70963k49099k74964
$$ plain form
2093.7 679297485 679961166 679762878 679206772 678984070 679138565 679296799 678549500 678852615 678737793 678475189
2103.3 678475189 678147812 677722626 677979736 677862549 677998581 677743378 677808609 677578430 677190323 677111893
2113 677111893 676644592 676668167 676516571 676862259 676667709 676375427 676485901 676149750 676180115 675849152
2122.6 675849152 675628357 675368958 675885086 676323624 675993805 675985336 675518036 675380707 675320053 675695572
2132.3 675695572 675632935 675037079 675032425 674881210 675181198 675453186 675567551 675381470 675633774 675702057
2141.9 675702057 674872055 674541321 674385605 674871674 675320511 675527649 675399094 675273895 675394516 674991913
2151.5 674991913 674944839 674591370 674687500 674977036 675028763 675239792 675348663 675577240 675017395 674829483
2161.2 674829483 674681244 674770355 675065231 675012741 675517960 675648880 676031113 675854721 675342712 674874039
$$ packed form
2093.7F79297485O63681j98288n56106k22702J54495J58234p47299L03115j14822k62604
2103.3F78475189l27377m25186K57110j17187J36032k55203O5231k30179l88107p8430
2113F77111893m67301K3575j51596L45688j94550k92282J10474l36151L0365l30963
2122.6F75849152k20795k59399N16128M38538l29819q469m67300j37329o0654L75519
2132.3F75695572o2637n95856m654j51215K99988K71988J14365j86081K52304O8283
2141.9F75702057q30002l30734j55716M86069M48837K07138j28555j25199J20621m02603
2151.5F74991913m7074l53469R6130K89536N1727K11029J08871K28577n59845j87912
2161.2F74829483j48239Q9111K94876n2490N05219J30920L82233j76392n12009m68673
$$ plain form
2170.8 674874039 674507751 675096130 675349274 675693970 675708160 675778961 676010971 676056976 675969925 675527802
2180.5 675527802 675570068 675376968 675538788 675529938 675904770 676623306 676495132 676734848 676352921 676098557
2190.1 676098557 676131592 676301575 676587830 676689148 676955185 676577377 676727524 676656036 676189575 675804062
2199.8 675804062 675870743 676587372 676605225 676751862 676793060 677074814 677133331 676806183 676787796 676735458 676968918
2210.4 676968918 676817703 677286530 677579880 677475510 677463989 677064514 677020645 676640778 676736221 676942444
2220 676942444 677005234 677095337 677018280 677193604 677173767 677340393 677165756 677166367 677150879 677204819 677457047
2230.6 677457047 677465210 677841949 677695541 677712936 677280655 677048492 677313919 676903915 676901703 676967850 677549744
2241.2 677549744 677422028 677019501 677013702 676690292 677113876 677538986 677725143 677212524 677056732 677070160
$$ packed form
2170.8F74874039l66288N88379K53144L44696J4190P0801K32010M6005q7051m42123
2180.5F75527802M2266j93100J61820q850L74832P18536j28174K39716l81927k54364
2190.1F76098557L3035J69983K86255J01318K66037l77808J50147p1488m66461l85513
2199.8F75804062O6681P16629J7853J46637M1198K81754N8517l27148j8387n2338K33460
2210.4F76968918j51215M68827K93350j04370j1521l99475m3869l79867R5443K06223
2220F76942444O2790R0103p7057J75324j9837J66626j74637O11j5488N3940K52228
2230.6F77457047Q163L76739j46408J7395m32281k32163K65427m10004k212O6147N81894
2241.2F77549744j27716m02527n799l23410M23584M25110J86157n12619j55792J3428
$$ plain form
2250.9 677070160 676732941 676882095 676735611 676736832 676547241 676643524 676492996 676323700 676621170 676468048
2260.5 676468048 676614151 676532288 676759338 676895599 676986694 676920929 676578674 676774292 676160583 675730743
2270.2 675730743 675606613 675818024 675978012 676101990 676528091 676232452 676419144 676230316 676143646 676137390
2279.8 676137390 675797348 675608139 675315552 675770645 675715485 675761108 675396500 674942017 675155106 674887466
2289.4 674887466 675048752 674883881 674951706 674665680 674431000 674424210 673831024 673827972 673417664 673438797 673014755
2300 673014755 672853775 673365631 673125534 673287506 673100967 673117828 672576523 671879654 671708450 671960449
2309.7 671960449 672475204 671833725 671716080 671371613 671482086 671486816 670379410 669779205 669425812 669493866
2319.3 669493866 668946991 669103165 668514786 667734451 667881088 667456207 667677841 667449722 668167572 667448578
$$ packed form
2250.9F77070160l37219J49154j46484J221j89591R6283j50528j69296K97470j53122
2260.5F76468048J46103q1863K27050J36261R1095o5765l42255J95618o13709m29840
2270.2F75730743j24130K11411J59988J23978M26101k95639J86692j88828q6670o256
2279.8F76137390l40042j89209k92587M55093n5160M5623l64608m54483K13089k67640
2289.4F74887466J61286j64871O7825k86026k34680o790n93186l052m10308K1133m24042
2300F73014755j60980N11856k40097J61972j86539J6861n41305o96869j71204K51999
2309.7F71960449N14755o41479j17645l44467J10473M730j107406o00205l53393O8054
2319.3F69493866n46875J56174n88379p80335J46637m24881K21634k28119P17850p18994
$$ plain form
2329 667448578 666256180 666061096 665516891 666086578 665569839 666012039 665671005 664776459 664288406 663587112
2338.6 663587112 663923187 663477173 664370346 664299850 664028091 664381027 664667206 665332642 664765396 665049057
2348.3 665049057 665075073 664920197 664637985 663433380 662568054 662100677 662456665 662276154 662544250 662299347
2357.9 662299347 660654068 659117126 659521942 660899200 660020599 659916534 660275192 660560074 660873260
2366.6 660873260 660997620 660404129 660264740 661175385 660652313 660429993 660698166 661319962 661363983 661055679
2376.2 661055679 661212692 661103745 661492310 661268921 661073761 661087418 661296844 661837158 661840820 662061234
2385.9 662061234 661756592 661282501 660746002 660019608 659704361 659821625 660244598 659876175 659516907 659117279
2395.5 659117279 658846741 658517838 657777634 657756958 657540665 657556152 657604370 657281342 657053986 656593399
$$ packed form
2329F67448578j192398j95084n44205N69687n16739M42200l41034q94546m88053p01294
2338.6F63587112L36075m46014Q93173p0496k71759L52936K86179O65436n67246K83661
2348.3F65049057K6016j54876k82212j204605q65326m67377L55988j80511K68096k44903
2357.9F62299347j645279j536942M04816J377258q78601j04065L58658K84882L13186
2366.6F60873260J24360n93491j39389R10645n23072k22320K68173O21796M4021l08304
2376.2F61055679J57013j08947L88565k23389j95160J3657K09426N40314L662K20414
2385.9F62061234l04642m74091n36499p26394l15247J17264M22973l68423l59268l99628
2395.5F59117279k70538l28903p40204k0676k16293J5487M8218l23028k27356m60587
$$ plain form
2405.2 656593399 655953369 655374756 655200653 655127029 655342712 655110779 654752960 654562302 654187164 653970947
2414.8 653970947 653391495 653163071 652695541 652576828 652547073 651908798 652064056 652029419 651750107 650745773
2424.5 650745773 649972229 650025558 649810410 649767151 649599991 649471054 648760605 648265228 647842255 647195358
2434.1 647195358 647223282 646930466 646805267 646437607 645923080 645651321 645415115 645078201 644480438 644133224
2443.7 644133224 643589096 643568649 643481445 643236084 643133011 642610626 642155533 641633377 641542740 641124115
2453.4 641124115 640743332 640322113 639514771 639305725 639054222 639130325 638738403 638023682 637477951 637016640
2463 637016640 636840897 636166458 635915184 635827751 635588760 635162354 634516411 634030533 633590088 633236504
2472.7 633236504 632600937 632475090 632383232 631895638 631356125 630808372 630336494 629830856 629708023 629072037
$$ packed form
2405.2F56593399o40030n78613j74103p3624K15683k31933l57819j90658l75138k16217
2414.8F53970947n79452k28424m67530j18713k9755o38275J55258l4637k79312j004334
2424.5F50745773p73544N3329k15148m3259j67160j28937p10449m95377m22973o46897
2434.1F47195358K7924k92816j25199l67660n14527k71759k36206l36914n97763l47214
2443.7F44133224n44128k0447q7204k45361j03073n22385m55093n22156r0637m18625
2453.4F41124115l80783m21219q07342k09046k51503P6103l91922p14721n45731m61311
2463F37016640j75743o74439k51274q7433k38991m26406o45943m85878m40445l53584
2472.7F33236504o35567j25847r1858m87594n39513n47753m71878n05638j22833o35986
$$ plain form
2482.3 629072037 628596230 628622208 628521614 628081055 627109642 626505241 625843391 625484314 625250435 625024300
2492 625024300 624646721 623884010 623792992 623238297 622542229 622147598 621772728 621302109 620472183 619981461
2501.6 619981461 619908829 620083466 619341354 618291588 617650528 617238655 616884995 616291161 616350517 616096878
2511.2 616096878 615547028 615030746 614501266 614135437 613698044 613405190 612748795 612482872 612204475 611847191
2520.9 611847191 611716766 611347847 610534668 609222565 609073830 608932266 608415985 608196259 608004189
2529.6 608004189 607990074 607472954 606970444 606170235 605637283 605176010 604878502 605156708 604559059 603938065
2539.2 603938065 603385963 603179550 602795410 601949539 601564026 601454926 601538391 601075211 600808334 600112495
2548.9 600112495 599491997 599392319 598730545 598356514 597696075 597526398 597492104 597188683 596956024 596322212
$$ packed form
2482.3F29072037m75807K5978j00594m40559r71413o04401o61850l59077k33879k26135
2492F25024300l77579p62711r1018n54695o96068l94631l74870m70619q29926m90722
2501.6F19981461p2632J74637p42112j049766o41060m11873l53660n93834N9356k53639
2511.2F16096878n49850n16282n29480l65829m37393k92854o56395k65923k78397l57284
2520.9F11847191j30425l68919q13179j312103j48735j41564n16281k19726j92070
2529.6F08004189j4115n17120n02510q00209n32952m61273k97508K78206n97649o20994
2539.2F03938065n52102k06413l84140q45871l85513j09100Q3465m63180k66877o95839
2548.9F00112495o20498r9678o61774l74031o60439j69677l4294l03421k32659o33812
$$ plain form
2558.5 596322212 595804214 595022850 594679680 594224777 593920403 593802223 593188629 593170547 592948761 592484436
2568.1 592484436 591780510 591292419 590885887 590296059 590405884 590343666 590020523 589329529 588799934 588532906
2577.8 588532906 588128471 587684784 586943054 586614456 586325798 585964279 585639572 585434723 585201836 584498825
2587.4 584498825 583838997 583340569 583067474 582575645 582143250 581800499 581465569 581313858 580806847 580133209
2597.1 580133209 579179459 578597298 578232536 577600975 577214394 577012024 576832275 576382370 575900421 575104370
2606.7 575104370 574408760 574357986 574301071 573536949 572607460 572585983 572416458 571829376 570997887 570301743
2616.4 570301743 569936905 569376068 569102821 568609695 567960281 567569504 567308578 566563301 565603676 565146675
2626 565146675 564728165 564454918 564035721 563888626 563367119 562592316 562211914 561450653 561116676 560607948
$$ packed form
2558.5E96322212n17998p81364l43170m54903l04374j18180o13594j8082k21786m64325
2568.1E92484436p03926m88091m06532n89828J09825o2218l23143o90994n29595k67028
2577.8E88532906m04435m43687p41730l28598k88658l61519l24707k04849k32887p03011
2587.4E84498825o59828m98428k73095m91829m32395l42751l34930j51711n07011o73638
2597.1E80133209r53750n82161l64762o31561l86581k02370j79749m49905m81949p96051
2606.7E75104370o95610n0774n6915p64122r29489k1477j69525n87082q31489o96144
2616.4E70301743l64838n60837k73247m93126o49414l90777k60926p45277r59625m57001
2626E65146675m18510k73247m19197j47095n21507p74803l80402p61261l33977n08728
$$ plain form
2635.6 560607948 560327148 559897346 558944893 558747215 558436661 557914314 557038116 556518631 555787659 554749603
2645.3 554749603 554700279 554475555 554150467 553659172 553285713 553056374 552457695 551807785 551274910 551065178
2654.9 551065178 550517120 550035515 549686050 549251862 548705101 548351555 548327141 547835960 547399712 546699677
2664.6 546699677 546153069 545941048 545586281 545310707 545031891 544981346 544552536 544353600 544015121 543331604
2674.2 543331604 542953072 542610474 542630043 542191200 541706123 541299782 540932312 540471916 539680481 539413643
2683.9 539413643 538889046 538638344 538457375 537966919 537479858 536791191 536535225 536148071 535881195 535774994
2693.5 535774994 535556335 535197983 534677849 534247932 533719482 533381424 533030205 532863121 532369003 531935425
2703.1 531935425 532155342 532205086 532185669 531505432 530566483 529804382 529540901 529569893 529178123 528980370
$$ packed form
2635.6E60607948k80800m29802r52453j97678l10554n22347q76198n19485p30972j038056
2645.3E54749603m9324k24724l25088m91295l73459k29339n98679o49910n32875k09732
2654.9E51065178n48058m81605l49465m34188n46761l53546k4414m91181m36248p00035
2664.6E46699677n46608k12021l54767k75574k78816n0545m28810j98936l38479o83517
2674.2E43331604l78532l42598J9569m38843m85077m06341l67470m60396p91435k66838
2683.9E39413643n24597k50702j80969m90456m87061o88667k55966l87154k66876j06201
2693.5E35774994k18659l58352n20134m29917n28450l38058l51219j67084m94118m33578
2703.1E31935425K19917M9744j9417o80237r38949p62101k63481K8992l91770j97753
$$ plain form
2712.8 528980370 528834991 528884087 528547592 527968826 527448578 526838531 526640968 526221657 526087036 526147156
2722.4 526147156 525966492 525533562 525113106 525022087 524564514 524148369 523617210 523108521 523019257 523189850
2732.1 523189850 523334045 522949219 522501907 522183266 521893311 521259270 520755959 520574646 520535469 520777321
2741.7 520777321 520569382 520327606 520203972 520205231 520338974 520094490 519499054 519142303 519251366 518992996
2751.4 518992996 518633118 518245163 517993965 517873421 517546463 517265167 516930313 517004166 516711273 516106873
2761 516106873 515685577 515445862 515435829 514935913 514593697 514168930 513735847 513408737 513098450 512872925
2770.7 512872925 512341232 512501678 512302475 511368408 510597687 510303192 510247002 509671173 509566154 509342384
2780.3 509342384 508720093 508345604 508089485 507851753 507236404 506626396 506204453 506029510 505459023 504680862
$$ packed form
2712.8E28980370j45379M9096l36495n78766n20248o10047j97563m19311j34621O0120
2722.4E26147156j80664m32930m20456r1019m57573m16145n31159n08689q9264J70593
2732.1E23189850J44195l84826m47312l18641k89955o34041n03311j81313l9177K41852
2741.7E20777321k07939k41776j23634J259J33743k44484n95436l56751J09063k58370
2751.4E18992996l59878l87955k51198j20544l26958k81296l34854P3853k92893o04400
2761E16106873m21296k39715j0033m99916l42216m24767m33083l27110l10287k25525
2770.7E12872925n31693J60446j99203r34067p70721k94495n6190n75829j05019k23770
2780.3E09342384o22291l74489k56119k37732o15349o10008m21943j74943n70487p78161
$$ plain form
2789.9 504680862 504433937 504105644 503310509 502458954 502111473 501730957 501348419 500755539 499884796 499200592
2799.6 499200592 498546410 497956352 497202873 496978416 496760864 496131172 495612068 495031128 494500084 493850937
2809.2 493850937 493329353 492082901 490547218 489604225 488968811 488746986 488080559 487465096 486891670
2817.9 486891670 486067085 485327950 484512138 483677254 483020172 482662659 481641006 480749550 480037079
2826.6 480037079 478905373 478075943 477292786 476637077 475639038 474983902 474917755 474301224 472859802
2835.3 472859802 471267509 470519066 469460220 467796288 465857506 464149628 463077507 461643295
2843 461643295 459942093 458122444 456444855 454700356 452646370 450367203 448032608 446370773 445052986
2851.7 445052986 443993759 443286514 442816010 442319260 441889954 441841812 441897469 441875038 441750183 441661949
$$ packed form
2789.9E04680862k46925l28293p95135q51555l47481l80516l82538n92880q70743o84204
2799.6D99200592o54182n90058p53479k24457k17552o29692n19104n80940n31044o49147
2809.2D93850937n21584j246452j535683r42993o35414k21825o66427o15463n73426
2817.9D86891670q24585p39135q15812q34884o57082l57513j021653q91456p12471
2826.6D80037079j131706q29430p83157o55709r98039o55136o6147o16531j441422
2835.3D72859802j592293p48443j058846j663932j938782j707878j072121j434212
2843D61643295j701202j819649j677589j744499k053986k279167k334595j661835j317787
2851.7D45052986j059227p07245m70504m96750m29306m8142N5657k2431j24855q8234
$$ plain form
2861.3 441661949 441083832 440364227 439712601 439113503 438408470 436905937 435689240 435004730 434864159
2870 434864159 434562531 433991013 433636780 432489166 431799507 431119499 430089226 429510078 428674393 428114090
2879.6 428114090 427620049 427008743 426308823 425237083 424010048 423103142 422577133 421726074 420497894
2888.3 420497894 419500046 418990936 418082199 417083092 416081505 415060921 414726906 413999939 413109856
2897 413109856 412160339 411161346 410602036 410025406 409626656 409255371 408534775 407047386 405847282 405421066
2906.6 405421066 404704895 403641930 402762337 402253990 401023140 399625816 398125610 396193581 395290413
2915.3 395290413 394571724 393016930 391359673 390392570 389597816 388607025 387769508 386634026 385158501
2924 385158501 384438782 384787216 384697380 384669838 385005608 385086594 385281754 385200157 385199738 385273895 385820656
$$ packed form
2861.3D41661949n78117p19605o51626n99098p05033j502533j216697o84510j40571
2870D34864159l01628n71518l54233j147614o89659o80008j030273n79148q35685n60303
2879.6D28114090m94041o11306o99920j071740j227035r06906n26009q51059j228180
2888.3D20497894r97848n09110r08737r99107j001587j020584l34015p26967q90083
2897D13109856r49517r98993n59310n76630l98750l71285p20596j487389j200104m26216
2906.6D05421066p16171j062965q79593n08347j230850j397324j500206j932029r03168
2915.3C95290413p18689j554794j657257r67103p94754r90791q37517j135482j475525
2924C85158501p19719L48434q9836k7542L35770Q0986J95160q1597m19P4157N46761
$$ plain form
2934.6 385820656 386613922 386977921 387407722 387792435 388398056 388776207 389124222 389775009 390894356
2943.3 390894356 392470093 392961197 393154449 393807907 394265633 394680901 395291443 395968437 396903038
2952 396903038 398006401 398063011 397874908 398263664 398659859 399295235 400119896 400717888 401229477 402072563
2961.6 402072563 402804337 403181839 403605804 404564095 405522881 405892830 406425285 407224007 408160782 408925285
2971.2 408925285 409403954 409896545 410798302 411784325 412062569 412531776 413290176 413724709 413707848 413783340
2980.9 413783340 414299011 414618340 415060425 415383987 415487785 415520668 415627861 415883827 415768967 415924568
2990.5 415924568 416247368 416443481 416457596 416159515 415950890 415773926 415564575 415001793 414227524 413780479
3000.2 413780479 413729935 413630638 413158188 412409744 411722794 411282692 410631714 410084686 409781952 409382248
$$ packed form
2934.6C85820656P93266L63999M29801L84713O05621L78151L48015O50787J119347
2943.3C90894356J575737M91104J93252O53458M57726M15268O10542O76994R34601
2952C96903038J103363N6610j88103L88756L96195O35376Q24661N97992N11589Q43086
2961.6D02072563P31774L77502M23965R58291R58786L69949N32455P98722R36775P64503
2971.2D08925285M78669M92591R01757R86023K78244M69207P58400M34533j6861P5492
2980.9D13783340N15671L19329M42085L23562J03798L2883J07193K55966j14860J55601
2990.5D15924568L22800J96113J4115k98081k08625j76964k09351n62782p74269m47045
3000.2D13780479n0544r9297m72450p48444o86950m40102o50978n47028l02734l99704
$$ plain form
3009.8 409382248 408690834 408139420 407686043 406820908 406614571 406202736 405346260 405011711 404354324 403434296
3019.5 403434296 402545319 401915359 401081886 400196037 399614105 398766174 397975235 397093010 396360817 395851669
3029.1 395851669 395336380 394755287 393817520 392982788 392214813 391220436 390039330 388928261 388080482
3037.8 388080482 387577782 386971664 386166115 385574150 384875717 384070930 383068466 382299767 381554947
3046.5 381554947 380358047 379488678 378938828 378408852 377718964 377200089 376344261 375033379 374101639
3055.1 374101639 373325806 372585297 371364059 370350113 369685669 368914108 368530617 368097115 367293472
3063.8 367293472 366047783 365463104 365014458 363899002 363098755 362318916 361836853 361304932 360419006
3072.5 360419006 359757805 359340363 358925018 358040161 357103996 356638832 356262550 355294495 354666138 354226875
$$ packed form
3009.8D09382248o91414n51414m53377q65135k06337m11835q56476l34549o57387r20028
3019.5D03434296q88977o29960q33473q85849n81932q47931p90939q82225p32193n09148
3029.1C95851669n15289n81093r37767q34732p67975r94377j181106j111069q47779
3037.8C88080482n02700o06118q05549n91965o98433q04787j002464p68699p44820
3046.5C81554947j196900q69369n49850n29976o89888n18875q55828j310882r31740
3055.1C74101639p75833p40509j221238j013946o64444p71561l83491m33502q03643
3063.8C67293472j245689n84679m48646j115456q00247p79839m82063n31921q85926
3072.5C60419006o61201m17442m15345q84857r36165m65164l76282r68055o28357m39263
$$ plain form
3082.1 354226875 353134537 352282639 351414871 351008606 350698357 349484062 348583183 348163834 347676544
3090.8 347676544 347029686 346287346 345667381 345184021 344597244 344059486 343478279 342537079 341594582 340712204
3100.5 340712204 339925842 339348488 339014282 338274231 337247314 336651306 335860901 335094643 334286995
3109.1 334286995 333338890 332800636 332458763 331987915 331101074 330165253 329233322 328470917 328012314 327301292
3118.8 327301292 326279984 325352554 324894524 324384117 323520203 322734566 322025452 321175156 320617142
3127.5 320617142 320128555 319033604 317997284 317306404 316914864 316082954 314943199 314313927 313481922
3136.1 313481922 312706795 311891670 311266079 310758629 309555111 308520908 307808495 307237053 306615124
3144.8 306615124 305947628 305369625 304757309 304150486 303211479 302195129 301240559 300553474 299919014
$$ packed form
3082.1C54226875j092338q51898q67768m06265l10249j214295r00879m19349m87290
3090.8C47676544o46858p42340o19965m83360n86777n37758n81207r41200r42497q82378
3100.5C40712204p86362n77354l34206p40051j026917n96008p90405p66258q07648
3109.1C34286995r48105n38254l41873m70848q86841r35821r31931p62405m58603p11022
3118.8C27301292j021308r27430m58030n10407q63914p85637p09114q50296n58014
3127.5C20617142m88587j094951j036320o90880l91540q31910j139755o29272q32005
3136.1C13481922p75127q15125o25591n07450j203518j034203p12413n71442o21929
3144.8C06615124o67496n78003o12316o06823r39007j016350r54570o87085o34460
$$ plain form
3153.5 299919014 299109993 298586845 297929668 296942101 295898800 295164948 294400826 293280449 292476311
3162.2 292476311 292046299 291406231 290682640 290253105 289690456 289058266 288183289 287206306 286542149 285520821
3171.8 285520821 284278259 283198299 282725391 282449322 281765652 281056023 280403671 279769650 278782730
3180.5 278782730 277964478 277412586 276869946 276461143 275710716 274845676 273912258 273025684 272172718 271496811
3190.1 271496811 271138897 270429401 269411526 268448524 267950172 267644215 267153206 266362457 265686722
3198.8 265686722 265221806 264392223 263838539 263101158 262399540 262093830 261618671 261185646 260085850
3207.5 260085850 259337521 259166775 258590488 258134537 257541924 256965809 256310673 255435905 254783363 254365749
3217.2 254365749 253912296 253047619 252329216 252135391 251858788 251249104 250568695 249750595 249161816 249004192
$$ packed form
3153.5B99919014q09021n23148o57177r87567j043301p33852p64122j120377q04138
3162.2B92476311m30012o40068p23591m29535n62649o32190q74977r76983o64157j021328
3171.8B85520821j242562j079960m72908k76069o83670p09629o52352o34021r86920
3180.5B78782730q18252n51892n42640m08803p50427q65040r33418q86574q52966o75907
3190.1B71496811l57914p09496j017875r63002m98352l05957m91009p90749o75735
3198.8B65686722m64916q29583n53684p37381p01618l05710m75159m33025j099796
3207.5B60085850p48329j70746n76287m55951n92613n76115o55136q74768o52542m17614
3217.2B54365749m53453q64677p18403j93825k76603o09684o80409q18100n88779j57624
$$ plain form
3226.8 249004192 248655243 248013401 247294712 246723137 246024227 245385990 245210342 245114861 244945393 244132729
3236.4 244132729 242938309 242410660 241831799 240937538 240828152 240473003 239641113 239641361 239571667 239444332
3246.1 239444332 239218521 238307972 237415085 236815262 236595192 236013393 235440369 235359459 234989586 234371510
3255.7 234371510 233394909 232764511 232667046 232550945 232334213 231720886 231312313 231005611 230643940 230609550
3265.4 230609550 230331612 229755802 229087601 228587646 228543568 228295650 227886257 227698956 227189522 226619644
3275 226619644 226439686 225952263 225045815 224831238 225050564 224742680 224561176 224319000 223659115 223428116
3284.7 223428116 223373070 222981014 222499027 222055740 221676731 221507416 221255131 220716934 220195808 219883690
3294.3 219883690 219956017 219858055 219353390 219212475 219104996 218531151 218021107 217868385 217751808 217410984
$$ packed form
3226.8B49004192l48949o41842p18689n71575o98910o38237j75648r5481j69468q12664
3236.4B44132729j194420n27649n78861q94261j09386l55149q31890K48o9694j27335
3246.1B39444332k25811r10549q92887n99823k20070n81799n73024q0910l69873o18076
3255.7B34371510r76601o30398r7465j16101k16732o13327m08573l06702l61671l4390
3265.4B30609550k77938n75810o68201m99955m4078k47918m09393j87301n09434n69878
3275B26619644j79958m87423r06448k14577K19326l07884j81504k42176o59885k30999
3284.7B23428116n5046l92056m81987m43287l79009j69315k52285n38197n21126l12118
3294.3B19883690P2327r7962n04665j40915j07479n73845n10044j52722j16577l40824
$$ plain form
3303.9 217410984 217247524 217235775 216923141 216359444 215568275 215193520 214974403 214227924 213848038 213885193
3313.6 213885193 213621082 213026848 212787628 212611656 211853657 211336346 211118679 211091805 210864429 210529957
3323.2 210529957 210392151 209503822 208668270 208128262 207475090 207079773 206858673 206720428 206163139 205514641
3332.9 205514641 204883747 204328308 204214764 203969288 203202724 202375469 202141724 201475468 200435715
3341.6 200435715 199950218 199692440 199745884 199410419 198687706 198279247 198590794 199004002 198315086 197535915
3351.2 197535915 197155914 196884785 196647930 196340694 195961800 195442295 195705910 196077709 195680904 195280914
3360.8 195280914 194634151 193728943 193269596 193267479 193381519 193452969 193542843 193447208 192831154 192317276
3370.5 192317276 192466335 192595940 192358398 191925335 191575985 191644039 191660767 191278458 190920944 190587215
$$ packed form
3303.9B17410984j63460j1749l12634n63697p91169l74755k19117p46479l79886L7155
3313.6B13885193k64111n94234k39220j75972p57999n17311k17667k6874k27376l34472
3323.2B10529957j37806q88329q35552n40008o53172l95317k21100j38245n57289o48498
3332.9B05514641o30894n55439j13544k45476p66564q27255k33745o66256j039753
3341.6B00435715m85497k57778N3444l35465p22713m08459L11547M13208o88916p79171
3351.2A97535915l80001k71129k36855l07236l78894n19505K63615L71799l96805l99990
3360.8A95280914o46763r05208m59347k117J14040P1450Q9874r5635o16054n13878
3370.5A92317276J49059J29605k37542m33063l49350O8054J6728l82309l57514l33729
$$ plain form
3380.1 190587215 190456963 190661545 190445805 190262947 190546284 190325985 189654522 189296436 189134426 188940697
3389.8 188940697 189308853 189995880 190128384 189912338 189722919 189382420 188887539 188639622 188724194 189005871
3399.4 189005871 188956852 188461514 188753242 189488754 189430103 188993549 188571262 188323364 188579044 188865013
3409.1 188865013 188946381 189105911 189434986 189655056 189534950 189646454 189783039 189785614 189976864 190102406
3418.7 190102406 190363712 190431499 190385113 190754414 191153240 191187706 191124420 191530590 191887627 191963806
3428.3 191963806 192101955 192685089 193394909 193375244 193137131 193189926 193544216 193928165 194484196 194655800
3438 194655800 194767570 195643234 195934772 196461906 197051392 197156773 197489567 197786980 198796253 198994884
3447.6 198994884 199073963 199789047 200028381 200555401 200769901 201256809 201850948 202143059 203038120 203891964
$$ packed form
3380.1A90587215j30252K04582k15740j82858K83337k20299o71463l58086j62010j93729
3389.8A88940697L68156O87027J32504k16046j89419l40499m94881k47917Q4572K81677
3399.4A89005871m9019m95338K91728P35512n8651m36554m22287k47898K55680K85969
3409.1A88865013Q1368J59530L29075K20070j20106J11504J36585K575J91250J25542
3418.7A90102406K61306O7787m6386L69301L98826L4466o3286M06170L57037P6179
3428.3A91963806J38149N83134P09820j9665k38113N2795L54290L83949N56031J71604
3438A94655800J11770Q75664K91538N27134N89486J05381L32794K97413J009273J98631
3447.6A98994884P9079P15084K39334N27020K14500M86908N94139K92111Q95061Q53844
$$ plain form
3457.3 203891964 204076309 203982868 204633446 205503540 206450691 207238598 207463226 207803249 208482418 209658184
3466.9 209658184 210235119 210399189 210477200 210758057 211694298 212726669 214068356 214446182 214354267 215173302
3476.6 215173302 216392422 217230282 217712936 218780212 219284878 219572430 220108547 221000404 222390232
3485.2 222390232 222958660 223661499 224518623 225316830 226022091 226301517 227117214 228536415 229705009
3493.9 229705009 229739647 230152302 231366692 232359676 233250427 233761406 234699593 235889740 236849976
3502.6 236849976 237871952 238678513 239519501 240207195 240731163 241957932 243147602 243764038 244848804
3511.3 244848804 245326252 246013756 247331657 248010845 249226036 250856991 252001820 252777653 253566399
3520 253566399 254048233 254817753 256108265 256738815 258010273 259615116 261197739 262463989 262866535
$$ packed form
3457.3B03891964J84345r3441O50578Q70094R47151P87907K24628L40023O79169J175766
3466.9B09658184N76935J64070P8011K80857R36241J032371J341687L77826r1915Q19035
3476.6B15173302J219120Q37860M82654J067276N04666K87552N36117Q91857J389828
3485.2B22390232N68428P02839Q57124P98207P05261K79426Q15697J419201J168594
3493.9B29705009L4638M12655J214390R92984Q90751N10979R38187J190147R60236
3502.6B36849976J021976Q06561Q40988O87694N23968J226769J189670O16436J084766
3511.3B44848804M77448O87504J317901O79188J215191J630955J144829P75833P88746
3520B53566399M81834P69520J290512O30550J271458J604843J582623J266250M02546
$$ plain form
3528.6 262866535 263616791 264938049 266377563 267243958 268323307 269460812 270804253 272271385 272599411
3537.3 272599411 273058949 274201603 276252518 277698460 278871880 280576534 281965446 283017769
3545 283017769 283694706 285855274 286751785 287500572 289632835 291165733 292758541 293297920 294956207
3553.7 294956207 296826458 298118210 299811306 300905666 302628250 304403591 306336803 307168331
3561.4 307168331 308827686 311008797 311838341 314978294 316841450 318245564 319169922 319219074 322316628
3570.1 322316628 324426422 326110382 327576561 329225388 330975304 332853966 335277023 336278000
3577.8 336278000 338585472 340614700 341738434 343864937 346238785 348155441 349280815 352667885
3585.5 352667885 355070724 355117950 357191277 358505287 360940208 363549881 366418877 367904320 369189339
$$ packed form
3528.6B62866535P50256J321258J439514Q66395J079349J137505J343441J467132L28026
3537.3B72599411M59538J142654K050915J445942J173420J704654J388912J052323
3545B83017769O76937K160568Q96511P48787K132263J532898J592808N39379J658287
3553.7B94956207J870251J291752J693096J094360J722584J775341J933212Q31528
3561.4C07168331J659355K181111Q29544L139953J863156J404114R24358M9152L097554
3570.1C22316628K109794J683960J466179J648827J749916J878662K423057J000977
3577.8C36278000K307472K029228J123734K126503K373848J916656J125374L387070
3585.5C52667885K402839M7226K073327J314010K434921K609673K868996J485443J285019
$$ plain form
3594.2 369189339 373004646 373854370 375537338 378928223 380955009 383878975 385664978 387095528
3601.9 387095528 389480019 391650925 394111900 396769791 399894524 401982384 405453873 406261292
3609.6 406261292 405903893 411924591 414594612 414144936 418850822 420223579 423147163 426819534 428850060
3618.3 428850060 432279510 433092804 434751053 437941666 440215797 442108040 445316429 448290634
3626 448290634 451227951 458873825 463021927 455096512 457806168 462586174 467333527 469550896 470100937
3634.7 470100937 472915611 476608658 480028458 482042084 484378891 487011147 489926643 492565536
3642.4 492565536 494522591 497351494 500809212 506624336 508555832 506861954 511734428 513941154
3650.1 513941154 514294319 513637924 517924690 522536774 526497612 532600975 528306694 528952713 533864365
$$ packed form
3594.2C69189339L815307Q49724J682968L390885K026786K923966J786003J430550
3601.9C87095528K384491K170906K460975K657891L124733K087860L471489Q07419
3609.6D06261292l57399O020698K670021m49676M705886J372757K923584L672371K030526
3618.3D28850060L429450Q13294J658249L190613K274131J892243L208389K974205
3626D48290634K937317P645874M148102p925415K709656M780006M747353K217369N50041
3634.7D70100937K814674L693047L419800K013626K336807K632256K915496K638893
3642.4D92565536J957055K828903L457718N815124J931496j693878M872474K206726
3650.1E13941154L53165o56395M286766M612084L960838O103363m294281O46019M911652
$$ plain form
3658.8 533864365 536530952 539429092 540320778 542257156 544029999 546297989 548388824 549218674 553909035
3667.5 553909035 556976013 557754860 559028816 553403816 555079765 562154655 571050491 574001350
3675.2 574001350 560744057 561399689 568064003 573338661 572326393 572285614 574598618 576347504 578105927
3683.9 578105927 579293633 579919586 583346939 590587502 585882759 580947685 588095055 585228348
3691.6 585228348 584274940 588478012 588920822 590617104 591589966 591294212 592321129 592771034 595175476
3700.3 595175476 598581657 595682297 592920723 596297493 598661919 599348869 599289284 600580215 604219704
3709 604219704 599777336 602636185 607502251 597276688 599813118 603849602 604712105 604915733 606563759
3717.7 606563759 608491898 605814056 605907555 610758171 609902191 606063156 609823036 611394196 610903358
$$ packed form
3658.8E33864365K666587K898140Q91686J936378J772843K267990K090835Q29850M690361
3667.5E53909035L066978P78847J273956n625000J675949P074890Q895836K950859
3675.2E74001350j3257293O55632O664314N274658j012268m0779K313004J748886J758423
3683.9E78105927J187706O25953L427353P240563m704743m935074P147370k866707
3691.6E85228348r53408M203072M42810J696282R72862k95754J026917M49905K404442
3700.3E95175476L406181k899360k761574L376770K364426O86950n9585J290931L639489
3709F04219704m442368K858849M866066j0225563K536430M036484Q62503K03628J648026
3717.7F06563759J928139k677842R3499M850616q55980l839035L759880J571160m90838
$$ plain form
3726.3 610903358 609142723 608040466 610737762 611829338 616613884 615965385 609205437 616691475
3734 616691475 619331665 612052345 611077995 613352127 613602028 614416237 617437477 614691162 617153511
3742.7 617153511 628475418 621924057 604650269 612616158 618313217 624292221 624554939 615010490
3750.4 615010490 624552612 622620277 613077087 617044868 620040398 622840309 618162918 619400826
3758.2 619400826 625968361 619978523 617605133 620982666 622088661 622501831 625893555 624978256 620259209
3766.8 620259209 622256393 627332726 629596138 621431923 621751595 625105095 625027275 625309753 624510651
3775.5 624510651 624851418 625737190 628558083 629546242 623223457 624542084 626181183 626730766 628808937
3784.2 628808937 627104530 626426392 627715263 628294792 628087883 627251663 627119522 627325745 628229256
$$ packed form
3726.3F10903358j760635j102257K697296J091576M784546o48499o759948P486038
3734F16691475K640190p279320r74350K274132K49901Q14209L021240k746315K462349
3742.7F17153511J1321907o551361j7273788P965889N697059N979004K62718r544449
3750.4F15010490R542122j932335r543190L967781K995530K799911m677391J237908
3758.2F19400826O567535n989838k373390L377533J105995M13170L391724r15299m719047
3766.8F20259209J997184N076333K263412q164215L19672L353500p7820K82478p99102
3775.5F24510651L40767Q85772K820893R88159o322785J318627J639099N49583K078171
3784.2F28808937j704407o78138J288871N79529k06909q36220j32141K06223R03511
$$ plain form
3792.9 628229256 627990913 628539734 631545715 628878899 625417824 626826172 630353127 637888641 634702148
3801.5 634702148 622747574 625292587 627288971 630814781 636730843 629909019 624234467 628118057
3809.3 628118057 630512772 630834236 631187401 631080704 632184105 637722740 637830315 623860703 626601639
3817.9 626601639 631789093 636421280 641144333 627537117 626091766 629738464 630697403 633022995
3825.7 633022995 633521423 629831543 629936142 631395950 633512230 636346588 630045509 630240402 636902466
3834.3 636902466 632974052 631336250 638567429 632967339 627633095 633919601 630724525 629401321
3842.1 629401321 635766487 635285225 630706863 631344261 632174606 632424965 633869286 633043823 633843460
3850.7 633843460 638849602 637304039 640582047 627648506 624116020 633228416 633842888 631226921
$$ packed form
3792.9F28229256k38343N48821L005981k666816l461075J408348L526955P535514l186493
3801.5F34702148j1954574K545013J996384L525810N916062o821824n674552L883590
3809.3F28118057K394715L21464L53165j06697J103401N538635J07575j3969612K740936
3817.9F26601639N187454M632187M723053j3607216j445351L646698R58939K325592
3825.7F33022995M98428l689880J04599J459808K116280K834358o301079J94893O662064
3834.3F36902466l928414j637802P231179n600090n334244O286506l195076j323204
3842.1F29401321O365166m81262m578362O37398Q30345K50359J444321q25463P99637
3850.7F33843460N006142j545563L278008j2933541l532486R112396O14472k615967
$$ plain form
3858.4 631226921 632130775 633520546 635922585 631597519 630925941 637594986 634079819 628141251 630689545
3867.1 630689545 634793587 641090851 636736031 627754784 629520950 634170341 638885078 630916824
3874.8 630916824 629298439 632375641 632593956 635092430 640040741 637355499 628351364 631483269
3882.6 631483269 633335991 635044746 641310959 631173134 629748230 632947845 633250809 636378975
3890.3 636378975 636818047 631651573 631791420 633909378 632237968 632720490 633210220 635131798 639001160
3898.9 639001160 631110077 634276581 636760101 631026917 634852104 633309898 632086716 631842728
3906.7 631842728 631034431 632609940 632654228 632397346 631862373 632195091 633255997 633235741 633806038 635940628
3916.3 635940628 633970070 630647278 633802414 633651810 629894562 630873642 632264481 633845215 633246117
$$ packed form
3858.4F31226921R03854J389771K402039m325066o71578O669045l515167n938568K548294
3867.1F30689545M104042O297264m354820q981247J766166M649391M714737p968254
3874.8F30916824j618385L077202K18315K498474M948311k685242r004135L131905
3882.6F31483269J852722J708755O266213j0137825j424904L199615L02964L128166
3890.3F36378975M39072n166474J39847K117958j671410M82522M89730J921578L869362
3898.9F39001160p891083L166504K483520n733184L825187j542206j223182k43988
3906.7F31842728q08297J575509M4288k56882n34973L32718J060906k0256N70297K134590
3916.3F35940628j970558l322792L155136j50604l757248R79080J390839J580734n99098
$$ plain form
3925 633246117 630711555 631434479 632777214 633614616 633109665 633485565 635900841 633424644 631020126
3933.7 631020126 632192650 631888924 632117195 632553444 631398506 630804367 631480408 633239975 633999023
3942.3 633999023 630829926 629838791 631328545 632711678 634362602 632741051 632218475 632737694 631109657
3951 631109657 632434082 632730713 631348763 630870476 631390724 632122002 631020966 631067429 631441841 632216492
3960.7 632216492 632984695 631616440 631096916 630863037 630793419 631518402 631734390 632083626 632576599 631686974
3970.3 631686974 631455727 631946716 631450005 631245003 631058884 631712494 631717720 631086235 631488495 631603432
3980 631603432 631730690 631290169 631387939 631539917 631262093 630815201 630267563 631084709 630842094 630962982
3989.6 630962982 631320190 630776596 631232338 631672363 631859474 630854149 630829086 631486015 631218452 631710548
$$ packed form
3925F33246117k534562P22924J342735Q37402n04951L75900K415276k476197k404518
3933.7F31020126J172524l03726K28271M36249j154938n94139O76041J759567P59048
3942.3F33999023l169097r91135J489754J383133J650924j621551n22576N19219j628037
3951F31109657J324425K96631j381950m78287N20248P31278j101036M6463L74412P74651
3960.7F32216492P68203j368255n19524k33879o9618P24983K15988L49236M92973q89625
3970.3F31686974k31247M90989m96711k05002j86119O53610N226o31485M02260J14937
3980F31603432J27258m40521R7770J51978k77824m46892n47638Q17146k42615J20888
3989.6F30962982L57208n43594M55742M40025J87111j005325k5063O56929k67563M92096
$$ plain form
3999.2 631710548 632378616
4000.2 632378616
$$ packed form
3999.2F31710548O68068
4000.2F32378616
##END=$$ End of the data block
