##TITLE=$$ Begin of the data block
##JCAMP-DX=5.00 $$ ACD/SpecManager v 10.08
##SPECTROMETER/DATA SYSTEM=Varian
##DATE=14 Jan 2013 09:28:06
##DATA TYPE=INFRARED SPECTRUM
##DATA CLASS=XYDATA
##ORIGIN=
##OWNER=
##NPOINTS=3735
##FIRSTX=399.26403809
##LASTX=4000.35498047
##MAXX=4000.35498047
##MINX=399.26403809
##MAXY=69.68659973
##MINY=18.86636734
##XFACTOR=1.0000000000
##YFACTOR=0.000000100000000
##FIRSTY=39.98538589
##DELTAX=0.96440572
##XUNITS=1/CM
##YUNITS=TRANSMITTANCE
##XYDATA=(X++(Y..Y))
399.3C99853859R786148K159538n446968p525215P039948J499481k970047K285309
$$ 399853859 409640007 411799545 406352577 398827362 405867310 407366791 404396744 406682053
407D06682053k061539o724854k564735L708649K95448p97386J198578J153831l281364
$$ 406682053 404620514 397895660 395330925 399039574 399335022 398537636 399736214 400890045 397608681
415.7C97608681l285904J283417j77269M322509k57873m847794o505661j823501M516220
$$ 397608681 394322777 395606194 395428925 399751434 399493561 394645767 388140106 386316605 390832825
424.3C90832825M074211J776237o58683K033958l185959l572769J890068j121674R42574
$$ 390832825 394907036 396683273 396024590 398058548 394872589 391299820 393189888 392068214 393010788
433C93010788n20248j142045M1199k065811K133370L136024J48621l331414L83835
$$ 393010788 392490540 391348495 391389694 389323883 391457253 394593277 394741898 391410484 391794319
441.7C91794319N072785Q98361q31986l611030j928673k53906l556824M10233J166267
$$ 391794319 396867104 397765465 396933479 393322449 391393776 391139870 387583046 387993279 389159546
450.4C89159546j922302P68661K236786J555595J527405m10499m505501l599205L859596
$$ 389159546 387237244 388005905 390242691 391798286 393325691 392915192 388409691 384810486 388670082
459.1C88670082J208840l390885l5744O178780J429901l794098o755028m327964N155410
$$ 388670082 389878922 386488037 386452293 392631073 394060974 390266876 383511848 379183884 384339294
467.7C84339294K198906j794662r60159k585869j752014r97963Q90045Q24508Q34580
$$ 384339294 386538200 384743538 383783379 381197510 379445496 378447533 379337578 380162086 380996666
476.4C80996666n35698K75650R01947j255188J28212m852562k950897J76735l084641
$$ 380996666 380460968 380736618 381638565 380383377 380511589 375659027 372708130 372884865 369800224
485.1C69800224M64211J104088L431930N30892j614190J199341l087730k794533L28255
$$ 369800224 370264435 371368523 374800453 375331345 373717155 374916496 371828766 369034233 369362488
493.8C69362488K291527K200126Q04367Q1635k924881k407074P92389O70051k367553
$$ 369362488 371654015 373854141 374658508 374740143 371815262 369408188 370200577 370870628 368503075
502.5C68503075l99399Q59680J014862K670441j569939l499794P0992r6054K37121
$$ 368503075 368103676 368963356 369978218 372648659 371078720 367578926 367649918 367553864 367790985
511.1C67790985J944962j411095k825584j045495j691932j581879N08270J928902j403084
$$ 367790985 369735947 368324852 365499268 364453773 362761841 361179962 361688232 363617134 362214050
519.8C62214050j871490J461677J551247J094208p7400n69725j766816j208038M2877
$$ 362214050 360342560 361804237 363355484 364449692 364372292 363802567 362035751 360827713 360870590
528.5C60870590l17154K45858m04969O29921O66542j507644j551133J17684J305389
$$ 360870590 360553436 360799294 360394325 361024246 361690788 360183144 358632011 358749695 360055084
537.2C60055084q99086q41369J294288L59383j046486m83933j103248j657334Q19321
$$ 360055084 359155998 358314629 359608917 359968300 358921814 358437881 357334633 355677299 356496620
545.9C56496620K11983j156082j031189j108055J42707K05422r42001j207238p02057
$$ 356496620 356708603 355552521 354521332 353413277 353555984 353761406 352819405 351612167 350910110
554.5C50910110j728630l8757K014275p2708m55513N6304J26191p30896k121201j088676
$$ 350910110 349181480 349142723 351156998 351084290 350628777 350685081 350811272 350080376 347959175 346870499
564.2C46870499O33011J699104K221832N80025j196480L23143Q85468p79572j404419
$$ 346870499 347503510 349202614 351424446 352004471 350807991 351131134 352016602 351237030 349832611
572.9C49832611p75146K64930q4152n74226m28582k56996n41114p62330M80195J244888
$$ 349832611 349057465 349322395 349238243 348664017 348235435 347978439 347437325 346674995 347155190 348400078
582.5C48400078J03111p56531R05190P64618k06414K18659J19400n94292r44862J184425
$$ 348400078 348503189 347746658 348651848 349416466 349210052 349428711 349548111 348953819 348008957 349193382
592.1C49193382K153015K113762J197815r96933o13250p4311k06718k05574K07557
$$ 349193382 351346397 353460159 354657974 353661041 353047791 352973480 352766762 352561188 352768745
600.8C52768745o57806p06749J342659n3253j260758K50588k4033k107505j582566
$$ 352768745 352110939 351404190 352746849 352693596 351432838 351683426 351659393 349551888 347969322
609.5C47969322M68826L97683j33248j125412o4125Q90389m38919n28336j49040K24686
$$ 347969322 348438148 348835831 348702583 347577171 347513046 348403435 347964516 347436180 347287140 347511826
619.2C47511826L78837J109009N30586n14946N31273K38533m54292Q56132J817093
$$ 347511826 347890663 348999672 349530258 349015312 349546585 349785118 349330826 350186958 352004051
627.8C52004051J578217J291313M34990J202392J926346M49944J542854K065582R80530
$$ 352004051 353582268 354873581 355308571 356510963 358437309 358887253 360430107 362495689 363476219
636.5C63476219J488953J113663R68627J398201P96967O06232O76155P15256J044883
$$ 363476219 364965172 366078835 367047462 368445663 369242630 369848862 370525017 371240273 372285156
645.2C72285156R19762J030044J773377J479225N8861L12385J000138J03912P1716
$$ 372285156 373204918 374234962 376008339 377487564 377546425 377858810 378858948 378962860 379034576
653.9C79034576J72577J19019J274948Q92334j034431j052285J02616L50875Q7510
$$ 379034576 379207153 379326172 380601120 381493454 380459023 379406738 379509354 379860229 379947739
662.5C79947739n20974m92057J086044K282562K003823k539292j288414P52449K87819
$$ 379947739 379426765 378934708 380020752 382303314 384307137 381767845 380479431 381231880 381519699
671.2C81519699J39084J885376K610931M99497m6082Q90770Q55408J99280L59344J525803
$$ 381519699 381658783 383544159 386155090 386654587 386608505 387499275 388354683 388553963 388913307 390439110
680.9C90439110K051811K277908J547318M80080R39941R45511M05960Q92486O43006
$$ 390439110 392490921 394768829 396316147 396796227 397736168 398681679 399087639 399980125 400623131
689.6D00623131M29077J351089J469498R84230Q2741l6736N89028R70688J397400P95288
$$ 400623131 401052208 402403297 403872795 404857025 404939766 404903030 405492058 406462746 407860146 408655434
699.2D08655434K04086j37253O28052J461449O12144N82695N62668P19795R87816Q09975
$$ 408655434 408859520 408722267 409350319 410811768 411423912 412006607 412569275 413289070 414276886 415086861
708.8D15086861R53712K20184K72103R85946Q75779M25796L48129J152306Q71162L77427
$$ 415086861 416040573 416260757 416532860 417518806 418394585 418820381 419168510 420320816 421191978 421569405
718.5D21569405J212196N38444j17149O31485K22359L66554N33104Q80737K048149
$$ 421569405 422781601 423320045 423202896 423834381 424056740 424423294 424956398 425837135 427885284
727.2D27885284J574898J138916L71933p1564J339264J521492M59404M18511J299782
$$ 427885284 429460182 430599098 430971031 430899467 432238731 433760223 434219627 434638138 435937920
735.8D35937920J107444O02036J248703J015167o15425k83546Q28476N93299P50237
$$ 435937920 437045364 437647400 438896103 439911270 439295845 439012299 439840775 440434074 441184311
744.5D41184311K52228M43763J563988J271935P4348K76833J332397J5221J7586J557693
$$ 441184311 441436539 441880302 443444290 444716225 444790573 445067406 446399803 446415024 446432610 447990303
754.2D47990303J672401Q71163K62604J142044J035194R65042J120224J003227J240845
$$ 447990303 449662704 450533867 450796471 451938515 452973709 453938751 455058975 456062202 457303047
762.8D57303047Q65097J190682J264953J301461M85000n92842J19667O23245N68886
$$ 457303047 458168144 459358826 460623779 461925240 462410240 461817398 461937065 462560310 463129196
771.5D63129196M42085k8152l60336M82902L42903p37610p95478J64337Q46481L92800
$$ 463129196 463571281 463543129 463182793 463665695 464008598 463270988 462475510 462639847 463486328 463879128
781.2D63879128O25877J16386P057L98102M7303j6251J71051J177025M97856O27594
$$ 463879128 464505005 464621391 464628448 465026550 465073853 465057602 465228653 466405678 466903534 467531128
790.8D67531128J411819R79958M33617j013260j137238j567688j108475N16968Q71468
$$ 467531128 468942947 469922905 470356522 469343262 468206024 466638336 465529861 466046829 466918297
799.5D66918297j106873j817093L76778j117325k512321k575150j490440n24178k292099
$$ 466918297 465811424 463994331 464371109 463253784 460741463 458166313 456675873 456151695 453859596
808.2D53859596j455955r59244j550369j749459j934623j848374j585731o02951p53899
$$ 453859596 452403641 451444397 449894028 448144569 446209946 444361572 442775841 442172890 441418991
816.9D41418991n45273l33175N14717J250114j75819k01035J308060J872101Q27636
$$ 441418991 440873718 440540543 441055260 442305374 442129555 441928520 443236580 445108681 445936317
825.5D45936317J645318L206062L317604L202705K494164L020553L224335L281479
$$ 445936317 447581635 450787697 454105301 457308006 459802170 462822723 466047058 469328537
833.3D69328537L187256K571144K306595K554436K901649J486931J599007J291389
$$ 469328537 472515793 475086937 477393532 479947968 482849617 484336548 485935555 487226944
841D87226944J585197K215081J142349J959801J584510Q13103N58930J590423K229309
$$ 487226944 488812141 491027222 492169571 494129372 495713882 496526985 497085915 498676338 500905647
849.6E00905647J548577J456489J100807J721764N37224O08291J604538J634331J399460
$$ 500905647 502454224 503910713 505011520 506733284 507270508 507878799 509483337 511117668 512517128
858.3E12517128N44548J537170J163712J126823O67229J1673K2163p02362n80177r73129
$$ 512517128 513061676 514598846 515762558 516889381 517556610 517568283 517590446 516888084 516307907 515334778
868E15334778q75397j651459q52012p20978k029762j906700j466485n58204j930390
$$ 515334778 514459381 512807922 511955910 511234932 509205170 507298470 505831985 505273781 503343391
876.7E03343391p85217l05862r95255n91583j536560k74086r26247q11691m17404r04961
$$ 503343391 502558174 502252312 501257057 500665474 499128914 498854828 497928581 497116890 496699486 495794525
886.3D95794525k16713n14412o82373j113624R34295P05338k57302N65033k67677O638
$$ 495794525 495577812 495063400 494381027 493267403 494201698 494907036 494649734 495214767 494947090 494953728
895.9D94953728Q2473J337319R88274k97509k22015k1172L79525k2355J424294J768036
$$ 494953728 495036201 496373520 497361794 497064285 496842270 496821098 497200623 497178268 498602562 500370598
905.6E00370598K357979K874946J787377J792068J590881J524849K28615o51893j564064
$$ 500370598 502728577 505603523 507390900 509182968 510773849 512298698 512527313 511875420 510311356
914.3E10311356j091385r85909j630516o16531k201882j845283j863518l462982l814278
$$ 510311356 509219971 508234062 506603546 505987015 503785133 501939850 500076332 496613350 492799072
922.9D92799072l835754l083038l431015l211480l465957k677193k149353l123436
$$ 492799072 488963318 485880280 482449265 479237785 475771828 473094635 470945282 467821846
930.7D67821846k923050k878494k098084j975822j250610r02405j624642r81903r40513
$$ 467821846 464898796 462020302 459922218 457946396 456695786 455793381 454168739 453186836 452246323
939.3D52246323p45583j242561j596756j177979j064567n32608m60091l32756K39067
$$ 452246323 451500740 450258179 448661423 447483444 446418877 445886269 445426178 445093422 445332489
948D45332489M59518p3013R0866j69410r05533n46456n03158n96772j581192k100372
$$ 445332489 445792007 445718994 445809860 445640450 444734917 444188461 443685303 443088531 441507339 439406967
957.7D39406967j884231k341195k329025k060051k302055j959648r02329j350288k310295
$$ 439406967 437522736 435181541 432852516 430792465 428490410 426530762 425628433 424278145 421967850
966.3D21967850k362252j474266j445579k350960k335815k758408k942848l096581
$$ 421967850 419605598 418131332 416685753 414334793 411998978 409240570 406297722 403201141
974.1D03201141k673530k370606l018074l225441m246101m589539m691620m630966
$$ 403201141 400527611 398157005 395138931 391913490 387667389 383077850 378386230 373755264
981.8C73755264m524803n538216n286865m295006m259567n189514n277138l765945
$$ 373755264 369230461 363692245 358405380 354110374 349850807 344661293 339384155 335618210
989.5C35618210l695259m613838l951035l315163l466339l965721l743191l312091
$$ 335618210 331922951 327309113 323358078 320042915 316576576 312610855 308867664 305555573
997.2C05555573l442555l260746l046074k245312k700080l104058k844467k436352
$$ 305555573 302113018 298852272 295806198 293560886 290860806 287756748 284912281 282475929
1004.9B82475929k057533k758598j553040j575565j688633j073704j671886k011338
$$ 282475929 280418396 277659798 276106758 274531193 272842560 271768856 270096970 268085632
1012.6B68085632k476062j383248j854667k318059k160205k237358k001820k690010
$$ 268085632 265609570 264226322 262371655 260053596 257893391 255656033 253654213 250964203
1020.3B50964203k040062k578163j992169j626701j867638j373348j536007m98504
$$ 250964203 248924141 246345978 244353809 242727108 240859470 239486122 237950115 237451611
1028.1B37451611j109887n81398j123619j382599q26625j258545L04165K32391J506767
$$ 237451611 236341724 235760326 234636707 233254108 232427483 231168938 231473103 231705494 233212261
1036.7B33212261J228218Q72460J621666J442508K102356J066284J175042j68953j93558
$$ 233212261 234440479 235312939 236934605 238377113 240479469 241545753 242720795 242551842 242358284
1045.4B42358284Q16059J11885k02827j020355l00351j337318j326866r38969j056251
$$ 242358284 243174343 243286228 243083401 242063046 241762695 240425377 239098511 238159542 237103291
1054.1B37103291n24178o76613j77116j027127N51186M01154M99611J932487J423454
$$ 237103291 236579113 235902500 235725384 234698257 235249443 235650597 236150208 238082695 239506149
1062.8B39506149J996384J471615K536411J509152L74145P60307J002026J967602Q61149
$$ 239506149 241502533 242974148 245510559 247019711 247393856 248154163 249156189 251123791 251984940
1071.5B51984940O97918k23961L2901M20819N24749J040020k69489K84825K40783P31240
$$ 251984940 252682858 252458897 252491798 252912617 253437366 254477386 254207897 254492722 254733505 255464745
1081.1B55464745J174907J472130J266441Q55580K030163J849155J793137O44912K071076
$$ 255464745 256639652 258111782 259378223 260233803 262263966 264113121 265906258 266551170 268622246
1089.8B68622246K388286O65856J407451N89657J388817J698055J761284J996289J605052
$$ 268622246 271010532 271676388 273083839 273673496 275062313 276760368 278521652 280517941 282122993
1098.5B82122993J553193P86857J744595J442280J666755K045861J172027J547032
$$ 282122993 283676186 284463043 286207638 287649918 289316673 291362534 292534561 294081593
1106.2B94081593J635551J428413N66979K95677K07653Q17928K005253J320172O44798
$$ 294081593 295717144 297145557 297712536 298008213 298215866 299033794 301039047 302359219 303004017
1114.9C03004017J011047P07417N5809P51552M85802j24569k40230j78433J94111R5139
$$ 303004017 304015064 304722481 304778290 305529842 306015644 305891075 305650845 305472412 305666523 305761662
1124.5C05761662J173381R28803P06825J563683J790962J726074J287823K242183K459832
$$ 305761662 306935043 307863846 308570671 310134354 311925316 313651390 314939213 317181396 319641228
1133.2C19641228K254066K083588K085838K429466K171746K470703J907539J220436
$$ 319641228 321895294 323978882 326064720 328494186 330665932 333136635 335044174 336264610
1140.9C36264610J277657J921921J868133Q21343N00488J59836L92189J061554R41696
$$ 336264610 337542267 339464188 341332321 342153664 342654152 342813988 343206177 344267731 345209427
1149.6C45209427L35350l24402q67920L739P63282j37863n417j65786n69497m86908
$$ 345209427 345544777 345220375 344352455 344356194 345119476 344981613 344976196 344810410 344240913 343754005
1159.2C43754005q16764n23148n59120K4414Q05550Q57925Q77609J525002K425194
$$ 343754005 342937241 342414093 341854973 341879387 342684937 343542862 344420471 345945473 348370667
1167.9C48370667K204093K451516K556343K845382L143464K993545L001480K737122
$$ 348370667 350574760 353026276 355582619 358428001 361571465 364565010 367566490 370303612
1175.6C70303612K684936K668190K854157K587509K205086K017402K339249K517242
$$ 370303612 372988548 375656738 378510895 381098404 383303490 385320892 387660141 390177383
1183.3C90177383J685105J132202J304550J266174N91088N38177Q9455j79710L61709
$$ 390177383 391862488 392994690 394299240 395565414 396156502 396694679 396784134 396604424 396966133
1192C96966133K44370m77066j008797j106835j066436n73502j069794j635322j582375
$$ 396966133 397210503 396733437 395724640 394617805 393551369 392977867 391908073 390272751 388690376
1200.7C88690376j335334r66378j496315j386375j234093j205444q37670m58793j85089
$$ 388690376 387355042 386388664 384892349 383505974 382271881 381066437 380228767 379769974 379584885
1209.4C79584885p84645k40975J8807q10852o16646n02625n14488l16887J11008m3106
$$ 379584885 378800240 378559265 378578072 377767220 377150574 376647949 376133461 375816574 375927582 375884476
1219C75884476k98043k9182l92494o87180o18934m25148q24471j125717n06668m03023
$$ 375884476 375586433 375557251 375164757 374477577 373858643 373433495 372609024 371483307 370976639 370573616
1228.6C70573616p27577q86727j083717r30290l86391n42335q27217q65937q00781
$$ 370573616 369846039 368959312 367875595 366945305 366558914 366016579 365189362 364323425 363522644
1237.3C63522644j85089k25639J0986J73340l25203k69432m44145m44108r58061q02917
$$ 363522644 363337555 363111916 363122902 363296242 362971039 362701607 362257462 361813354 360855293 360052376
1247C60052376L0365j81160j89362n09109l24059k51579m55170p1754j70555l77007
$$ 360052376 360082741 359901581 359712219 359203110 358879051 358627472 358172302 358100548 357929993 357552986
1256.6C57552986o63299J41754N03578K8458o943j40305M48761M51126L39089N73120
$$ 357552986 356889687 357031441 357535019 357563477 357556534 357416229 357864990 358316116 358655205 359228325
1266.3C59228325M05426J84097P03697J207810O50139R98077J066132Q09936P78198
$$ 359228325 359633751 359817848 360521545 361729355 362379494 363377571 364443703 365253639 366031837
1274.9C66031837Q98705J544037J364403J130409J010666Q11081P01980J126938J467247
$$ 366031837 366930542 368474579 369838982 370969391 371980057 372791138 373493118 374620056 376087303
1283.6C76087303J370888J733246J705551J347008J340637J303139O62994P45583P59468
$$ 376087303 377458191 379191437 380896988 382243996 383584633 384887772 385550766 386296349 387055817
1292.3C87055817O23359Q27866P85370J039619M36058P75833J073151K93884J74485
$$ 387055817 387679176 388507042 389292412 390332031 390768089 391543922 392617073 392910957 393085442
1301C93085442j26267n0354J99509K99530j52092l27187m00276n60036r6054m95834
$$ 393085442 392959175 392908821 393108330 393407860 393255768 392928581 392528305 391968269 391872215 391376381
1310.6C91376381n63850m86336p19643m75082j00174M6730m7798P05108J029167P37267
$$ 391376381 390812531 390326195 389606552 389131470 389031296 389078026 389030228 389735336 390764503 391501770
1320.3C91501770J017799J176873N83343L68729O10046L79029P08847K31170J02616
$$ 391501770 392519569 393696442 394279785 394648514 395258560 395637589 396346436 396577606 396680222
1328.9C96680222K77557l03955o02913r28383k17361j57586m40597l4485K96555O03561
$$ 396680222 396957779 396653824 396050911 395122528 394905167 394747581 394306984 394272499 394569054 395172615
1338.6C95172615J59378l5629J08185O46629O79626O74897Q21800N64918R11751N27573
$$ 395172615 395331993 395296364 395404549 396051178 396730804 397405701 398227501 398792419 399704170 400231743
1348.2D00231743L46260j17035k4261J79405l36457k06146n88608l02848m66423m25377
$$ 400231743 400578003 400460968 400436707 400616112 400279655 400073509 399484901 399182053 398715630 398290253
1357.9C98290253l41912k60887q3580r11598l15666p80831O1264K24419r69696p09038
$$ 398290253 397948341 397687454 397603874 396692276 396376610 395595779 395657043 395881462 394911766 394202728
1367.5C94202728p17811k64435q30956p00721J20163k976m51393o94580N15823K05498
$$ 394202728 393484917 393220482 392389526 391688805 391808968 391805992 391354599 390660019 391175842 391381340
1377.2C91381340J4839l05443n87921p22580j070556j104889j863404j186637j034546
$$ 391381340 391396179 391090736 390502815 389780235 388709679 387604790 385741386 384554749 383520203
1385.8C83520203j072312j579170k005463j167831j797142j629219j771584j858940
$$ 383520203 382447891 380868721 378863258 377695427 375898285 374269066 372497482 370638542
1393.6C70638542k429466l370323j934853j827469j635322l024330k741662j505661
$$ 370638542 368209076 364838753 362903900 361076431 359441109 356416779 353675117 352169456
1401.3C52169456k224502k331925k263526k178421j735764j640244j770401j737747
$$ 352169456 349944954 347613029 345349503 343171082 341435318 339795074 338024673 336286926
1409C36286926j588821j903305j347504j325035j193466p70760j097336n14907p18575
$$ 336286926 334698105 332794800 331447296 330122261 328928795 328158035 327060699 326545792 325827217
1417.7C25827217m29535j181602l32032J046563M63066O08558m34303O75163J076775
$$ 325827217 325397682 324216080 323884048 324930611 325393677 326002235 325567932 326243095 327319870
1426.3C27319870O26411J198235M13132J309662J362609J777955J510429J183052J860924
$$ 327319870 327946281 329144516 329557648 330867310 332229919 334007874 335518303 336701355 338562279
1435C38562279P84073J617126K171784K508621J629486J618233K151413J257743J851883
$$ 338562279 339346352 340963478 343135262 345643883 347273369 348891602 351043015 352300758 354152641
1443.7C54152641J295014J766014J221657R81636J322326J251603J986389J116714
$$ 354152641 355447655 357213669 358435326 359416962 360739288 361990891 363977280 365093994
1451.4C65093994J912346J262894J548729J875839L86314M53873P23152L250618J265335
$$ 365093994 367006340 368269234 369817963 371693802 372080116 372533989 373257141 376507759 377773094
1460.1C77773094K130356J787415J533470K640762J457176K005272J157456K470474
$$ 377773094 379903450 381690865 383224335 385865097 387322273 389327545 390485001 392955475
1467.8C92955475L077278K698555K894478K315559L954697K098045K874718L241424
$$ 392955475 396032753 398731308 401625786 403941345 407896042 409994087 412868805 416110229
1475.5D16110229L380585K945328K492790K416535K170448K224274J525535K046700
$$ 416110229 419490814 422436142 424928932 427345467 429515915 431740189 433265724 435312424
1483.2D35312424J872902J362381J854057J681404R12476R69925M41513n96238K72370
$$ 435312424 437185326 438547707 440401764 442083168 442995644 443965569 444407082 443810844 444083214
1491.9D44083214M90074l89977n80101k4375k945252o42624j175499l351898r77478
$$ 444083214 444573288 444183311 443603210 443578835 440633583 439990959 438815460 435463562 434486084
1500.6D34486084j042824j293602j375847l9291m06723l989601j717758J285095J221542
$$ 434486084 433443260 432149658 430773811 430734520 430327797 426338196 424620438 425905533 427127075
1509.3D27127075j006012k0904n84679j103363k19841m30183J48925j530037k568244
$$ 427127075 426121063 426100159 425515480 424412117 424192276 423762093 423911018 422380981 419812737
1518D19812737J06620R82895j75094j660309K42843O06728J606789K38876L87115R31550
$$ 419812737 419919357 420902252 420727158 419066849 419309692 419916420 421523209 421762085 422149200 423080750
1527.6D23080750N91430N15557M66308O39458L86467J171837o74210N36842P60079
$$ 423080750 423672180 424187737 424654045 425293503 425679970 426851807 426177597 426714439 427474518
1536.3D27474518M15993J527786j291771j164551J941376J937599r3727M5853Q04977
$$ 427474518 427890511 429418297 428126526 426961975 428903351 430840950 430747223 430793076 431598053
1545D31598053n24330R30824J55487Q86383N12352r26704N47867K94571J169395j811752
$$ 431598053 431073723 432004547 432160034 433046417 433558769 432632065 433179932 433474503 434643898 432832146
1554.6D32832146m92668J410179J293525l473167p234726L464241p86591K76185j390877
$$ 432832146 432339478 433749657 435043182 431570015 424335289 427799530 427012939 427289124 425898247
1563.3D25898247j654968l031617k525444r24911k508545j126824p078628k723160
$$ 425898247 424243279 421211662 418686218 417761307 415252762 414125938 407047310 404324150
1571D04324150k568817l910294k590484k888336j356545j1540413k128067l217659
$$ 404324150 401755333 397845039 395254555 392366219 391009674 379469261 377341194 374123535
1578.7C74123535m455643l946456n410271l869133o223908l895759n345650m622497
$$ 374123535 369667892 365721436 360311165 356442032 350218124 346322365 340976715 336354218
1586.4C36354218m264946n233689l596191o076718l200416n507279m005203m379196
$$ 336354218 332089272 326855583 323259392 317182674 313982258 308474979 304469776 300090580
1594.1C00090580m775543k533264m720803k389393n013771k618026l908863l377552
$$ 300090580 295315037 292781773 288060970 285671577 280657806 278039780 274130917 270753365
1601.9B70753365j892662m013958j319027l784638o74438l045349k017079j145706
$$ 270753365 268860703 264846745 263527718 259743080 259068642 256023293 254006214 252860508
1609.6B52860508k817230r2831k564373K91691k055321K91252K48165m559326J797753
$$ 252860508 250043278 249950447 247386074 247677765 245622444 245913696 246161861 241602535 243400288
1618.2B43400288j433430Q18539j761666R80053K83833j056271J588936o01864K024727
$$ 243400288 241966858 242785397 241023731 242003784 242287617 241231346 242820282 242218418 244243145
1626.9B44243145j057796J806850L45154O87866J512604K10952K677174M72832L687286
$$ 244243145 243185349 244992199 245337353 246025219 247537823 247748775 250425949 250898781 254586067
1635.6B54586067j995353K546443J822224R02653K653313K91919K737713Q14171K076931
$$ 254586067 252590714 255137157 256959381 257862034 260515347 260807266 263544979 264359150 266436081
1644.3B66436081J179199l20167L742351j36852L521480M79546K504082K196464J580124
$$ 266436081 267615280 267295113 271037464 270900612 274422092 274901638 277405720 279602184 281182308
1653B81182308J061039q29525L047962J65062J739216P13864J841163K189255J644001
$$ 281182308 282243347 281413822 284461784 284626846 286366062 287079926 288921089 291110344 292754345
1661.6B92754345L302555O81877L579254J715374K695790K823944K997017M394416
$$ 292754345 296056900 296738777 300318031 302033405 304729195 307553139 310550156 314944572
1669.4C14944572J079960N185414K239532L623734L321266L501739M348336K965278
$$ 314944572 316024532 321209946 323449478 327073212 330394478 333896217 338244553 341209831
1677.1C41209831M768830L033714N189896L923873M161301M861527J365661P577629
$$ 341209831 345978661 349012375 354202271 358126144 362287445 367148972 368514633 376092262
1684.8C76092262K738495N677796M406700M484176N052681M425431M944763M243545
$$ 376092262 378830757 384508553 388915253 393399429 398452110 402877541 407822304 412065849
1692.5D12065849N215798M824447N024529L634529O174049O089325N382004P574463
$$ 412065849 417281647 422106094 427130623 430765152 436939201 443028526 448410530 455984993
1700.2D55984993j3313N243721M512825M273147M057274L615837L814011L411980L969612
$$ 455984993 455971680 461215401 465728226 470001373 474058647 477674484 481488495 484900475 488870087
1708.9D88870087K680893K662277K800331K701111L322601J639748J547126L843804
$$ 488870087 491550980 494213257 497013588 499714699 503037300 504677048 506224174 510067978
1716.6E10067978L912849j907081J490516K613449J796608J846810J324310J390381
$$ 510067978 513980827 512073746 513564262 516177711 517974319 519821129 521145439 522535820
1724.3E22535820K159920J973152J347427J691132K163505M95491N63965L032723L510895
$$ 522535820 524695740 526668892 528016319 529707451 531870956 532366447 532930412 535963135 539474030
1733E39474030J003723k360955K746544L159409J871185K814560J042748q23555L628311
$$ 539474030 540477753 538116798 540863342 544022751 545893936 548708496 549751244 548927689 552556000
1741.7E52556000L400841K103767K073669L659478L573989K259064K641030J784706
$$ 552556000 555956841 558060608 560134277 563793755 567367744 569626808 572267838 574052544
1749.4E74052544M395256K951851J394310M932479L907547L341675L184357R12552
$$ 574052544 578447800 581399651 582793961 587726440 591633987 594975662 598160019 599072571
1757.1E99072571J953087L019905K672882L626633J167640N13001L129883J827087
$$ 599072571 601025658 604045563 606718445 610345078 611512718 612025719 615155602 616982689
1764.8F16982689J438522J870957K173042o14281J944084M032212P21130l68500r12132
$$ 616982689 618421211 620292168 622465210 621850929 623795013 627827225 628548355 628179855 627267723
1773.5F27267723L467636K689171l7804J776886M17290J250229J255302M50707J210403
$$ 627267723 630735359 633424530 633386726 635163612 635580902 636831131 638086433 638537140 639747543
1782.2F39747543J438599J682510k670K35291J214370J253662R15909J815186J548614
$$ 639747543 641186142 642868652 642865982 643101273 644315643 645569305 646485214 648300400 649849014
1790.9F49849014J100006p63549j342621K980804J215210n5389J374588J565399P81860
$$ 649849014 650949020 650185471 648842850 651823654 653038864 652983475 654358063 655923462 656705322
1799.5F56705322n67703J857300M49753N63430J267929M94538J184997R22089N84412
$$ 656705322 656137619 657994919 658444672 659008102 660276031 660770569 661955566 662877655 663462067
1808.2F63462067P29370J533432o43006P9880J304932N54123R13925K39868J453476
$$ 663462067 664191437 665724869 665081863 665161743 666466675 667020798 667934723 668174591 669628067
1816.9F69628067L36533K27737Q77533r3002P24106R6969J386337J190262j574478
$$ 669628067 669964600 670192337 671069870 670976868 671700974 671797943 673184280 674374542 672800064
1825.6F72800064L3798J790772K000503L05786k563552K74582K411193L12500L69645
$$ 672800064 672833862 674624634 676625137 676930923 674367371 674641953 677053146 677365646 677735291
1834.3F77735291Q92028N47104N65644p02363P34864K03399O19965Q95615J431427
$$ 677735291 678627319 679174423 679740067 679037704 679772568 679975967 680595932 681491547 682922974
1842.9F82922974J582946m174499J210632J843643J03074m30298J16119R17130K78549
$$ 682922974 684505920 680331421 681542053 683385696 683488770 683058472 683174591 684091721 684370270
1851.6F84370270J039276r3765L15323O30493L07464K93885o59714K57492J15356Q41370
$$ 684370270 685409546 685315781 685631104 686261597 686569061 686862946 686203232 686460724 686576080 687417450
1861.3F87417450K15378L25775O60553j88141N80826k75879Q99734n92041j281738
$$ 687417450 687632828 687958603 688619156 688431015 689011841 688735962 689635696 689043655 687761917
1869.9F87761917J287079R31244P54394L5553J24894l30887J01242J96228J07345K95868
$$ 687761917 689048996 689980240 690734634 690770187 690895081 690564194 690665436 690861664 690969009 691264877
1879.6F91264877J21308P95059l60031K34604J678p4997N18341k99148J140823M11453
$$ 691264877 691386185 692181244 691821213 692055817 692057495 691982498 692500839 692201691 693342514 693753967
1889.2F93753967j057510P0190J006089L11966j09482n5619p40890P03125J11542j3810
$$ 693753967 692696457 692766647 693772736 694084702 693975220 693919601 693178711 693881836 693993378 693979568
1898.9F93979568R9183J64260O26755j47476M33502j59988P400j31454p3700N92880
$$ 693979568 694078751 694243011 694869766 694722290 695155792 694995804 695003204 694871750 694798050 695390930
1908.5F95390930O7139M4861l46756Q02765J44500M4709l2120l93295J034011j089325
$$ 695390930 695458069 695502930 695156174 695958939 696103439 696148148 696116028 695722733 696756744 695667419
1918.2F95667419k42309O83822N4398L38898m76532k05460K59781L84979k0599K72522
$$ 695667419 695425110 696108932 696163330 696502228 696025696 695820236 696080017 696464996 696444397 696716919
1927.8F96716919m18701l51105N32608L5935k5330k85492O61163j07803l81317L44772
$$ 696716919 696298218 695947113 696479721 696515656 696490326 696204834 696865997 696758194 696376877 696721649
1937.5F96721649p4615n1194n28717O79551j52817j164475M22516M10309j65634n22690
$$ 696721649 696647034 696595840 696067123 696746674 696593857 695429382 695851898 696262207 696096573 695573883
1947.1F95573883L28598j46866o3782l5095J85700K63214n51911K42997l10669j36872
$$ 695573883 695902481 695755615 695691833 695656738 695842438 696105652 695553741 695796738 695486069 695349197
1956.7F95349197j32980j00937J44501l49350J84021j27716M15497k05460l04031J53351
$$ 695349197 695216217 695115280 695259781 694910431 695094452 694966736 695382233 695176773 694872742 695026093
1966.4F95026093l25394L23028j36413P0190j52817J26038K39868J0147J6861q26568
$$ 695026093 694700699 695023727 694887314 694957504 694804687 694930725 695170593 695180740 695197601 694371033
1976F94371033j50528j44120J84708n9128j06353M75387k11029J04981k36969j19172
$$ 694371033 694220505 694076385 694261093 694201965 694095612 694570999 694359970 694464951 694227982 694108810
1985.7F94108810k65655k8915O3247p96127K03705M12597K4414l06472P2860l39889
$$ 694108810 693843155 693814240 693877487 693081360 693285065 693697662 693722076 693415604 693488464 693148575
1995.3F93148575m33045K66495k30484J4115k86561J45264J1521n12009j96304q0948
$$ 693148575 692715530 692982025 692751541 692765656 692479095 692624359 692635880 692123871 691927567 691846619
2005F91846619L65219k57797J5335l05024k23922J16958n01556J19781Q316k34680
$$ 691846619 692211838 691954041 691969376 691664352 691440430 691557388 691055832 691175613 691183929 690949249
2014.6F90949249o50482k25449k93579n18264J70974J44730N82046k15988k65808k79999
$$ 690949249 690298767 690073318 689779739 689261475 689432449 689577179 690159225 689943237 689677429 689397430
2024.2F89397430j86996o5994o17371L43628l43628m66309o9732M6310k4795l75595
$$ 689397430 689210434 689144440 688527069 688870697 688527069 688060760 687991028 688037338 688012543 687636948
2033.9F87636948M9591m32434k747l04565j47248J78223k19421j20926m81491L17993
$$ 687636948 687686539 687254105 687251358 686946793 686799545 686977768 686758347 686637421 686155930 686473923
2043.5F86473923k48947l06549k63062m26865K52762n6839L28675k43378j70593m93699
$$ 686473923 686224976 685918427 685655365 685228500 685481262 685424423 685753098 685509720 685339127 684845428
2053.2F84845428n31082L32108j24588Q1940j97297L08152k8763l47672j88293l80402
$$ 684845428 684314346 684646454 684521866 684603806 684406509 684714661 684685898 684338226 684149933 683769531
2062.8F83769531N56412l3875j82037k40707R6664J3733m44946K70004k89078k43988
$$ 683769531 684325943 684292068 684110031 683869324 683965988 683979721 683534775 683804779 683515701 683271713
2072.5F83271713l53241R6817L75672o1035k27051m00009L50799k72827n6076j7929
$$ 683271713 682918472 683015289 683390961 683329926 683102875 682702866 683053665 682780838 682724762 682706833
2082.1F82706833m07868o7443j33896K20108m02680j95541Q3237J92413k71454o32858
$$ 682706833 682298965 682231522 682097626 682317734 681915054 681719513 681802750 681995163 681723709 681090851
2091.7F81090851J65863r6970J68457k18963j47934n9204r9717K73819m30679k01416
$$ 681090851 681256714 681159744 681328201 681109238 680961304 680902100 680802383 681076202 680645523 680444107
2101.4F80444107n35278j29624k1591m27704l7155j71203P0571k37426J56326N341
$$ 680444107 679908829 679779205 679757614 679329910 679292755 679121552 679192123 678954697 679111023 679116364
2111F79116364k12403k52533m12750M0970l76511K60163j12000k76108J94092q0566
$$ 679116364 678903961 678651428 678238678 678279648 677903137 678163300 678051300 677775192 677969284 677888718
2120.7F77888718K33993q6136l20816n79071P7820n569j67694O561l54233L36838k05841
$$ 677888718 678122711 678036575 677715759 677136688 677214508 677208939 677041245 677047806 676693573 677030411 676824570
2131.3F76824570n799o2408m39758P476J99891O94732o5002k00577k57721R3002r7656
$$ 676824570 676818771 676756363 676316605 676324081 676523972 677218704 677153702 676953125 676695404 676788406 676690750
2141.9F76690750p10144J49002o1188K58561M75463L06473j24740p4463L07770k72599
$$ 676690750 675980606 676129608 676068420 676326981 676802444 677108917 676984177 676909714 677217484 676944885
2151.5F76944885p2632m63180J9607K25602l5401K42234j6633N1117m56924j38092
$$ 676944885 676872253 676409073 676428680 676654282 676618881 676861115 676844482 676895599 676438675 676300583
2161.2F76300583j21689P5455K08587J5641L92761K2735O13785r384m46548l51181
$$ 676300583 676178894 676254349 676462936 676478577 676871338 676894073 677507858 677498474 677051926 676700745
2170.8F76700745l84064K98386m6387K40555J63192M88739J63727m12826o1188l04489
$$ 676700745 676316681 676615067 676568680 676809235 676972427 677461166 677624893 677212067 677150879 676846390
2180.5F76846390J04141j36795M38843N42984J24054K07748j94473O6452k28272j17797
$$ 676846390 676950531 676813736 677252579 677795563 677919617 678127365 677932892 677999344 677771072 677653275
2190.1F77653275k41089J06201L57895K87323N92575j53732m1276n69534m20685J2970
$$ 677653275 677412186 677518387 677876282 678163605 678756180 678602448 678561172 677991638 677570953 677583923
2199.8F77583923k7847M56390K35520N21545j79367l07998o6987j79596o5841Q8806
$$ 677583923 677556076 678012466 678247986 678769531 678590164 678282166 678215179 678035583 677969742 678058548
2209.4F78058548N43289k41623O0044K83813J99890p1335k96020K92969l07007J39694
$$ 678058548 678601837 678360214 678420258 678704071 678903961 678832626 678536606 678829575 678522568 678662262
2219F78662262N6152p2021P6904n1575L95508q850J08948j42670J85242r1248n90438
$$ 678662262 678718414 678646393 678723297 678671722 679067230 679058380 679167328 679024658 679209900 679118652 678528214
2229.7F78528214L4027L1967L93600p858J05972J0758o11J00479n43060j50223J1673
$$ 678528214 678562241 678594208 678987808 678979950 679085922 679096680 679096069 679196548 678653488 678503265 678514938
2240.3F78514938M50516j35803k06146K8991k25677L29056k04010K8534j84098k90222
$$ 678514938 678965454 678829651 678623505 678652496 678426819 678755875 678551865 678580399 678396301 678106079
2249.9F78106079M9667J21232L90167m7455M1046l47671J6403M5166j80588J13983
$$ 678106079 678155746 678276978 678667145 678619690 678660736 678313065 678329468 678374634 678194046 678308029
2259.5F78308029j95312Q1405j08947L93905J95465k94189j87607k10266J068k80075
$$ 678308029 678112717 678194122 678085175 678479080 678674545 678380356 678192749 677982483 677983551 677703476
2269.2F77703476J66855j42365J23139J59759j03683J99127l97491m7226l82691J57700
$$ 677703476 677870331 677727966 677851105 678010864 677907181 678106308 677708817 677661591 677278900 677436600
2278.8F77436600K37121m16031M5319n5008K01645o9885J90582l52097l77502J13373
$$ 677436600 677673721 677257690 677303009 677248001 677449646 677379761 677570343 677218246 676840744 676954117
2288.5F76954117l88107J17721l69263j7395j70898m3564L25089n35889p2479j85089
$$ 676954117 676566010 676683731 676314468 676297073 676126175 676082611 676407700 675871811 675799332 675614243
2298.1F75614243m2267o53458j84326N34592k62146J220k87475m0436p53937p68890
$$ 675614243 675571976 674918518 674734192 675268784 675006638 675007858 674720383 674679947 673926010 673157120
2307.8F73157120K94952L13721j40000o03561J08643m98124j86538k19116l08228J6480
$$ 673157120 673452072 673765793 673625793 673022232 673130875 672632751 672446213 672227097 671918869 671935349
2317.4F71935349n70450J48697o78864Q1635J70898r57870r09501l84521M54788k91138
$$ 671935349 671364899 671513596 670834732 670916367 671087265 670129395 669219894 668835373 669290161 668999023
2327.1F68999023M63334j085587p17468N21316l17383J71814p28912L07999q01850
$$ 668999023 669462357 668376770 667659302 668180618 667863235 668035049 667306137 667614136 666812286
2335.7F66812286o97479J89133R8724P29218l74298L24554j137619j26724P46002m77295
$$ 666812286 666114807 666303940 666402664 667131882 666757584 667082138 665944519 665817795 666563797 666086502
2345.4F66086502j04675J34582J019745N17044L07694j210022j745682r10950j083297
$$ 666086502 665981827 666116409 667136154 667653198 667960892 666750870 665005188 664094238 663010941
2354.1F63010941K0523p29905P58744O68335l06778j327286j185074Q40225J85166
$$ 663010941 663031464 662301559 663060303 663728638 663421860 662094574 660909500 661749725 661934891
2362.7F61934891J078338j285400r33762K70615J05438K38266n86319N82047l24936
$$ 661934891 663013229 661727829 660794067 661064682 661170120 661408386 660822067 661404114 661079178
2371.4F61079178L17001P40357N87768M63867m16336J25885r5825K26364M273j32675
$$ 661079178 661396179 662136536 662724304 663188171 662771835 662897720 662801895 663028259 663032532 662899857
2381.1F62899857J47628J24741L99551o9351k56119m74929k75574l29361n42832k27966
$$ 662899857 663047485 663172226 663571777 663502426 663246307 662771378 662495804 662166443 661623611 661395645
2390.7F61395645J06964K85950l00674l0137m17327o95725m63257o04324j05591j89514
$$ 661395645 661502609 661788559 661487885 661457748 661040421 660344696 659881439 659277115 659171524 658982010
2400.3F58982010J62048k3651l31955l28293l31802k52762p55310k69623o8512j27105
$$ 658982010 659144058 659120407 658788452 658460159 658128357 657875595 657120285 656850662 656782150 656655045
2410F56655045m37088l14103k34985o10809J36337k07901l06778k74048l9520p6828
$$ 656655045 656217957 655903854 655668869 655058060 655194397 654986496 654679718 654405670 654366150 654289322
2419.6F54289322r61609l58963q9111k4338o36978o05316J18637j30387l13186n91584
$$ 654289322 653327713 652968750 652879639 652855301 652218323 651613007 651731644 651601257 651288071 650696487
2429.3F50696487J13984k52686q89358n13611k48795k83813n07431j8235l05938k53830
$$ 650696487 650810471 650557785 649668427 649154816 648906021 648622208 648114777 648096542 647790604 647536774
2438.9F47536774l12577l33404l36075q09708k15072k58713K09961r155o27594j92490
$$ 647536774 647224197 646890793 646554718 645745010 645529938 645271225 645481186 645472031 644844437 644651947
2448.6F44651947j39236l98407q94776l77579m35485k45667m14581p33261K7160n64270
$$ 644651947 644512711 644114304 643219528 642841949 642406464 642160797 641746216 641012955 641040115 640475845
2458.2F40475845l41644k71492k53296k65312o09131j182m77486n98526m79584n11741
$$ 640475845 640134201 639862709 639609413 639344101 638734970 638733788 638256302 637657776 637178192 636666451
2467.8F36666451o55175n66978j01967k94571k78969l47366k34223m63295k65197n42946
$$ 636666451 636011276 635444298 635342331 635047760 634768791 634421425 634187202 633723907 633458710 632915764
2477.5F32915764j031685l01399m87786l19366k38953k64625l79982n21012j51634
$$ 632915764 631884079 631582680 631094894 630775528 630536575 630271950 629891968 629370956 629219322
2486.2F29219322m94804q32100j040230j77803l68500m50477K11448p49321p01713
$$ 629219322 628724518 627892418 626852188 626674385 626305885 625855408 626066856 625317535 624615822
2494.8F24615822n79300k98729l95660o53191l42751m94270n9814l77388n15786p19757
$$ 624615822 624036522 623737793 623342133 622688942 622346191 621851921 621792107 621414719 620898933 620179176
2504.5F20179176p01561k62222n12505l07693j64070p6332p85675q80280l64876j70860
$$ 620179176 619477615 619215393 618702888 618395195 618231125 618154793 617369118 616488838 616123962 615953102
2514.1F15953102k96974p22008j99013o08558l77541N6648m44641p24029p29714k04658
$$ 615953102 615656128 614934120 614735107 614126549 613749008 613805656 613361015 612636986 611907272 611702614
2523.8F11702614q34122l95431j05820o21872j58157j91231l49388q21572k58445k5559
$$ 611702614 610868492 610473061 610367241 609745369 609587212 609395981 609046593 608225021 607966576 607941017
2533.4F07941017m99077n30471m24881J07269m48494o51398o48575m23736j38245p13005
$$ 607941017 607441940 606911469 606486588 606593857 606145363 605493965 604845390 604421654 604283409 603570404
2543.1F03570404m40292j13259k29683n30128n05867n11208l18069k59628o49186l03611
$$ 603570404 603130112 603016853 602787170 602257042 601751175 601239967 600921898 600662270 600013084 599709473
2552.7E99709473l18146k01569l30047l30696j96686o15502n36232o76155l22723l44887
$$ 599709473 599391327 599189758 598859711 598529015 598332329 597716827 597180595 596504440 596181717 595836830
2562.4E95836830m41589k15492m47426l01438m89998l88793m28010n27305k62146l68004
$$ 595836830 595395241 595179749 594732323 594430885 593940887 593552094 593124084 592596779 592334633 591966629
2572E91966629m69551m16298k35329j60751J4267l68195p04612p66373q31299l49502
$$ 591966629 591497078 591080780 590845451 590684700 590698967 590330772 589626160 588859787 588028488 587678986
2581.6E87678986J35231Q506o15158l02543o63147q89435l78418o93855k08855m20532
$$ 587678986 587814217 587822723 587207565 586905022 586241875 585352440 584974022 584280167 584071312 583650780
2591.3E83650780m53568j78642m10309j7662l49770q58078r53445m11034l56598n79452
$$ 583650780 583197212 583018570 582608261 582590599 582240829 581382751 580429306 580018272 579661674 579082222
2600.9E79082222l43628j14708J78146n46073r02520q35876n17616k81487o20575n46913
$$ 579082222 578738594 578623886 578802032 578255959 577353439 576517563 575999947 575718460 575097885 574550972
2610.6E74550972n81207k38114m05540n38902m58870q03986n23987n26504n28488m88663
$$ 574550972 573969765 573731651 573326111 572787209 572328339 571524353 571000366 570473862 569945374 569456711
2620.2E69456711l82576o6528k80266r34334r30367l38745l52325o76727p46308K365
$$ 569456711 569074135 569007607 568727341 567793007 566862640 566523895 566171570 565494843 564748535 564750900
2629.9E64750900k68135p33757l13148n51834n19219p26967m23202l34664o19468m82903
$$ 564750900 564482765 563749008 563435860 562884026 562364807 561637840 561214638 560879974 560260506 559777603
2639.5E59777603o87523k90832n92804n04914k97584n61867l36342o53343p48978o69746
$$ 559777603 559090080 558799248 558206444 557701530 557403946 556842079 556505737 555852394 555103416 554433670
2649.1E54433670N0201j48124j057968p32003l18527j90315m84848k86713l99017o12488
$$ 554433670 554483871 554335747 553277779 552545776 552227249 552036934 551552086 551265373 550866356 550253868
2658.8E50253868l14102k48528k99148m98200n65910q75587k56081o1150j99127J09406
$$ 550253868 549939766 549691238 549392090 548893890 548327980 547452393 547196312 547135162 546936035 547045441
2668.4E47045441o52962n56793j92490j61056n26963n97381k46697m79507k82173o44760
$$ 547045441 546392479 545835686 545643196 545482140 544955177 544357796 544111099 543631592 543349419 542704659
2678.1E42704659l58773K3117k17972k87284o80809m74167n63584k98538J17188j12000
$$ 542704659 542345886 542369003 542151031 541863747 541182938 540708771 540145187 539846649 539963837 539851837
2687.7E39851837o21490r84955n60608k77596j08871m02565k15530Q7814j68800m16794
$$ 539851837 539230347 538245392 537684784 537407188 537298317 536895752 536680222 536768036 536599236 536182442
2697.4E36182442j040345p66563l19748j71051m24843o65741k64396o0273j5487l52288
$$ 536182442 535142097 534375534 534055786 533884735 533459892 532794151 532529755 532469482 532453995 532101707
2707E32101707j75056q9149m07753o38047m44679M7379m28200n22995l95546l23067
$$ 532101707 531926651 531837502 531429749 530791702 530347023 530394402 529966202 529443207 529047661 528724594
2716.6E28724594l50838l56979j54648l24745N3558k06985m11377j41487q3618j79940
$$ 528724594 528373756 528016777 527862129 527537384 527590942 527383957 526972580 526831093 526747475 526567535
2726.3E26567535o52580m43611n79529m99916j27716q1940O6681m4174k24609o24771
$$ 526567535 525914955 525471344 524891815 524391899 524264183 524182243 524248924 524204750 523980141 523355370
2735.9E23355370l36724j55067j64261r3956l82233j89323l3646l5209l30239j92947
$$ 523355370 523018646 522863579 522699318 522605362 522223129 522033806 522000160 521964951 521634712 521441765
2745.6E21441765j80283l11241R117k09999j38244l49694m93698m04549k81868k1057
$$ 521441765 521261482 520950241 520959358 520749359 520611115 520261421 519767723 519363174 519081306 519060249
2755.2E19060249m78325n21965k79350j26610j30043k05307n39703n91812K7160j63459
$$ 519060249 518581924 518059959 517780609 517653999 517523956 517318649 516778946 516187134 516214294 516050835
2764.9E16050835k11335k26364m94423n51910j81656J49651m81453n06897q5602p4844
$$ 516050835 515839500 515613136 515118713 514566803 514385147 514534798 514053345 513546448 513460846 513386002
2774.5E13386002o00434n75905m77485q48465l06435n18188l53127Q6784n22575o80313
$$ 513386002 512785568 512209663 511732178 510883713 510577278 510059090 509705963 509792747 509270172 508589859
2784.2E08589859l95622p0610m74739n49164n62554o15348m2305l34282p11861n93414
$$ 508589859 508194237 508123627 507648888 507099724 506537170 505921822 505879517 505545235 504833374 504239960
2793.8E04239960n22423p34520p87163l51257k73171r13314r64127m47006o09398o43578
$$ 504239960 503717537 502983017 502195854 501844597 501571426 500658112 499693985 499246979 498637581 497994003
2803.4D97994003p05337l04070j73721q64945p56988p22199p13424r38149r63211o16913
$$ 497994003 497288666 496984596 496810875 495945930 495188942 494466743 493753319 492815170 491851959 491235046
2813.1D91235046n74264k86636l42331p68242j163216p15370p24907q05740l84102
$$ 491235046 490660782 490374146 490031815 489263573 488100357 487384987 486660080 485854340 485470238
2821.8D85470238r45053q23365q18443p53860n59922j010399r11331j021995r21135
$$ 485470238 484525185 483701820 482883377 482129517 481569595 480559196 479647865 478625870 477704735
2830.4D77704735p01790o51970j041298j074448o69288j248398j005592p96547j459885
$$ 477704735 477002945 476350975 475309677 474235229 473565941 472317543 471311951 470515404 469055519
2839.1D69055519j785583j550370j270942j831856k000466j547622j456032j859550
$$ 469055519 467269936 465719566 464448624 462616768 460616302 459068680 457612648 455753098
2846.8D55753098k151871k365914k279663j532745j030502p86438j017914q39081j07994
$$ 455753098 453601227 451235313 448955650 447422905 446392403 445605965 444588051 443748970 443640976
2855.5D43640976j59073n17807m28772J4877p7591l94210n45197n47142k99759m52080
$$ 443640976 443481903 442964096 442535324 442550201 442472610 442078400 441533203 440986061 440686302 440234222
2865.2D40234222j096801j096459n93567p58247o99081p11442o68792m08669p49740
$$ 440234222 439137421 438040962 437447395 436689148 435990067 435278625 434609833 434201164 433451424
2873.8D33451424q41561q28476m56733o43578j055450o42548o55327m34189l55529
$$ 433451424 432609863 431781387 431324654 430681076 429625626 428983078 428327751 427893562 427538033
2882.5D27538033q55828j156692r76906q77419j009979r06639r26094o64787q48732
$$ 427538033 426682205 425525513 424548607 423671188 422661209 421754570 420828476 420163689 419314957
2891.2D19314957j175118j047592p67555m38767p49283p90596j077385j373672p52144
$$ 419314957 418139839 417092247 416324692 415885925 415136642 414346046 413268661 411894989 411142845
2899.9D11142845l19633n88951q42858o92520j076927q47321m11720n46455n32647
$$ 411142845 410823212 410234261 409391403 408698883 407621956 406774635 406362915 405816460 405283813
2908.6D05283813j030006j093750j003952j296120j628875j760941j496811j037903
$$ 405283813 404253807 403160057 402156105 400859985 399231110 397470169 395973358 394935455
2916.3C94935455o37779j208343j629105j660652j475716o53686k53487l11432m20875
$$ 394935455 394297676 393089333 391460228 389799576 388323860 387670174 387416687 387105255 386684380
2925C86684380l34588n22613k15721M35257N9509j90773J18828K93465K15263M33311
$$ 386684380 386349792 385827179 385611458 386046715 386106224 385915451 386034279 386327744 386543007 386976318
2934.6C86976318L48626J78031N31350N36384O30608O26259O85348R15718N88455M24157
$$ 386976318 387324944 387502975 388034325 388570709 389201317 389827576 390512924 391428642 392017097 392441254
2944.2C92441254O39648O89240O51474N84449L56293N86281Q87260P39785K77862o4773
$$ 392441254 393080902 393770142 394421616 395006065 395362358 395948639 396835899 397575684 397853546 397788773
2953.9C97788773M16145Q22716P87086O83212P51839M25263K77557J016579P99369
$$ 397788773 398204918 399027634 399814720 400497932 401249771 401675034 401952591 402969170 403768539
2962.6D03768539L45116N50499R17854J114350P08999O25344Q08639M70543L63693
$$ 403768539 404113655 404664154 405582008 406696358 407405357 408030701 408839340 409309883 409673576
2971.2D09673576O76041L90739P25174R20678K74391Q26874R88121L30581J33171L99514
$$ 409673576 410349617 410740356 411465530 412386208 412660599 413487473 414475594 414806175 414939346 415338860
2980.9D15338860M36210K28157L15209P3814J62697J71318J49498J51367o9466K94877
$$ 415338860 415775070 416003227 416318436 416392250 416554947 416726265 416875763 417027130 416957664 417252541
2990.5D17252541M16793K75040k06032m70276n46150m00619J61094r5253l83110o24923
$$ 417252541 417669334 417944374 417738342 417268066 416721916 416321297 416482391 416387138 416004028 415379105
3000.2D15379105m78516p07016r78355j19553n05180o84700j50032m90952l99017j43891
$$ 415379105 414900589 414193573 413215218 413095665 412590485 411905785 411755753 411264801 410865784 410721893
3009.8D10721893n47790n96047m36706o44264o02494q25615p42530p45354j022949
$$ 410721893 410174103 409578056 409141350 408497086 407894592 407068977 406326447 405581093 404558144
3018.5D04558144n11818l39508o86112j123009p16552n08423r13162p53632p23114
$$ 404558144 404046326 403706818 403020706 401897697 401181145 400672722 399759560 399005928 398282814
3027.2C98282814n55878j087684r86519k00844o91261o01692n51835j083869j118508
$$ 398282814 397726936 396639252 395652733 395451889 394760628 394158936 393607101 392523232 391404724
3035.9C91404724q61740n66368n67436q06046p99103p54585p56950o81038j060486
$$ 391404724 390542984 389976616 389409180 388603134 387804031 387049446 386292496 385611458 384550972
3044.5C84550972j042480q50144q01239q16917q77533l71323r03854j078797p52372
$$ 384550972 383508492 382658348 381857109 381040192 380162659 379791336 378887482 377808685 377056313
3053.2C77056313j218682o97136l67241p56912r18922q08831q88748j007385p01790
$$ 377056313 375837631 375140495 374773254 374016342 373097420 372288589 371399841 370392456 369690666
3061.9C69690666o41670p02133j131935j046295l83530o11344q66813o38581q15582
$$ 369690666 369048996 368346863 367214928 366168633 365785103 365173759 364306946 363668365 362852783
3070.6C62852783r40895n56602n07355k96135m97017j140251r22852n29060k14806
$$ 362852783 361911888 361355286 360847931 360551796 360054779 358914528 357991676 357462616 357247810
3079.2C57247810n46875p61222n68238p66449o53381p88422p30438m99001r79080j228523
$$ 357247810 356700935 355939713 355371475 354605026 353951645 353163223 352432785 351933784 350954704 349726181
3088.9C49726181r25217l96804l12729j075783j052017l74413n39932n09682p99217
$$ 349726181 348800964 348404160 348091431 347015648 345963631 345589218 345049286 344539604 343740387
3097.6C43740387j025581l21961m56314q22067o82373p39327r41238n84679k21557
$$ 343740387 342714806 342392845 341936531 341114464 340432091 339692764 338751526 338166847 337945290
3106.2C37945290n32799q71811j009064o79588p48749o62117l63693q78105q03566
$$ 337945290 337412491 336540680 335531616 334852028 334103279 333441162 333077469 332199364 331395798
3114.9C31395798n82695p31240o47201o68831j215706j128235m07142p83768r93691
$$ 331395798 330813103 330081863 329434662 328765831 327550125 326421890 326014748 325230980 324237289
3123.6C24237289o35490p32574q28629n32799n32417r53064j065750q69618l40519
$$ 324237289 323601799 322869225 322040596 321507797 320975380 320022316 318956566 318086948 317746429
3132.3C17746429n66902r13772r40323r85890m93106p42817n85499l62568r27811r75590
$$ 317746429 317179527 316265755 315325432 314339542 313846436 313103619 312518120 312155552 311227741 310252151
3141.9C10252151r21821p83444q23459o26221m68025p93667r45930q33722o98509r08718
$$ 310252151 309330330 308546886 307723427 307097206 306629181 305835514 304889584 304055862 303357353 302448635
3151.6C02448635r06773o68029l74031q66661j255780p51323p74365p50885q98971
$$ 302448635 301541862 300873833 300499802 299633141 298377361 297626038 296851673 296100788 295201817
3160.3B95201817p82280o40335q49381o28681p79915o43787m63162m11606o65626j188183
$$ 295201817 294419537 293779202 292929821 292301140 291521225 290877438 290414276 290002670 289337044 288148861
3169.9B88148861q50544p27310j030712j094857q04042l87021j63593o46057r99336
$$ 288148861 287298317 286571007 285540295 284445438 283641396 283254375 283090782 282444725 281445389
3178.6B81445389q26340r01108l72143n73120p94391m53263j029129j083984q83389
$$ 281445389 280619049 279717941 279345798 278772678 277978287 277525024 276495895 275411911 274528522
3187.3B74528522o34861m65221o19736n58796n97152p48825p77016n69649o71196m35505
$$ 274528522 273893661 273428440 272808704 272249908 271652756 270903931 270126915 269557266 268886070 268450565
3196.9B68450565n15651r57528p69939r07650p10335n68714n32703m23489o36368p03735
$$ 268450565 267934914 266977386 266207447 265299797 264589462 264020748 263488045 263064556 262428188 261724453
3206.5B61724453q47569m30069r8381l49044q71392r73453k39773n54485r04827k25296
$$ 261724453 260876884 260446815 260348434 259999390 259127998 258154545 257914772 257360287 256455460 256230164
3216.2B56230164m89827r64794n86948l65715l13988m50554n61237o85539q45929l82862
$$ 256230164 255740337 254775543 254188595 253822880 253508892 253058338 252497101 251811562 250965633 250582771
3225.8B50582771p50599q73699m11606l74355M3831o38561p99008k59380n82428n37758
$$ 250582771 249832172 248958473 248546867 248172512 248216343 247577782 246778774 246519394 245936966 245399208
3235.5B45399208l88279l24535q96397j047649m63143l01323k89383n37643l46203
$$ 245399208 245010929 244686394 243789997 242742348 242279205 241977882 241688499 241150856 240804653
3244.2B40804653l19290p80354n70869j73607l60432o80637n87215m00658j75495m20990
$$ 240804653 240485363 239705009 239134140 238960533 238600101 237919464 237332249 236931591 236756096 236335106
3253.8B36335106n29060k87858q54320r03034M5185R6989o21377n28659k63310o87160
$$ 236335106 235806046 235518188 234663868 233760834 233806019 233903008 233281631 232752972 232489662 231802502
3263.4B31802502q05569j03436J38569l45649l14942l76396o88095o81839k39639n551
$$ 231802502 230996933 230893497 231032066 230686417 230371475 229995079 229306984 228625145 228385506 228379955
3273.1B28379955n29823n56831l32623k87228m62074n05676L0689Q8577l04241p51495
$$ 228379955 227850132 227293301 226960678 226673450 226211376 225705700 225736389 225824966 225520725 224769230
3282.7B24769230o40087j15738n7125m36344n07393K575k00081n16682l74794k08244
$$ 224769230 224129143 224013405 223956280 223519936 223012543 223015118 222815037 222298355 221923561 221715317
3292.4B21715317j90792m74415l45535l15514n43957n80940l44811o6795q8272j65272
$$ 221715317 221524525 221050110 220704575 220389061 219845104 219264164 218919353 218852558 218764286 218599014
3302B18599014l64589l76130k82726j83029n4455k56843n76611p48157n57404p6695
$$ 218599014 218234425 217858295 217575569 217392540 217338085 217081242 216504631 215756474 215199070 215122375
3311.7B15122375n1651n16529n31921n64117j23997L51181l74985o41403r05399n46303
$$ 215122375 215070724 214554195 214022274 213458157 213334160 213685341 213310356 212668953 211763554 211217251
3321.3B11217251K68917k89574l31173j39789m82235r83925j151867o67171m61979
$$ 211217251 211486168 211196594 210865421 210725632 210243397 209259472 208107605 207440434 206978455
3330B06978455k06166j72100k73304l32393p86801o85425k92530o17084o29044l33442
$$ 206978455 206772289 206600189 206326885 205994492 205207691 204522266 204229736 203612652 202983608 202650166
3339.6B02650166o13327n46418m78458l29208j42651o15044m30336k69470m82464j70269
$$ 202650166 202036839 201490421 201011963 200682755 200540104 199925060 199494724 199225254 198742790 198572521
3349.3A98572521O771m02221m66175m1790q6136j5812l40920r42230o62041j87435
$$ 198572521 198579292 198177071 197710896 197669106 197582970 197567158 197226238 196284008 195621967 195434532
3358.9A95434532k08397k74315M58l49159l86829k80095l94249J85109K23198l7671
$$ 195434532 195226135 194951820 194952278 194603119 194216290 193936195 193541946 193727055 193950253 193912582
3368.6A93912582n83362n30224K27661J06392l67241n52177K0733j6213l11413k07843
$$ 193912582 193329220 192798996 193026657 193133049 192765808 192213631 192234364 192218151 191906738 191698895
3378.2A91698895k83490j37233m56582m0969K16312l27396r9812N7774K422k75059
$$ 191698895 191415405 191278172 190821590 190780621 190996933 190669537 190569725 190627499 190629921 190354862
3387.8A90354862k35405J660R8362J49173k56805j11141l1338l27473j84822n2719
$$ 190354862 190119457 190121117 190219479 190368652 190111847 190000706 189969368 189641895 189457073 189404354
3397.5A89404354j90773k70691N3291J65730o6814K4643N6400l23143j89324K60334
$$ 189404354 189213581 188942890 188996181 189161911 189095097 189119740 189176140 188852997 188663673 188924007
3407.1A88924007L28656M81586K02618k94380k4395L92799J86939k24457j86824K98194
$$ 188924007 189252663 189734249 189936867 189642487 189618092 190010891 190197830 189973373 189786549 190084743
3416.8A90084743N82352K58846p1105k8000K04601J26533J85471L51906j3580M1770
$$ 190084743 190667095 190925941 190854836 190826836 191031437 191157970 191343441 191695347 191681767 191723537
3426.4A91723537O3534L6926N05620L38707L58390P66621K60620J00060O24885L03173
$$ 191723537 191787071 191823997 192329617 192668324 193026714 193793335 194053955 194154015 194778900 195082073
3436.1A95082073P6428J46904J13201K86045N16910Q11215J87740L02143O86379J68476
$$ 195082073 195158501 195305405 195418606 195704651 196221561 197032776 197220516 197522659 198209038 198377514
3445.7A98377514L97110K77691J59912k1763O26545J329765K72217J98193L47271P83748
$$ 198377514 198774624 199052315 199212227 199190464 199817009 201146774 201418991 201617184 201964455 202748203
3455.3B02748203J018009M28029M10060L18356J116734Q36944j70994J50738N32150
$$ 202748203 203766212 204194241 204604301 204922657 206039391 206876335 206705341 206856079 207388229
3464B07388229P66430Q53024J108665M82579L63826Q93593N91965O55098N37109N07660
$$ 207388229 208154659 209007683 210116348 210598927 210962753 211856346 212448311 213103409 213640518 214148178
3473.7B14148178N86891P82719R75628N51948N70431Q33473P01371K19745L45421J124172
$$ 214148178 214735069 215517788 216493416 217045364 217615795 218449268 219150639 219370384 219715805 220839977
3483.3B20839977J166039N20553N54524R55391Q12855J130466J104984P80735N31826
$$ 220839977 222006016 222526569 223081093 224036484 224849339 225979805 227084789 227865524 228397350
3492B28397350O52504J236801R31874N24616L60317P57828J185093N39780M53014J463337
$$ 228397350 229049854 230286655 231218529 231743145 232103462 232861290 234046383 234586163 235039177 236502514
3501.6B36502514J420021M18835P98912Q31432O73294J148911J304111Q46863M24785
$$ 236502514 237922535 238341370 239140282 239971714 240645008 241793919 243098030 243944893 244369678
3510.3B44369678J248074J225700Q85792O41537O67725J369438J124000J170254Q12931
$$ 244369678 245617752 246843452 247729244 248370781 249038506 250407944 251531944 252702198 253515129
3519B53515129N47104J110306J413078J337624N74398R75284J221428J040936Q38718
$$ 253515129 254062233 255172539 256585617 257923241 258497639 259472923 260694351 261735287 262574005
3527.7B62574005Q94280J116714J043911J315537J140041J506290Q19855N03044R57051
$$ 262574005 263468285 264584999 265628910 266944447 268084488 269590778 270410633 270913677 271870728
3536.4B71870728P53784J836509J331788J089248J564522J627636J699409J069069
$$ 271870728 272624512 274461021 275792809 276882057 278446579 280074215 281773624 282842693
3544.1B82842693J160393J249085J914672R29242Q33301J490784J552238K633515R57451
$$ 282842693 284003086 285252171 287166843 288096085 288929386 290420170 291972408 294605923 295563374
3552.7B95563374Q17375J348037J617165J935177P64046J725959J911965K077007J378346
$$ 295563374 296380749 297728786 299345951 301281128 302045174 303771133 305683098 307760105 309138451
3561.4C09138451J289940J727161R94854K957630J776161J279049R27277K16369L196831
$$ 309138451 310428391 312155552 313150406 316108036 317884197 319163246 320090523 320306892 323503723
3570.1C23503723K257729J754837J668739J583366J356469J600456K647514J316414
$$ 323503723 325761452 327516289 329185028 330768394 332124863 333725319 336372833 337689247
3577.8C37689247K070313K026214J443939K099572K349701K270393J158829L220977
$$ 337689247 339759560 341785774 343229713 345329285 347678986 349949379 351108208 354329185
3585.5C54329185K552300K38533K205582P30171K578316L138694K889099K043114J200295
$$ 354329185 356881485 357120018 359325600 360055771 362634087 365772781 368661880 370704994 371905289
3594.2C71905289L047485J194611K133979K793160J077461L101349K008858J475258
$$ 371905289 374952774 376147385 378281364 381074524 382151985 385253334 387262192 388737450
3601.9C88737450L189277K301026J945915K843819L005638J078453L597679K034264
$$ 388737450 391926727 394227753 396173668 399017487 402023125 403101578 406699257 408733521
3609.6D08733521K03323N659294J895370m47578M521294P13157L668671N177460J670379
$$ 408733521 408936844 414596138 416491508 416043930 420565224 421278381 424947052 430124512 431794891
3618.3D31794891J744728R12209K178574K771988K344741K691193L470802K978325
$$ 431794891 433539619 434451828 436630402 439402390 441747131 444438324 447909126 450887451
3626D50887451K718468O724892L845710o274147L020973M279900M371185K461777P16553
$$ 450887451 453605919 460330811 464176521 457902374 460923347 465203247 469574432 472036209 472752762
3634.7D72752762K389870L316574L695411K214508K428894L206902L333702K711792
$$ 472752762 475142632 478459206 482154617 484369125 486798019 490004921 493338623 496050415
3642.4D96050415J451607K462616L464164M685250L18870M73290Q094253K498742k047692
$$ 496050415 497502022 499964638 503428802 508114052 508432922 508906212 517000465 519499207 517451515
3651.1E17451515p59887M132957L771362L810044O275787m521790J003991N301361
$$ 517451515 516691628 520824585 524595947 528405991 534681778 530159988 531163979 536465340
3658.8E36465340K367630K312965J142769K824898J827697J908646K738342R98726
$$ 536465340 538832970 541145935 542288704 545113602 546941299 548849945 551588287 552587013
3666.5E52587013M174652L062554R50775K226143n174103P75986O480484R341049N611572
$$ 552587013 556761665 559824219 560774994 563001137 557827034 558603020 565083504 574424553 580036125
3675.2E80036125j3917732j204681O179390N434036j356659n93453K996674J987915
$$ 580036125 566118393 564913712 571093102 576527138 575170479 574577026 577573700 579561615
3682.9E79561615J081200R48143R36660L664780O993866n246201n143165P452698k473755
$$ 579561615 580642815 581590958 582527618 586192398 593186264 587940063 582796898 590249596 587775841
3691.6E87775841j483765M208489J022529J657944P68776p3738Q67309L94478K856140
$$ 587775841 586292076 590500565 591523094 593181038 593949814 593876076 594743385 595137863 597994003
3700.3E97994003L445816l287277k545280L700218K038994K66952N08614K110748M006348
$$ 597994003 601439819 598152542 595607262 599307480 601346474 601613426 602122040 604232788 608239136
3709F08239136n156746K460670N371704j0742454K665062M195137N65491M39109J375275
$$ 608239136 603082390 605543060 610914764 600172310 602837372 607032509 607598000 608037109 609412384
3717.7F09412384J581764k392921j0872M476166j594506l421440M359818K071228J48773
$$ 609412384 610994148 608601227 608590355 613066521 611472015 608050575 612410393 614481621 614630394
3726.3F14630394j701698j408615J809806O25763N557785R06067o949997O437264K380142
$$ 614630394 612928696 611520081 613329887 613955650 619513435 620419502 613469505 619906769 622286911
3735F22286911p214470r75342J315880L27454J870575L118133k741203J770515J0329705
$$ 622286911 615072441 614097099 615412979 615740433 617611008 620729141 617987938 619758453 630088158
3743.7F30088158n661965j6469764P304687M973793N612259o41823q556785R762764
$$ 630088158 624426193 607956429 615261116 620234909 625847168 625205345 616648560 626411324
3751.4F26411324l444176q503647M791336L690300L283196l894387J616898O288948
$$ 626411324 622967148 614463501 619254837 622945137 626228333 622333946 623950844 630239792
3759.1F30239792o077042l117752K816544Q67080K58255L508912p58896m745407J792373
$$ 630239792 624162750 621044998 623861542 624728622 624986877 628495789 627736893 622991486 624783859
3767.8F24783859M585037J844483o991768L37410K471886j73073N90553m44832O42052
$$ 624783859 629368896 631213379 624221611 624559021 627030907 626857834 627448387 627003555 627645607
3776.5F27645607J115074K791290R65691o340713J112937J475449M19312K615470j378936
$$ 627645607 628760681 631551971 632517662 626176949 627289886 628765335 629184647 631800117 630421181
3785.2F30421181r39827Q05702R6130M77791l32374r8076J48811L48015k7313J001358
$$ 630421181 629481354 630287056 630383186 630860977 630528603 630430527 630579338 630927353 630900040 631901398
3794.8F31901398K892761k253952l723488O02379L769760P247696m063492j0529213
$$ 631901398 634794159 632540207 628816719 629419098 633188858 640436554 636373062 625843849
3802.5F25843849K325249J540031L585282O108551o488877n080604L845672J737977
$$ 625843849 628169098 629709129 633294411 639402962 632914085 627833481 631679153 633417130
3810.2F33417130R6321J53274k27890P25556M905166J587258j2768555J872711M854546
$$ 633417130 633513451 633666725 633438835 634164391 639069557 640656815 627888260 629760971 634615517
3818.9F34615517M616623M313163j3749656j624680L835411J845780K062492J3962
$$ 634615517 639232140 643545303 629795647 628170967 632006378 633852158 635914650 635928612
3826.6F35928612l425865l2502J997033K874603K484283p337227M15345P275390l221512
$$ 635928612 632502747 632470245 634467278 637341881 639826164 632488937 632904282 640179672 636958160
3835.3F36958160j844787O158523o108856n013504O236076l543167j323318O652794
$$ 636958160 635113373 641271896 635163040 630149536 636385612 632842445 631519127 638171921
3843F38171921m12026m083900J235809R36012l63998R74541l68767J674767N809936
$$ 638171921 637759895 633675995 634911804 635847816 635483818 636458359 636089592 637764359 643574295
3851.7F43574295l027649K177429r873466m091149P771721o92291k800903J374626
$$ 643574295 640546646 642724075 632850609 628759460 636531181 635838890 633037987 634412613
3859.4F34412613K096062K905578m626579j560211N762672l046379m781952L139153
$$ 634412613 636508675 639414253 634787674 633227463 638990135 635943756 631161804 634300957
3867.1F34300957L921928N261002m332199q873558J629638M860268M975128p813759
$$ 634300957 638222885 643483887 639151688 630278130 631907768 636768036 641743164 633929405
3874.8F33929405j557731L279953Q1253K669296M536972l494606p103920L224716P95899
$$ 633929405 632371674 635651627 635732880 638402176 642939148 639444542 632340622 635565338 636361237
3883.5F36361237J419410O492577r081192j416283K363892l90129L544311J032639
$$ 636361237 637780647 644273224 635192032 633775749 636139641 635749512 639293823 640326462
3891.2F40326462n813408o333K249032j784401K26135O37359J705285L063736p206078
$$ 640326462 634513054 634506721 636755753 634971352 635197487 635834846 637540131 640603867 633397789
3899.9F33397789L239250K917481m210778L388558k970925k134399M17442K30446J469498
$$ 633397789 636637039 639554520 635343742 638732300 635761375 633626976 634044418 634274864 635744362
3908.6F35744362O8092K14234j66741K5749K19994l28255N0354K047806p52373l354263
$$ 635744362 635812454 636026688 635859947 635885696 636105690 635777435 635827789 637875595 637123222 633768959
3918.2F33768959K928314O83594k979622R12171Q03146J063576p32117k446137L81012
$$ 633768959 636697273 637380867 634401245 635313416 636116562 637180138 636448021 634001884 634382896
3926.9F34382896P57828J064835j39466p73429J754722r91287k080269P97997K73285
$$ 634382896 635140724 636205559 636066093 635292664 637047386 636056099 633975830 634773827 635047112
3935.6F35047112Q8310l15056q43353K58369L48167P70875Q80584k017479o60133J130829
$$ 635047112 635135422 634820366 633977013 634235382 634583549 635354424 636235008 634217529 633557396 634688225
3945.2F34688225O29768J236725j203461k98996P49741j968842O72799M71382q50106
$$ 634688225 635317993 636554718 635351257 635052261 635802002 633833160 634505959 634977341 634127235
3953.9F34127235J49422K25945l8796r37347R4528m463Q87794J587410q58154m94690
$$ 634127235 634276657 634502602 634463806 633526459 633620987 633616524 634504318 636091728 635233574 634738884
3963.6F34738884n22270p47299P02667P85789k57873p81403m51050J74218M62837J86882
$$ 634738884 634216614 633469315 634171982 634957771 634699898 633918495 633467445 633641663 634104500 634291382
3973.2F34291382J30310k14462j52436l9177Q7204N32265L77350K2278o35453m70771
$$ 634291382 634421692 634207230 634054794 634015617 634102821 634635086 635012436 635034714 634399261 633928490
3982.8F33928490j15128K74010j68190n60188P29408M28238L9024l51143o77872J68152
$$ 633928490 633813362 634087372 633919182 633358994 634088402 634516640 634555664 634204521 633526649 633694801
3992.5F33694801P53136L43514r90487j97639J94588J39312P21016J59264
$$ 633694801 634447937 634791451 633800964 633603325 633797913 633937225 634658241 634817505
4000.2F34817505
$$ 634817505
##END=$$ End of the data block
