##TITLE=$$ Begin of the data block
##JCAMP-DX=5.00 $$ ACD/SpecManager v 10.08
##SPECTROMETER/DATA SYSTEM=Varian
##DATE=14 Jan 2013 09:28:02
##DATA TYPE=INFRARED SPECTRUM
##DATA CLASS=XYDATA
##ORIGIN=
##OWNER=
##NPOINTS=3735
##FIRSTX=399.26403809
##LASTX=4000.35498047
##MAXX=4000.35498047
##MINX=399.26403809
##MAXY=69.96869659
##MINY=18.97876167
##XFACTOR=1.0000000000
##YFACTOR=0.000000100000000
##FIRSTY=42.94266129
##DELTAX=0.96440572
##XUNITS=1/CM
##YUNITS=TRANSMITTANCE
##XYDATA=(X++(Y..Y))
399.3 429426613 416568527 420991745 424782600 420854645 416521301 415427551 415812874 405837936
407 405837936 403336754 403764801 403356628 402537613 399081841 404841766 403562279 396504898 394875374
415.7 394875374 398435593 401795349 398703232 398704567 397719383 398572273 397430725 398824425 400422974
424.3 400422974 395303917 394430809 400881042 406632805 403816910 401050377 398339691 393890038 394600105
433 394600105 395263405 396052704 396313171 396563873 397170258 396674614 395002174 392911034 392956696 393993607
442.7 393993607 394733505 396054878 399974899 399511528 393049507 390519562 393638611 397153664 391159706
451.3 391159706 386957893 389944305 393461685 394602776 390543137 393650398 395256157 388155403
459.1 388155403 389750710 391138000 391572571 393763657 391303024 388300552 388195381 389170227 391764793
467.7 391764793 390260468 385919952 383274193 384702377 383979645 376637535 379055977 382190590 381211967
476.4 381211967 377906761 375544014 378974876 379187012 378425255 377813873 374961357 374574966 377382278
485.1 377382278 378099403 376798477 376830406 374313698 373715935 372911911 371572533 374238739 373893547
493.8 373893547 373573380 374778519 376618423 376320229 374248810 372324104 370585442 371764030 371106911
502.5 371106911 370263290 368766479 368233337 371621666 373593712 372557526 370166931 370228615 368818588
511.1 368818588 365842247 365338936 364297256 364550285 365556297 365803871 365099831 365543137 366073532
519.8 366073532 366425781 366305161 363814468 363733826 363103561 359470482 357746849 359343147 361814003
528.5 361814003 362406502 362347221 362384911 361830063 361881142 362487526 361639442 360986137 361478920 360319519
538.1 360319519 359380798 359128532 358588448 358772659 358778610 356660042 354607620 354401436 354053917 354309616
547.8 354309616 354118385 354006653 354418526 354073982 352552490 351303978 352340279 351233253 350255814
556.5 350255814 350728264 350292969 351005287 350803337 349685173 348472519 347891312 348835564 350713387
565.1 350713387 351772690 351993141 352691650 352321510 350964622 348895416 349216728 350569534 349393272
573.8 349393272 348785362 348306351 348380051 348727417 349175339 349198685 347854767 348060837 349019699 349291611
583.5 349291611 348806953 348755188 348645515 348834152 349307404 348985214 350146294 351652679 352477036 352443810
593.1 352443810 352947159 353321419 351979065 352017326 352564430 352229004 352363892 353896942 354215660 353520279
602.8 353520279 353525658 353391762 353829765 352272568 351140022 351722031 351221352 351033897 349994812 348691673
612.4 348691673 347761841 347961426 348337555 347709198 347690125 347180977 347210121 347774811 348522453 349416046
622 349416046 350012932 350065422 350091858 351152382 351366348 351947060 353417969 355254669 357473831 358504524
631.7 358504524 358618202 358670616 359855843 361848221 363938675 365883255 367266922 367780418 368275375
640.4 368275375 369590759 370177307 370753975 372035255 373342628 374223938 375214653 377145386 378237381
649 378237381 378746872 379054871 378907738 379367142 380363083 381156311 381397247 382055664 382436028 381389999
658.7 381389999 379715958 379629822 380695724 380243225 380326385 381111145 381132927 380932236 379742737 378922195
668.3 378922195 380520935 382528725 384149170 383706741 384067612 385773125 387074280 387713928 388272820
677 388272820 388929214 389290466 390664711 392327347 393645363 395767937 397618294 398578682 398707352
685.7 398707352 399365501 400173264 400326424 401505890 402494316 404309883 406398468 406710510 407148132
694.4 407148132 406865463 406487999 407139206 407947464 408315773 408417473 409702377 410715332 411385193
703.1 411385193 412044373 412402916 413337784 413815880 414440308 415548973 417241516 418614883 418333130
711.7 418333130 418474121 418895226 419667053 421048241 421595192 422304802 423351326 423776627 423679848 423780174
721.4 423780174 424269333 425123978 425795174 426290627 428171539 430169373 431462822 432228279 431989326
730.1 431989326 432490387 433589706 434461136 434999390 435405159 436579475 437833366 438791809 439578667
738.7 439578667 440662613 441361694 441032486 441313782 442114487 442460556 442814140 443559380 444181786 444979210
748.4 444979210 445755653 446351814 447390251 447907143 448343430 449489937 450727158 451319695 451764717
757.1 451764717 452828979 453978462 455345039 456232491 456997261 457837334 458623505 460779724 462556076
765.7 462556076 462391777 461807556 462314758 462917557 463328857 464290466 464892044 464595451 463779411 464155960
775.4 464155960 464538918 463739700 463184357 463163338 463806229 464294090 464555321 465467834 466657028 466794815
785 466794815 466480103 466275749 466186028 466816521 467191277 468373756 469589539 469620857 468966560 468672180
794.7 468672180 469478912 468327179 466736412 466264801 466222267 465731735 464856033 464846611 462781754 460799522
804.3 460799522 459819489 457750816 455718651 454233932 453793793 453158417 451777306 449764938 448192749
813 448192749 446201820 443367767 442137756 441703110 441448593 441534081 442248192 441953430 441140556 442558098
822.6 442558098 444565773 446579933 448266258 450252113 452625122 455082779 458663750 462020454
830.4 462020454 465239754 467395134 469488754 472534065 475607109 479084930 481539993 483492928
838.1 483492928 485489273 487296753 488343086 489485779 491171875 493150024 495374031 496001854 496966476
846.8 496966476 498851051 500950165 501695633 501945648 504253006 505912743 507157936 508204269 509496689
855.4 509496689 510582733 511386528 513213997 514308586 515481224 516638947 517577629 517962494 518333969
864.1 518333969 518434601 517562218 517234726 516799240 516312866 514141502 511771736 510036621 508520851
872.8 508520851 508353615 507649727 506437187 504310417 503217888 502681084 501827316 501456451 500354347
881.5 500354347 500213890 499095993 497596436 497306404 497272034 496729622 495628662 495998764 495706940
890.2 495706940 494978180 494692993 494863167 495107498 494659500 495228195 495350037 495797424 497102776 497881966
899.8 497881966 497762337 497055283 496990128 497673874 499417191 500724869 502292633 504841537 507600365
908.5 507600365 510009117 511412430 512620163 512577705 512063560 511144257 510454216 509351349 507120361
917.2 507120361 505839691 503923378 502200775 499751358 496163712 493157082 489744644 486129875
924.9 486129875 482419319 479198494 476342735 473768501 470965843 467868004 464972382 462184753
932.6 462184753 460251770 458612518 457108269 455776863 455163803 454618340 452944603 451503067 450534325
941.3 450534325 449887733 449171906 448341446 447302361 446112289 445495987 445508461 446213646 446385994 446117592
950.9 446117592 445608749 444838791 444390945 443577461 442473297 441005211 439294472 437230263 435071335
959.6 435071335 432986221 430945549 428919106 426551476 425124588 424087181 422205772 419604645
967.3 419604645 417240219 415619278 414098854 412186317 409226570 406499214 404150429 401535873
975 401535873 398518066 394604187 390750580 386800919 382759552 378659706 374048538 369261398 364092979
983.7 364092979 358684273 353429832 348355522 343936806 339457245 334808731 330448189 326260757
991.4 326260757 323169632 319648743 315903950 312642498 309351616 306304913 302720833 299487667
999.1 299487667 296231594 293208752 290426807 287456913 284714012 282165890 280356312 278192692
1006.8 278192692 276647568 275083008 273408966 271899910 269464245 267552223 265786972 264383678
1014.6 264383678 262105350 259448757 257529240 255262871 252862396 250845566 249599705 246839294
1022.3 246839294 244539833 243139763 241485748 240087109 238378811 237055149 234857006 234245014
1030 234245014 234042664 232862740 231956043 231515942 232278481 231966381 232902508 234413548 235827332
1038.7 235827332 237381821 238600788 240362816 241107330 242119484 242399063 243082619 243705692 244078274
1047.4 244078274 244536228 242542820 241633263 241047745 240403500 239310188 237482338 236316490 235337830
1056 235337830 235497398 234941502 235501823 236129799 236779442 238432312 239894772 242159214 243588848
1064.7 243588848 245379467 246508198 247654743 249220867 250591640 251589756 251392384 252318478 252340622
1073.4 252340622 252813721 253284321 253984642 255178623 254156532 254950809 255803795 256300488 257102261
1082.1 257102261 257853279 259563713 261230698 263032837 264019394 265422592 266819820 268831272 270844612
1090.7 270844612 271943474 273079643 273626556 275553513 277180748 278520393 280444279 282269249
1098.5 282269249 283964653 285407524 287197437 288469219 290260201 291473846 292787552 294556942
1106.2 294556942 295798950 297218685 297711506 299112091 300260067 300597458 301341438 302427940 303879204
1114.9 303879204 304513245 305383549 305876598 306253777 306230793 305529518 305199223 305062447 305764732 305931339
1124.5 305931339 306553192 307859554 309195480 310390224 311218338 313071938 314764271 316613865 318715744
1133.2 318715744 321086502 323737335 326133995 328663445 330903091 333483162 336063042 337869072
1140.9 337869072 338821602 339978333 341214371 341946297 343078575 343767624 343983612 344145432 344459724
1149.6 344459724 345089302 345542374 345567245 345398788 345521469 345362358 345194130 344521027 343776665 343736877
1159.2 343736877 343008575 342156639 341508980 341682091 342487984 343297310 344713326 346451187 348761597
1167.9 348761597 351066208 353221893 355512085 358687057 362317772 365123978 367764664 370772209
1175.6 370772209 373629990 376109238 378782883 381086540 383182678 385402184 387619171 390012703
1183.3 390012703 392305107 394151344 394899445 395114403 395619202 396046562 396128159 396484680 396836243
1192 396836243 396788673 396410599 395746841 395106316 394146500 392956543 391700020 390688972 389471893
1200.7 389471893 388098640 386941147 385440636 384320641 382998085 381527100 380842361 380248756 379539795
1209.4 379539795 378869438 378842010 378869438 378395386 377797775 377257423 377263908 376758690 376206245 376365700
1219 376365700 376204529 375554886 374620438 374101524 373903770 373617706 372888145 372066269 371641006 370613060
1228.6 370613060 369556847 368894005 368230324 367446938 366513939 365952148 365282516 364832382 364514122
1237.3 364514122 363922729 363762589 363779755 363666458 363372459 363062439 362461052 361713791 361203690 360773849
1247 360773849 360487785 360169945 359905930 359541168 359411621 359101410 358463974 358242531 357891960 357878647
1256.6 357878647 358032303 357838745 357484779 357449799 357771530 357748070 358075867 358400040 358719254 359211006
1266.3 359211006 359561119 360296860 361270981 362159386 362645645 363351326 364546318 365757980 366579933
1274.9 366579933 367366982 368679810 369873390 370875320 371880302 372897034 373912201 375186844
1282.7 375186844 376532745 377903137 379461937 380907631 382495918 383968239 385120010 386035652
1290.4 386035652 387026634 387743683 388380890 389163132 389978676 391058350 391493263 392248001 393033409
1299 393033409 393142624 393270493 393299370 393495522 393490410 393748283 394053688 394219933 394273376 393690681 392757378
1309.7 392757378 391750641 391307755 390846176 390549660 390227814 389777946 389923935 389949875 390526924 391129150
1319.3 391129150 391346893 392181435 393491554 394471016 395030289 395984497 396458206 396984482 397686310
1328 397686310 397773933 397137985 396290245 395999985 395510025 395188293 395182800 395265350 394941902 394676819 395280914
1338.6 395280914 395547638 396320534 396576653 396470642 396999893 397759666 399001503 399984093 400586243
1347.3 400586243 400702286 400790710 400915642 401038933 400971107 400597610 400615540 400244637 399780807 399216080
1356.9 399216080 399010353 398785896 398115273 397493477 396587944 396786766 396511345 395995598 396006775 395603561
1366.6 395603561 395100861 394301949 393904305 393428688 393058777 392732735 392388191 392028732 391457443 391876793
1376.2 391876793 391848946 391795845 391459503 390822334 390220451 389178619 387996750 386128693 384869576
1384.9 384869576 384068604 383134422 381044312 379201164 378113708 376096153 374343796 372446213 371065826
1393.6 371065826 369270821 365618172 363541985 361846428 360561104 357491989 354627838 353101616
1401.3 353101616 350722198 348558846 346357765 343881569 341642303 340101128 338763657 336714478
1409 336714478 335191536 333741150 332316818 330787888 329368401 328472290 327387047 327060661 326637306
1417.7 326637306 326821632 325985947 324749031 325394249 325566216 326285744 326374931 327000809 327940598 328546371
1427.3 328546371 329862976 330688972 332080688 332829933 334431992 336011391 337044792 339075661 340524788
1436 340524788 342719650 344360046 346692924 348370552 349795570 351749420 353140602 354935379 355917206
1444.7 355917206 357514572 358752747 360257111 361920433 362760925 364399796 365353355 367196045 368102531
1453.3 368102531 369469795 371578636 372874718 374755363 374818115 378006363 379172897 380940895 382554703
1462 382554703 383786507 386017456 387015533 389665489 391803169 394409637 396747894 399080238 402141800
1470.7 402141800 404676552 408836288 411262703 414216309 417074928 420206566 423161774 425411110
1478.4 425411110 427912560 430198822 432374725 434036942 435949249 437779694 439700394 441993065
1486.1 441993065 443300018 443692551 444438515 444393806 444545746 445526581 445656624 444806519 444319191 444132729
1495.8 444132729 440497932 439856911 438530655 435639763 435184822 433999481 432637329 431506348 431330299
1504.5 431330299 430808640 429435120 428552246 426722755 427189713 426711502 426826019 426049500 424629059
1513.1 424629059 424491615 424010086 423964424 422796783 420383224 420848389 422070694 421447525 419992485
1521.8 419992485 420472145 420738373 421613274 422162857 423474731 424185524 424792671 425438538 425610428
1530.5 425610428 426171074 426652565 427747040 427540245 428033447 428716850 429156303 430500412 429800415
1539.2 429800415 428483086 429341087 430317001 430532341 431715660 432909660 432057457 433171234 433754959
1547.9 433754959 434276543 434237900 434095459 434993477 435214577 435762939 433348656 433448868 435082207
1556.5 435082207 436885796 434740715 425963402 428915138 428311195 428412590 426826706 425194588 422321205
1565.2 422321205 419604034 418545341 416383820 415610161 408410416 405715981 403480606 399645195
1572.9 399645195 396504402 393173447 392218399 381368599 378355827 374997025 370837479 366631317
1580.6 366631317 360989494 357219582 351204147 347452850 342310753 337929726 333509331 328003654
1588.4 328003654 324156494 317949848 314691410 309052238 305056419 300754089 296111908 293378277
1596.1 293378277 288389282 286345654 281591415 278753757 274769669 271377506 269336510 265207176
1603.8 265207176 264050961 260538425 259614372 256580620 254778290 253221378 250287189 250270996 247618141
1612.5 247618141 247751732 245706997 246083183 246024933 241537609 243266678 241810589 242989464 241816273
1621.1 241816273 243096542 243041363 241778202 243349018 242879848 244893837 243687496 245500813 245622272
1629.8 245622272 246340961 247899895 248118877 250575695 250243301 254133453 252771244 255486851 257543488
1638.5 257543488 258373756 261022339 261522160 264406357 265124588 267380867 269197426 269460030 272398300
1647.2 272398300 271618023 274991531 275334225 277965279 280288906 281021805 281748161 281478367 284863110
1655.9 284863110 285139751 287209187 288025074 289668522 291845703 293515606 296884899 297254086 300998383
1664.5 300998383 303305149 306219711 308838615 310874329 315159512 317391529 322081451 324492264
1672.3 324492264 328503036 331600227 334774246 338796234 341860390 346865540 350177231 355439644
1680 355439644 359070778 362931099 367848129 370916939 378046608 379808769 385564575 390061531 394878387
1688.6 394878387 399987106 404320488 409289436 413576965 418608284 423199501 428034096 431384087
1696.4 431384087 438158913 444449768 449487305 456072540 456472473 462285156 466906509 471005707
1704.1 471005707 475174408 479479523 483434105 486221581 490220680 493279800 495860672 498710785
1711.8 498710785 501215363 503829651 505485687 507732964 511879539 516097832 513644371 514641151
1719.5 514641151 517506180 519703064 521419067 522583313 523852730 525820923 527781067 529182472
1727.2 529182472 531098633 533492241 534177933 534761276 538020287 541787376 541656189 539165993 542428932
1735.9 542428932 545667419 547254448 549939117 551574326 550864258 554332581 557343369 559466743
1743.6 559466743 562184067 565627594 568761139 571044350 573828888 575635567 580223885 583606873
1751.3 583606873 585153961 589786530 593175087 596228600 599338303 600420151 602681389 606111832
1759 606111832 608923340 612343559 613424187 613616638 616684875 618594131 620115395 622210693 624502640
1767.7 624502640 624063454 626026001 630195198 631007423 629857903 628758926 632198067 634513397 634486313
1776.4 634486313 636742287 637602043 638924599 639849396 640478439 642349319 643828888 645080566 644895172
1785.1 644895172 645331268 646544800 647845383 649097061 650953445 652039871 652528915 651880188 651182251
1793.8 651182251 654165344 655171432 655092773 656302414 657831192 658895111 658128128 659903107 660610733
1802.4 660610733 661148987 662348175 662903748 663999176 664639969 665318909 666243744 667888870 667516556
1811.1 667516556 667475586 668214874 668490829 670028152 670716019 671974792 672058563 671989670 672991638 673346710
1820.8 673346710 674428711 674518661 675639038 676639404 674779205 674958954 676804352 678488464 678708649
1829.4 678708649 676854782 677091293 679036484 679377899 679713516 680549774 681389008 682163315 681724319
1838.1 681724319 682510910 682425613 682709351 683341446 684703522 686416550 682495499 683795319 685744705
1846.8 685744705 685943146 685495453 685440674 686322861 686742783 687850342 687890930 688191452 688511658 688593674
1856.4 688593674 689059677 688686752 689024811 689100266 689722366 689825439 690335922 691081085 690803986 691389618
1866.1 691389618 691000290 691666794 691420746 690525055 691660767 692258453 692725830 692840042 693092117
1874.8 693092117 692698975 692797623 693023148 693524475 694338760 694103317 694553757 694355545 694511261 694526138
1884.4 694526138 694414291 694832993 694535370 695459595 695862198 695237122 695521164 696287689 696220627 696033936
1894.1 696033936 696076889 695366745 696103745 696402817 696321793 696343155 696820221 697518158 696980438 697132568
1903.7 697132568 697021561 697128906 697352371 697527008 697873306 697880173 697895126 697513046 698313217 698218231
1913.3 698218231 698149872 698215714 697859650 698950500 698005905 697541885 698311081 698789749 699137421 698701324
1923 698701324 698374100 698412933 699016571 698899765 698888397 698628387 698541412 699027939 698955688 699223022 698914261
1933.6 698914261 699192886 699228745 699074402 699104309 698571701 698730621 698761139 699686966 699587402 698097229
1943.2 698097229 698265762 698586731 698410721 697973862 698242264 698129807 698176193 698025589 697888184 698275757
1952.9 698275757 698079529 698143387 697919617 697940216 697478790 697215271 697550049 697596130 697955170 697623825
1962.5 697623825 697751465 697390976 697208405 697669907 697314758 697320786 697211304 697310791 697143021 697239532
1972.2 697239532 697185898 696896744 697034607 696775742 696913376 696777115 696807709 696565170 696589203 696916351
1981.8 696916351 696647873 696955185 696641998 696548843 696298904 695922165 695922241 695654831 695965881 696150131
1991.5 696150131 696231384 695814209 695833664 695780640 695486374 695696640 695533218 695538330 695124969 695012054
2001.1 695012054 694754639 694401474 694447403 694323578 694388351 694051132 694216003 693885956 693758392 693874893
2010.7 693874893 693392258 693572388 693367996 693195038 692883072 692780457 692423325 692275772 692683411 692247849
2020.4 692247849 692296066 692021179 692027740 691900253 691672821 691749725 691211014 691453705 691076889 690614548
2030 690614548 690295486 690336990 690617599 690173492 690209579 689757843 689428940 689201660 689537125 689855194
2039.7 689855194 689423599 689309082 688804321 688752136 688217316 687954636 687967453 687737732 687966385 687955933
2049.3 687955933 688436813 688087616 687874985 687842484 687380447 687129669 686821365 687248535 687099686 687250214
2059 687250214 687384338 687029419 686818466 686454391 686628036 686527252 686674423 686634140 686579208 686465683
2068.6 686465683 686232452 686569290 686404724 686042786 685387726 685590439 685739288 685288773 685437851 685527954
2078.2 685527954 685788422 685667572 685755844 685414047 684981308 685107574 685093307 685165100 684569702 684378052
2087.9 684378052 684349976 684290314 684013290 683772812 683899231 683604660 683802109 683570099 683623428 683652725
2097.5 683652725 683441620 683323135 682649384 682648773 682240448 682139130 682038803 681876602 682007065 681601410
2107.2 681601410 681728592 681628799 681897278 681950836 681766357 681603699 681171722 681079254 680550919 680630493
2116.8 680630493 680537720 680424957 680355301 680414963 680903320 680448303 680110779 679572983 679748459 679928055
2126.5 679928055 679682693 679987793 679920120 680035324 679547806 679483261 679315796 678747635 678859329 678932571
2136.1 678932571 679267654 679451370 679780731 679301987 679050446 679305725 678937836 678901672 678755951 679187012
2145.8 679187012 679457779 679453049 679488983 679728775 679960022 679397583 679216156 678887939 679082184 679272232
2155.4 679272232 679336548 679654922 679415283 679425507 679171295 679189072 678940430 678966599 679388199 679410629
2165 679410629 679834366 679923706 680184402 679966965 679797745 679693604 679363403 679622040 679524078 679451752
2174.7 679451752 679409103 680022354 680095139 679734344 679700928 679367218 679727097 679772644 680007324 680018463
2184.3 680018463 680269547 680819244 680472565 680296402 679867783 680042267 680010147 680132980 680616074 680743256
2194 680743256 681237717 681051788 681171722 680872803 680264816 680119019 680249252 680615997 680584335 681134872
2203.6 681134872 681446228 681575012 681300430 681075821 681120758 680858154 681077576 680923080 681410751 681599579
2213.3 681599579 681395416 681326218 681164703 681720276 681380463 681190186 681221924 681235886 681387787 681618881
2222.9 681618881 681928711 681589737 681814117 681647263 681696854 681747818 681531448 681653137 681329117 681702881
2232.5 681702881 681612091 681527405 681555862 681483841 681386948 680892258 681442032 681802750 681871109 681376877 681192551
2243.2 681192551 681398239 681007614 681275787 681277924 681426926 681242981 681038589 681024017 680614319 680798187
2252.8 680798187 681097717 681542206 681336517 681245270 681201630 680930328 680906448 680577087 680772705 680845184
2262.4 680845184 681179352 681274490 680984802 680703735 680371552 680660400 680499344 680299149 679921722 680062637
2272.1 680062637 680372543 680489349 680853958 680370255 680341721 680119324 680182953 680514297 680402679 680332260
2281.7 680332260 679830551 679961166 679950943 680114822 680057373 679654694 679488220 679010162 679039001 678995132
2291.4 678995132 679285202 679067841 678944473 678872681 678163147 678438797 678425903 678441086 677924347 677629929
2301 677629929 677912674 677870026 678067627 677380829 677167587 676644440 676214371 676678925 676956100 676930084
2310.7 676930084 676060638 675757904 675186844 675077133 675055542 674454880 674125519 673885193 674387512 673589706
2320.3 673589706 673178711 673015976 672251892 671677246 671559830 672293243 671672058 671808243 671638947 671092911
2329.9 671092911 670396957 670086975 670652313 669077988 669101944 669361191 669476624 668907852 667941666 668553619
2339.6 668553619 668169174 669025040 668736038 668334503 668766327 668676834 668816833 668595505 669327240 669687042
2349.2 669687042 669581299 668498993 667473907 667414474 666790237 666126175 664882660 665455399 665780487
2357.9 665780487 664860153 663593445 663727951 664914856 663840103 663939743 663406372 663002548 663722229
2366.6 663722229 664891968 665434341 665042191 665025101 664072189 664557648 665680618 666506042 666592026 666218262
2376.2 666218262 665917511 665259018 665697861 665564423 665472870 665697556 665708542 666117630 666199646 666321259
2385.9 666321259 665823059 665364151 664997025 664360123 663831787 663635635 664159241 664062729 663754349 663149643
2395.5 663149643 662715073 662532120 662092667 662002258 661617355 661649551 661366348 661153107 661197739 660768127
2405.2 660768127 660475845 659946136 659657211 659038086 658922501 659147797 658746796 658237839 657881317 658115845
2414.8 658115845 657674255 657145004 656783295 656860199 656871109 656227722 656136398 655528259 655240555 654673843
2424.5 654673843 654061966 653939667 653101196 653012085 653118973 653177795 652892075 652427826 652006073 651384354
2434.1 651384354 651302338 651083908 651041412 650644226 650247574 650101929 649645309 649134216 648272324 647856750
2443.7 647856750 647793808 648026428 647896805 647351456 646784134 646156006 645993118 645658264 645408249 644785080
2453.4 644785080 644448242 644337540 643675308 643362045 642709122 642274780 642139282 642070007 641716537 641066513
2463 641066513 640586319 639981117 640098343 639994736 639410248 638821030 638457718 638181343 637732811 637518158
2472.7 637518158 636801987 636536522 636228218 635664635 635325623 634662285 634359093 633815536 633400116 632904243
2482.3 632904243 632358551 632294807 631919785 631444588 630911980 630151672 629168854 628902168 628897934 628515701
2492 628515701 628153114 627742462 627347336 626637993 626116714 625606461 625139503 624507294 624013786 624148102
2501.6 624148102 623787804 623407478 622705498 621973076 621406326 620832939 620587273 620263290 620183601 619587402
2511.2 619587402 618958130 618559570 618375969 617930794 617040558 616943588 616351166 616118965 616117287 615525436
2520.9 615525436 615105667 614504166 613890381 613026123 612773895 612476044 612175064 612164078 611844940 611827431
2530.5 611827431 610966263 610209541 609977150 609650116 609271965 608766861 608625031 608294296 607857475 607280731
2540.2 607280731 607105637 606994476 606360779 605582886 604817619 604575043 604387512 604356117 603797989 603169556
2549.8 603169556 602771797 601967964 601645317 601226196 600907211 600718040 600842667 600768013 600061531 599742508
2559.5 599742508 599182205 598684311 598144417 597905655 597688675 597045555 596845741 596643066 596490440 595705643
2569.1 595705643 594787636 594473610 594353752 593904839 593161888 593052864 592810135 592455063 591890564 591475334
2578.7 591475334 591285629 590592461 590169601 590042343 589888573 589091072 588693542 588399391 587495117 587045479
2588.4 587045479 586651382 586533737 586084328 585652351 585448837 585222321 585261383 584613419 583773842 582905960
2598 582905960 582369385 581882668 581262779 580922890 580547142 580464973 580014801 579412422 578525314 577697716
2607.7 577697716 577567177 577309074 576840248 576184235 575887260 575593071 575210342 574615974 573746033 573246307
2617.3 573246307 572737503 572232819 571594582 571210251 570814362 570435257 570090027 569108200 568347740 567924957
2627 567924957 567676849 567232666 566968727 566655922 566121483 565841408 564933357 564314919 563870888 563439560
2636.6 563439560 563070602 562260971 561882744 561651459 561193199 560412560 559744797 559091530 558586655 558115654
2646.3 558115654 557277985 556874352 556536713 556546478 556131210 555278358 554866753 554527855 554288788 553503723
2655.9 553503723 553239632 553186913 552765999 552591095 552084503 551362495 550696716 550371666 549729805 549372482
2665.5 549372482 549467354 549301338 549298172 549085808 548569527 547782898 547514534 547144470 546320343 545914917
2675.2 545914917 545797005 545764999 545173607 544861183 544553604 544174805 543862038 543130798 542854538 542377396
2684.8 542377396 542134819 542118263 541741791 541126480 540304070 539937820 539680977 539420319 539057121 538974800
2694.5 538974800 538733215 538239174 537955246 537410393 536991692 536305542 536107063 535987968 535355186 535033722
2704.1 535033722 534769974 534853745 534367409 533659782 533399506 533200455 532929764 532362289 532130280 532085457
2713.8 532085457 531963577 531545639 531097488 530692863 530387650 530068359 529800911 530117798 529560661 528913498
2723.4 528913498 528675842 528558083 528695679 527932816 527261734 526713524 526399460 526534691 526563492 526531372
2733 526531372 526242294 526149673 525823288 525304718 524815254 524601822 524439354 523996468 523799820 523565140
2742.7 523565140 523672943 523698502 523612022 523730698 523789177 523328094 522500267 522404900 521863518 521555214
2752.3 521555214 521646805 521165733 521045914 520879898 520667915 520263519 519776878 519323120 519102211 519040222
2762 519040222 518610039 518381424 518039742 517876282 517527580 517137070 516845360 516161270 516059494 515650177
2771.6 515650177 515083885 514955940 514887085 514675484 514188385 513875198 513170204 512456512 512007141 511609001
2781.3 511609001 511440620 511145325 510720406 510490341 510354767 509874001 509396820 508846130 508296661 507618484
2790.9 507618484 506785126 506337967 505797577 505304260 504812660 504546089 504107742 503118210 502430305 501865654
2800.5 501865654 501439400 500840302 500248680 499717598 499112358 498491325 497387047 496679878 496463394
2809.2 496463394 496080971 494985733 493774796 493331757 493018112 492570457 491797600 490943565 489968758
2817.9 489968758 489075050 488554077 487830620 486928368 486233444 485757217 484907608 483973694 483013344 482177162
2827.6 482177162 481485291 480369453 479450874 478705559 478075294 477129784 476065674 475326157 474372711
2836.2 474372711 473362236 471962357 470747910 469370003 467484245 466017838 464359322 462765961
2843.9 462765961 461293259 459121437 456863251 455224419 453432388 451290283 449295540 447869225
2851.7 447869225 447270393 446458435 445492401 444861641 444613266 444546547 444357491 444272537 444019356 443890572
2861.3 443890572 443617973 443060188 442476997 441911583 441234932 440059357 439184113 438472481 437695007
2870 437695007 436798553 436145363 435878296 434986725 434209633 433439713 432551842 431986046 431375198 430662880
2879.6 430662880 430015945 429566498 428748283 427795639 426753998 425934906 425445366 424575920 423598862
2888.3 423598862 422692757 422029839 421006660 419968567 419042091 418018799 417465897 416500664 415449944
2897 415449944 414543381 413806419 413326912 412717972 411949806 411093025 410743790 409990997 408899307 407854347
2906.6 407854347 406911926 406251411 405337677 404624329 403470650 402293396 401045837 399417648 398367157
2915.3 398367157 397126350 395883598 394497871 392772789 391278839 390375671 389826927 388915215 388143501
2924 388143501 387480469 386986008 386938934 387294502 387467613 387486191 387460060 387395554 388048439 388158646 388429718
2934.6 388429718 389109955 389214516 389778519 390397415 391088791 391537399 392010536 392905998 393655014 394405670
2944.2 394405670 394654808 395124702 396017418 396797447 397631226 398347549 398728867 399200096 400082016 400219307
2953.9 400219307 399922638 400205421 401122360 401912918 402330437 403288574 404137726 404583969 405102348 405888977
2963.5 405888977 406648293 407365379 408394127 409035416 409446983 410267448 411367378 412170448 412828407
2972.2 412828407 413269768 413536644 414462776 415096817 415254021 415648460 416060829 416476135 417037773 417482185
2981.8 417482185 417628098 417830963 418017197 418228416 418491173 418973198 419206696 419107399 419476395 419649315
2991.5 419649315 419558449 419107819 418614426 418363647 418077507 418159714 417516251 416757126 417020645 417231865
3001.1 417231865 416652145 415957718 415798607 415248985 414331474 413609314 413182220 412850990 412381248 411874084
3010.8 411874084 411288261 410822258 410181885 409537468 409041328 408388214 407417221 406609840 406188393 405458908
3020.4 405458908 404955673 404270897 403320007 402601891 401767845 401124611 400343132 399790955 399161682 398164749
3030.1 398164749 397590485 397083244 396491737 395632668 394720192 393944893 392968216 392021065 391303101 390552902
3039.7 390552902 389705849 388979301 388174973 387213516 386308479 385543785 384412003 383447533 382977676
3048.4 382977676 382262383 381549225 380744858 380312386 379699211 378219452 376814117 375920296 375485535
3057.1 375485535 374392548 373510475 373055878 371966476 371285172 371014595 370527115 369780540 369115601
3065.7 369115601 367980461 366870003 366387863 365568390 364989777 364433594 363891602 363310852 362370415
3074.4 362370415 361752243 361257248 360670052 359646492 358876381 358443108 357759972 357080917 356327629
3083.1 356327629 355642242 354719162 353955994 353339729 352589302 352004204 351392975 350867195 349986725 348851929
3092.7 348851929 348084793 347656097 347113457 346517181 345913315 344947205 344224777 343913803 343719902 342800484
3102.4 342800484 341529579 340928497 340249901 339718742 339305801 338437843 337246323 336084442 335348625
3111.1 335348625 334930687 334369469 333565865 333255959 332798958 331947136 331255989 330209045 329255333
3119.8 329255333 328625031 327785072 326685905 326083412 325775146 325107880 324228210 323072891 322380104
3128.4 322380104 321916084 321042671 320087433 319281712 318970985 318412304 317360229 316347103 315446625
3137.1 315446625 314968033 314340878 312940350 311783237 311305199 310874081 310454655 309713078 308643627
3145.8 308643627 307939243 307444363 306754513 306088123 305349751 304275227 303318691 302500648 301716919
3154.5 301716919 300926094 299986401 299238262 298691483 298180866 297489090 296457081 295366745 294601307
3163.1 294601307 293838997 293074970 292715969 292213364 291500778 290593643 289680367 288832092 287791958
3171.8 287791958 287049866 286470737 285877266 284911499 284144573 283834324 282936058 282290001 281762009 280847168
3181.5 280847168 280123997 279521618 278789463 277994919 277467632 276655388 275694923 274839249 273974800 273476734
3191.1 273476734 272827930 272017193 271400471 271009884 270539684 269677372 268988056 268253841 267193222
3199.8 267193222 266525974 266216755 265768642 265122719 264303608 263821659 263477154 262726955 262243347 261902599
3209.4 261902599 261092930 260170174 259611874 259112511 258262939 257828159 257676067 256884480 256150436 255698090
3219.1 255698090 254935989 254254818 253409348 252930603 253216953 252601357 251543236 251183949 251055775
3227.8 251055775 250856533 250349197 249502850 248846607 248499889 247812977 247316818 247168903 246180706 244767380
3237.4 244767380 244390602 244522228 243763580 243075581 242786674 242319527 242102966 241652336 241009922 240338650
3247 240338650 239579735 239192924 239023113 238738155 238329048 237982388 237405033 236545410 236187820 236265526
3256.7 236265526 235630569 234631729 234174347 234033833 234152756 233708286 233151112 233319168 232872963 231995010
3266.3 231995010 231645927 231513023 231401749 231091385 230330849 229683247 229191513 228574715 228312321 228136158
3276 228136158 227759438 227444649 227257900 226765385 226142559 225849857 225426941 225187912 225176220 224814224
3285.6 224814224 224181442 223991375 224093266 223589554 223416004 223461361 222585030 221651154 221746082 222023106
3295.3 222023106 221669350 221515236 221169720 220530834 220271015 220099316 219918499 219457340 218918476 218658924
3304.9 218658924 218450565 218405018 218557014 218142567 217280178 216683617 216329422 216259480 215961189 215364666
3314.6 215364666 214566040 214125595 214523430 214471340 213541527 212452850 212341576 212504406 212012501 211442986
3324.2 211442986 210676327 210212307 209518757 208943653 209018536 208342533 207655354 207554703 207188740 206427364
3333.8 206427364 206041870 205814705 205205822 204607277 203958664 203476486 203182011 202893944 202151318 201441917
3343.5 201441917 201140137 200513973 200286694 199931316 199389877 199225922 199072514 199260082 198963814 198289108
3353.1 198289108 197747879 197375946 197378540 197438030 197486935 196964092 196277161 196021786 195817299 195421696
3362.8 195421696 194975014 195016651 195126152 194920616 194502029 193887424 193625526 193809948 193878155 193755054
3372.4 193755054 193769493 193774757 193337631 192806625 192720871 192354469 191919060 191886597 191594601 191506157 191491375
3383 191491375 191382256 191401749 191010571 190797100 191143684 191530247 191338043 190698147 190630989 191048393
3392.7 191048393 190897980 190326614 190319290 190547562 190289230 189962559 189888611 189793892 189787617 190193729 190601063
3403.3 190601063 190509491 190091572 189866295 190005093 190314426 190502148 190250549 190022697 190468960 190914516
3412.9 190914516 190785007 190759506 190833130 190930309 191154613 190905304 190810204 191340084 191706047 191917133
3422.6 191917133 192182503 192634277 193260269 193207073 192735310 193042965 193499222 193608799 193896637 194273415
3432.2 194273415 194507141 194843998 195408401 195679512 196048241 196658077 196971703 197135601 197340946 197672119
3441.8 197672119 197834091 198223743 198394032 198438129 199378090 199857445 200056973 200819550 201415920 201662579
3451.5 201662579 202189751 202844963 202721100 202996426 204073524 205114288 205499897 205442028 206151447
3460.2 206151447 207043209 207593651 207957954 208595257 209356518 209911957 210732651 211448116 212194538 212748280
3469.8 212748280 213226604 213911133 214528542 215028248 215405388 216658993 217625027 218039818 219008732
3478.5 219008732 219719601 220290279 220966244 221348133 221701603 222818527 223658810 224239254 225573425
3487.2 225573425 226302681 226854992 227500553 228091869 228988953 229696140 230723572 231916771 232705765
3495.8 232705765 233273659 234445667 235585880 236014080 236919079 238055172 238697929 239263554 240144043
3504.5 240144043 241311054 242252064 242695999 243931427 245291443 245524902 246554909 247784061 248928795
3513.2 248928795 250038662 250832291 251707954 252206383 253358879 254494419 255000629 255993156 257459908
3521.9 257459908 258825321 259665661 260802975 261839828 262709160 263559914 264712276 266220455 267730389
3530.6 267730389 268884621 269324532 270651531 272014713 273524914 275135536 275677624 276602955 277242622
3539.2 277242622 278737984 280464745 281654968 282869797 284078121 286323261 287683544 288888149
3547 288888149 289700584 290825386 292491570 293888378 295984344 296502056 298271904 300528507 301651058
3555.6 301651058 303083954 303995552 306092091 307925529 309136181 310445766 312490063 314183388
3563.4 314183388 314789925 317964706 320146904 321750603 323350716 323541336 326197624 328025131 329281769
3572 329281769 330881195 332785378 334448433 336413879 338564682 339304123 341921349 344728928 346370201
3580.7 346370201 347993736 349894485 352050743 353573952 357306519 360199127 361390915 363832054
3588.4 363832054 363519516 365307121 368016930 371095161 372945938 374063568 377823029 378760109 380972748
3597.1 380972748 384428711 385560837 388469009 390358734 391989708 394757347 396884232 399472275
3604.8 399472275 402549019 405775452 406630669 409608345 411346779 411241570 417061501 420129623 420728836
3613.5 420728836 425004120 424879913 427622528 432059517 433875046 436309433 437948837 440130196
3621.2 440130196 443283424 446130219 448538628 451864967 454609642 456937675 463635139 468194199
3628.9 468194199 461862679 463261108 467510643 473459358 476686363 476530800 479261513 483115501
3636.6 483115501 486463852 488487930 490549774 493393898 497021294 499874306 501099625 503633995
3644.4 503633995 507387466 512621803 513488350 511874428 517345428 520623322 521859894 521184502 524930191
3653 524930191 529371719 533137970 538963776 534980621 535988007 541236076 543586502 545960541 546764374
3661.7 546764374 548856201 550833626 553057022 555546646 556517868 560406456 563420792 565319710
3669.4 565319710 567035675 561294174 562320976 569154396 578516922 582168884 568906250 568108711
3677.1 568108711 574277611 580055656 579248009 579554863 581958618 583318596 584895172 585687714 585857468
3685.8 585857468 589296989 596860275 592540970 588275528 595183258 590980072 590404587 595597343
3693.5 595597343 596568413 597942200 598915901 598882332 599334106 599617004 602581978 606169243 602895966
3702.2 602895966 600229607 604090576 606554146 606371918 605925064 608122177 612120857 606659126 609870949
3710.9 609870949 616524696 605542831 607355843 611829147 612382240 612191772 613389473 615414238
3718.6 615414238 613469124 613345184 618144875 616467361 612140656 616736679 619190216 618944778 616646156
3727.3 616646156 615701523 618301544 618992348 624065018 623365479 615988235 623848686 627794685 620637550
3736 620637550 619017868 620250511 620200424 621458244 624372063 621590080 623331223 633372993 627788239
3744.7 627788239 612486153 619953308 625616608 632410011 631016731 619404526 629351387 627822609
3752.4 627822609 619719124 624199028 627674370 631188164 627052574 627645073 633172035 627676697
3760.1 627676697 625651665 629219742 630526123 630123787 632958260 632358017 627849159 629862442 634604378
3768.8 634604378 635702438 628130417 629520111 632219467 631752510 632638893 632398605 633027649 633895340
3777.4 633895340 636987343 637910461 630208015 631086617 633113480 634676895 637418289 634881668 633780174
3786.1 633780174 635203362 635271606 634965630 634653778 634774971 635128632 635974884 635694809 636275368 639242706
3795.8 639242706 636927071 633427162 634928970 638172607 643854218 639871979 629934807 632645569
3803.5 632645569 634495506 638172913 644194717 637512245 632387009 635906410 637639656 637891464
3811.2 637891464 638253365 638128166 639272346 644810715 645091248 631736069 634852600 639885712 643235321
3819.9 643235321 646868210 635490112 634031906 637148666 638304710 640161057 640103073 637529221
3827.6 637529221 638177567 639900360 642472534 644248734 636943893 637381287 644394684 641452942 639549332
3836.3 639549332 646234055 640860901 635703697 641331024 637805710 636864395 642450027 641354446
3844 641354446 637814026 639388390 640237579 639876938 641130447 640178070 641219330 646372757 643799438
3852.7 643799438 648719406 638681107 633045540 640658951 640932007 638791847 640159302 641774826
3860.4 641774826 643760147 639418831 639210663 645498505 640932541 634935265 637998314 642291260
3868.1 642291260 648497696 644970398 635745392 636941032 641946869 647388458 639566116 637438965
3875.8 637438965 639920540 639689026 642358551 647026520 643720551 636329689 640024567 641561432
3883.5 641561432 642907486 648008804 637135925 636418533 639870605 640332489 644184113 645287094
3891.2 645287094 639440193 638972473 641467209 640261230 640178223 641187973 643479309 645708160 637557297
3899.9 637557297 640208969 642466049 638579559 642561722 640863800 639214172 639072838 639098206 641051025
3908.6 641051025 641000137 640142822 639690437 640432281 641239777 641102753 641181259 643186340 642364426 638492088
3918.2 638492088 640788879 641594315 638573418 639080772 640387497 641665497 640036850 637584152 638903732
3926.9 638903732 640280838 640750046 640238495 640641708 643098450 641573181 638826866 639458542 639639359
3935.6 639639359 639241333 639271851 639124565 638921661 639214630 640731735 641791458 638891869 637458000
3944.3 637458000 638530273 639232788 640421524 639401665 639261055 639880447 638130913 639009018 639207535
3953 639207535 638401413 638643188 638927078 639687843 639460449 639540520 639091606 639036331 639580650 638305168
3962.6 638305168 638167877 638724289 639013481 639393654 639238548 639161491 639116974 638718033 638729591 638499489
3972.2 638499489 637912674 638562393 638926086 639100647 639537048 639334526 639237671 639366112 639314003 638892136
3981.9 638892136 639268913 639316940 638925095 639041023 638879890 638882599 638552551 638866653 639020844 638634453
3991.5 638634453 639033318 639253960 639444122 638878708 638603554 639159126 639713020 639757843 639205551
4000.2 639205551
##END=$$ End of the data block
