##TITLE=$$ Begin of the data block
##JCAMP-DX=5.00 $$ ACD/SpecManager v 10.08
##SPECTROMETER/DATA SYSTEM=Varian
##DATE=14 Jan 2013 09:53:06
##DATA TYPE=INFRARED SPECTRUM
##DATA CLASS=XYDATA
##ORIGIN=
##OWNER=
##NPOINTS=3735
##FIRSTX=399.26403809
##LASTX=4000.35498047
##MAXX=4000.35498047
##MINX=399.26403809
##MAXY=72.88586426
##MINY=23.08010483
##XFACTOR=1.0000000000
##YFACTOR=0.000000100000000
##FIRSTY=46.85516739
##DELTAX=0.96440572
##XUNITS=1/CM
##YUNITS=TRANSMITTANCE
##XYDATA=(X++(Y..Y))
399.3D68551674j651497j4481163o466637r239273p25097O745109J228447j256447
$$ 468551674 466900177 452419014 445952377 436713104 435988007 442733116 443961563 442705116
407D42705116j622123K614021L062057r69543K52457L849639J766282m606095m705772
$$ 442705116 441082993 443697014 446759071 445789528 446041985 449891624 451657906 447051811 442346039
415.7D42346039k54555J634026o61049j1720009j260986Q544654N737954L64685j062126
$$ 442346039 442091484 443725510 443064461 431344452 430083466 438628120 444366074 444730759 443668633
424.3D43668633J243324k384339m928665L125344Q67958l162003k20146j869202K001267
$$ 443668633 444911957 442527618 437598953 440724297 441592255 438430252 438210106 436340904 438342171
433D38342171N824089J651039m994850m523812J398735M74244m604798k194748L828965
$$ 438342171 444166260 445817299 440822449 436298637 437697372 438171616 433566818 431372070 435201035
441.7D35201035J372566L074074O142082K242851j855812j001244J030o487426j278344
$$ 435201035 436573601 439647675 445789757 448032608 446176796 445175552 445176582 438689156 437410812
450.4D37410812L565483K295952J613922l771934j614113q63037J130905J757813j569481
$$ 437410812 440976295 443272247 444886169 441114235 439500122 438637085 439767990 441525803 439956322
459.1D39956322j779442l869972k25983j769676K042541M954186N63202M03824l041497
$$ 439956322 438176880 434306908 434080925 432311249 434353790 439307976 439871178 440275002 437233505
467.7D37233505l355789j810799K289620L464126m266204o450768j532478J080360
$$ 437233505 433877716 432066917 434356537 437820663 433554459 427103691 425571213 426651573
475.5D26651573j017036K56119j67008j309128K596245L763313K833786k832183n354920
$$ 426651573 425634537 425890656 425723648 424414520 427010765 430774078 433607864 430775681 425420761
484.1D25420761m328651m474678m78402L739701M169807K43874j262818j292457l097077
$$ 425420761 421092110 416617432 416139030 419878731 424048538 424292412 423029594 421737137 418640060
492.8D18640060k521667L18642J620330k479667k422943K512245K561798Q35762K206535
$$ 418640060 416118393 416437035 418057365 415577698 413154755 415667000 418228798 419064560 421271095
501.5D21271095M73328l927956q09440K03590o73141k117424l218613M5395J115227
$$ 421271095 421744423 417816467 417007027 417210617 416537476 414420052 411201439 411246834 412362061
510.2D12362061J366729O70700k00653M06266k281495j747169O82907P41692q26111
$$ 412362061 413728790 414399490 414198837 414605103 412323608 410576439 411259346 412001038 411174927
518.9D11174927r78241P40280j964684n3329K480507q34351j206894j861152j033974
$$ 411174927 410196686 410936966 408972282 408918953 411399460 410565109 409358215 407497063 406463089
527.5D06463089j22910l95088Q66661j402473k519570P35054K007981R6664o55212
$$ 406463089 406340179 405945091 406811752 405409279 402889709 403624763 405632744 405729408 405074196
536.2D05074196M34227K19765j318436k312775k172584l41072J443977N55229J045227
$$ 405074196 405508423 405728188 404409752 402096977 399924393 399583321 401027298 401582527 402627754
544.9D02627754R00154j638679j177826j525154j635399j114616j137658l54347j183243
$$ 402627754 403527908 401889229 400711403 399186249 397550850 396436234 395298576 394944229 393760986
553.6C93760986l84559J002617L24897j208954K23465J562806j063614j157875q28019
$$ 393760986 393376427 394379044 394703941 393494987 393718452 395281258 394217644 393059769 392231750
562.3C92231750L8567J92452j973343J14212K765312K433128O70052J34239p35474
$$ 392231750 392270317 392462769 390489426 390603638 393368950 395802078 396472130 396606369 395870895
570.9C95870895l128128j822853m86831l83225L62473J050872N63965l38974J622086
$$ 395870895 392742767 390919914 390433083 390049858 390412331 391463203 392027168 391688194 393310280
579.6C93310280J667709j134987k40326R0981j383514j535416m17900j297M11606K431869
$$ 393310280 394977989 393843002 393602676 393693657 392310143 390774727 390356827 390355530 390767136 393199005
589.3C93199005J897011L82385O12908Q57963J087341j394805k582207j328278j076317
$$ 393199005 395096016 395478401 396091309 396949272 398036613 396641808 394059601 392731323 391655006
597.9C91655006L58124J392975L54691o66008O37817J412773m92248j871643j717034
$$ 391655006 392013130 393406105 393760796 393094788 393732605 395145378 394653130 392781487 391064453
606.6C91064453j508140k184906j128159L65562m16832j37558J612893J122322o70815
$$ 391064453 389556313 387371407 386243248 386608810 386191978 386054420 387667313 388789635 388118820
615.3C88118820N15022R0409j712837j861382j746330O45981J214943P43942J652221
$$ 388118820 388633842 388724251 387011414 385150032 383403702 384049683 385264626 386008568 387660789
624C87660789K645188K354736J314888J486321m32778n4016O88896o87599R30786J998825
$$ 387660789 390305977 392660713 393975601 395461922 395029144 394975128 395664024 394976425 395907211 397906036
633.6C97906036K066193K029305K895889L318138J806335J724625J030731l24745p51076
$$ 397906036 399972229 402001534 404897423 408215561 410021896 411746521 412777252 412452507 411701431
642.3D11701431n91850L28636N02358J495361K601051K573700K197800J826782J130104
$$ 411701431 411109581 411438217 411940575 413435936 416036987 418610687 420808487 422635269 423765373
651D23765373l34396o49834j561012j805115j41563j49155J025353K542495J552658
$$ 423765373 423430977 422781143 421220131 419415016 419273453 419124298 420149651 422692146 424244804
659.7D24244804N455m78630p45124j607361j528893j644592j23291K973862L862190
$$ 424244804 424250259 423771629 423026505 421419144 419890251 418245659 418122368 421096230 424958420
668.3D24958420j065445P7362L98445J155090J451264J67885q13599o00243k51960
$$ 424958420 423892975 423970337 424368782 425523872 426975136 427143021 426329422 425729179 425477219
677D25477219M45518J379280K019882L007546L109779J497002J540184J445427J44844
$$ 425477219 425922737 427302017 429321899 432329445 435439224 436936226 438476410 439921837 440066681
685.7D40066681K50358o99539l46985K44370P7934J382027J418762K063713K038117
$$ 440066681 440317039 439617500 439270515 439514885 439592819 440974846 442393608 444457321 446495438
694.4D46495438J103401J033973K57874m29954j312142j362381m55894Q22029K085380
$$ 446495438 447598839 448632812 448890686 448460732 447148590 445786209 445330315 446152344 448237724
703.1D48237724K553330J691742J130180J818581P88612j43166r25903j364937q5411
$$ 448237724 450791054 452482796 453612976 455431557 456220169 456077003 455151100 453786163 453700752
711.7D53700752R33304J156921J290436K559815J941871J332779J846772L44581j354332
$$ 453700752 454634056 455790977 457081413 459641228 461583099 462915878 464762650 465107231 463752899
720.4D63752899k005691j87912K96363J04180J729812K393837K303544J690139J946144
$$ 463752899 461747208 461559296 461855659 461959839 463689651 466083488 468387032 470077171 472023315
729.1D72023315J580468K93884q08640p94410N11169L8262J57547J442871K241516
$$ 472023315 473603783 473897667 473089027 472294617 472805786 472844048 473001595 474444466 476685982
737.8D76685982J961593R55658O14930N83534R4948r41430n13382k4223L61214Q37707
$$ 476685982 478647575 479603233 480218163 480801697 480896645 479955215 479441833 479417610 479778824 480616531
747.4D80616531P54052R96322J953049K763252J248055Q12683O04324j39084m31862
$$ 480616531 481370583 482366905 484319954 487083206 488331261 489143944 489748268 489609184 489177322
756.1D89177322o32095J077957Q64296J527252K603455K131805K733612J812401N21546
$$ 489177322 488545227 489623184 490487480 492014732 494618187 496749992 499483604 501296005 501817551
764.8E01817551q29354p35244l25776l80706j4878J86997R42611O89164J255417J288681
$$ 501817551 500988197 500252953 499927177 499546471 499531593 499718590 500661201 501350365 502605782 503894463
774.4E03894463M64172j053505k124901q33473p31201j35269L66554J100998J667824
$$ 503894463 504358635 503305130 501180229 500346756 499615555 499480286 499846840 500947838 502615662
783.1E02615662J529312J852226P10945R35555l8567j201668p03392o98013k27051
$$ 502615662 504144974 505997200 506708145 507643700 507605133 506403465 505700073 505002060 504775009
791.8E04775009r7809Q72536J394348J692658K005653N59845j306267j975059j990700
$$ 504775009 504677200 505549736 506944084 508636742 510642395 511202240 509895973 507920914 505930214
800.5E05930214k239494j672402k013435k106705j278076j22185N61829n37567j144486
$$ 505930214 503690720 502018318 500004883 497898178 496620102 496497917 497059746 496522179 495377693
809.1D95377693j333732k442360l910675l236084k285805j886673r39255k62794P54242
$$ 495377693 494043961 491601601 487690926 484454842 482169037 480282364 479343109 479080315 479834557
817.8D79834557Q13636J380883J322097K08702M49219K68173M48571J186332K209397
$$ 479834557 480648193 482029076 483351173 483559875 484009094 484277267 484725838 485912170 488121567
826.5D88121567K264099K959289M451180M244118M937019M752846L071213J595420
$$ 488121567 490385666 493344955 497796135 502040253 506977272 511730118 514801331 516396751
834.2E16396751J632882J638412J418800J872025J515198K700348L011283L560982
$$ 516396751 518029633 519668045 521086845 522958870 524474068 527174416 530185699 533746681
841.9E33746681K436257R60273J042939q74901P14340J503372J339684L58352K85225
$$ 533746681 536182938 537143211 538186150 537311249 538025589 539528961 540868645 541226997 541512222
850.6E41512222K737465K248497L079567J978378J262055J394615J174965J396141
$$ 541512222 544249687 546498184 549577751 551556129 552818184 554212799 555387764 556783905
858.3E56783905K10228J091270r0599J117478K441139K383156K205009j29738q9149
$$ 556783905 556994133 558085403 557994804 559112282 561553421 563936577 566141586 566011848 565922699
867E65922699j316376m61960j909790k874717p75109k096710o55937j14288j91384
$$ 565922699 564606323 564144363 562234573 559359856 558584747 556488037 555832100 555717812 555526428
875.7E55526428q57277j738243o87218o83631j123734k440987j708259j106224r99146
$$ 555526428 554669151 552930908 552243690 551560059 550436325 547995338 546287079 545180855 544181709
884.4E44181709m15764L49617M33159o68983o7139n12695o88019j220398j276817r40552
$$ 544181709 543765945 544115562 544548721 543879738 543812599 543299904 542611885 541391487 540114670 539174118
894E39174118j312294K93312Q49419J039695J75744J60446k0943j550102j506462j859360
$$ 539174118 537861824 538155136 539004555 540044250 540219994 540380440 540359497 538809395 537302933 535443573
903.7E35443573k40211J536216K753411K924614L084487M223366L020211J497573k00042
$$ 535443573 535203362 536739578 539492989 542417603 545502090 549725456 552745667 554243240 554043198
912.3E54043198J78947p94220k125702j873436k547226k045059k552109j709671j720504
$$ 554043198 554222145 553427925 551302223 549428787 546881561 544836502 542284393 540574722 538854218
921E38854218k334633k142907k905654l003502m471703n132522m995308l750458k487679
$$ 538854218 536519585 534376678 531471024 528467522 523995819 518863297 513867989 510117531 507629852
929.7E07629852k323227j717682j362686p93419j695823j911316j902504k396507k210808
$$ 507629852 505306625 503588943 502226257 501432838 499737015 497825699 495923195 493526688 491315880
938.4D91315880k179566j190338r54094p54509r24263j98669N22003q01353n18151
$$ 491315880 489136314 487945976 486991882 486237373 485313110 485114441 485636444 484835091 484316940
947.1D84316940q20656p54928J0071J49421J30730o78520j12915J95389l78342r53560
$$ 484316940 483496284 482741356 482751427 482900848 483031578 482353058 482240143 482435532 482057190 481103630
956.7D81103630j479607k116584k520371k701912l027954k569389k522736j973686
$$ 481103630 479624023 477507439 474987068 472285156 469257202 466687813 464165077 462191391
964.4D62191391j298752r97200r03168j377754j426048k447739k737159k908249l810082
$$ 462191391 460892639 459895439 458992271 457614517 456188469 453740730 451003571 448095322 444285240
973.1D44285240l371811l352852l539123l618660l664589l079338l276634m102517
$$ 444285240 440913429 437560577 434021454 430402794 426738205 423658867 420382233 416279716
980.8D16279716m743309n211448o032257o513481n940705n927582m866523l709984
$$ 416279716 411536407 406324959 400292702 393779221 387838516 381910934 377044411 373334427
988.5C73334427l935433l420829l003998k950516l679314l074569k406998l406181
$$ 373334427 369398994 365978165 362974167 360023651 356344337 353269768 350862770 347456589
996.2C47456589l839836l412247k242928k651863k362938j523437j872788k351875
$$ 347456589 343616753 340204506 337961578 335309715 332946777 331423340 329550552 327198677
1004C27198677k606850j953811k305756k359562k301445k057590j785260j470947j173420
$$ 327198677 324591827 322638016 320332260 317972698 315671253 313613663 311828403 310357456 309184036
1012.6C09184036j937771j062126j699276k237892k019939k531338k587643l245201
$$ 309184036 307246265 306184139 304484863 302246971 300227032 297695694 295108051 291862850
1020.3B91862850k411728k016506j424332j574306j320229r02195j990013j233234
$$ 291862850 289451122 287434616 286010284 284435978 283115749 282213554 280223541 278990307
1028.1B78990307j917458j431770j407776j774502m20475N6782O86855L8853R86176
$$ 278990307 277072849 275641079 274233303 272458801 272038326 272095108 272781963 272820816 273806992
1036.7B73806992J907062K486878J922187J006985J563721J279945J261044m75560
$$ 273806992 275714054 278200932 280123119 281130104 282693825 283973770 285234814 284759254
1044.5B84759254l56578K43377L31002l72105j754265R9735r85317k046089k538872
$$ 284759254 284402676 284646053 284977055 284604950 282850685 282950420 281965103 279919014 277380142
1053.1B77380142j975460q56800k288494j131325k65655O79493K76069J255074K704925
$$ 277380142 275404682 274547882 272259388 271128063 270862408 271541901 271817970 273073044 275777969
1061.8B75777969J832810K337513J718254K013073J675834K015667K159844J208725
$$ 275777969 277610779 279948292 281666546 283679619 285355453 287371120 289530964 290739689
1069.5B90739689J045074L89977J265697J496048J119995k33936k17743L45345J54514
$$ 290739689 291784763 292174740 293440437 294936485 296056480 295822544 295604801 295950146 296104660
1078.2B96104660J66187o40163J191025J185703J147156J458778J120949J065464M31709
$$ 296104660 296270847 295630684 296821709 298007412 299154568 300613346 301734295 302799759 303231468
1086.9C03231468J802006P28741R83677J140499R93271J451950N10234K484875J964970
$$ 303231468 305033474 305762215 306745892 307886391 308879662 310331612 310841846 313326721 315291691
1095.6C15291691J412926R74350P43293J103287O31466J700706R0561P53212J553612
$$ 315291691 316704617 317678967 318422260 319525547 320157013 321857719 321948280 322701492 324255104
1104.2C24255104J602631K265930Q04252J285706J097336Q57925j00174o00547O72607
$$ 324255104 325857735 328123665 328927917 330213623 331310959 332168884 332068710 331468163 332140770
1112.9C32140770O86302J327667J730042R76524Q1253R50318N46760o34079l60756
$$ 332140770 332827072 334154739 335884781 336861305 336942558 337892876 338439636 337805557 337444801
1121.6C37444801k18315j22604j014748l28064N44930J481399K194519K001267K739334
$$ 337444801 337226486 337103882 336089134 335761070 336306000 337787399 339981918 341983185 344722519
1130.3C44722519K485237K447624J767960J764831J865120J626435K293510J904373
$$ 344722519 347207756 349655380 351423340 353188171 355053291 356679726 358973236 360877609
1138C60877609K313385K761841K305412J501503J654282J740761J122169O34537k52838
$$ 360877609 363190994 365952835 368258247 369759750 371414032 373154793 374276962 374911499 374658661
1146.7C74658661k03476m21372K06070P61795L99895O68144k46696l07198L0556j57814
$$ 374658661 374455185 374033813 374239883 375001678 375401573 376069717 375823021 375515823 375546379 375388565
1156.3C75388565j155281j977196j524620j414680k76566j55754L67813J517754J508369
$$ 375388565 374233284 372256088 370731468 369316788 369040222 368884468 369252281 370770035 372278404
1165C72278404K335778K473258K249108J961899J884880K054138K563400L157997L277283
$$ 372278404 374614182 377087440 379336548 381298447 383183327 385237465 387800865 390958862 394236145
1173.7C94236145L855133M156876L785019L474235L003578K149086K160569K080688
$$ 394236145 398091278 402248154 406033173 409507408 412510986 414660072 416820641 418901329
1181.4D18901329K090912J880989J463242K011528K500343K459412J633415J299515
$$ 418901329 420992241 422873230 424336472 426348000 428848343 431307755 432941170 434240685
1189.1D34240685N34477O6223J28136n50614p72018r91669m42123j90735m42887k53563
$$ 434240685 434775162 434841385 434969521 434418907 433646889 432655220 432213097 432022362 431579475 431325912
1198.8D31325912l92494o52847j008682j159859j726074j898995j660957j262398n36880
$$ 431325912 430933418 430280571 429271889 428112030 426385956 424486961 422826004 421563606 421026726
1207.4D21026726m79927O8702L31688J97296K55547m25339n82008o11305j036568j333733
$$ 421026726 420546799 420615501 420947189 421144485 421400032 420974693 420392685 419781380 418744812 417411079
1217.1D17411079q57048N7564L72009O8589m25034k02713o15463j092911p96165j283532
$$ 417411079 416554031 416611595 416983604 417052193 416627159 416424446 415808983 414716072 413919907 412636375
1226.7D12636375j459961j221923j048317o21682n05905l55987j43395n27725o87637
$$ 412636375 411176414 409954491 408906174 408284492 407778587 407422600 407279205 406751480 406063843
1235.4D06063843l3913l18222n58815n75790j136093n36957P5149K19002L2730k22893
$$ 406063843 406029930 405711708 405152893 404577103 403441010 402904053 402979202 403198204 403230934 403008041
1245D03008041k9525l26691p30591p19261l47900m41208n53589l90434l85056R1362
$$ 403008041 402978516 402651825 401921234 401201973 400854073 400412865 399859276 399468842 399083786 399175148
1254.7C99175148L74069M25339K19841j01318j67733k09198l32183k11831J47667M66652
$$ 399175148 399549217 399974556 400194397 400093079 399925346 399716148 399383965 399172134 399319801 399786453
1264.3C99786453R65576Q58994Q75206J090012J061592Q87642N15022O12221N97076
$$ 399786453 400752029 401611023 402486229 403576241 404637833 405525475 406040497 406652718 407249794
1273D07249794O72455N66749J119004J426429J193810J824226J502495J326981R72938
$$ 407249794 407922249 408488998 409608002 411034431 412228241 414052467 415554962 416881943 417854881
1281.7D17854881Q34961J311302J309624J553269J247749J296272J555443J764793
$$ 417854881 418689842 420001144 421310768 422864037 424111786 425408058 426963501 428728294
1289.4D28728294J744919R54819N21736R94568J167908K73323j21041J00441M48189
$$ 428728294 430473213 431428032 431949768 432944336 434112244 434385567 434264526 434364967 434813156
1298.1D34813156M57764Q04405J322937J184196M81797n11437k26822m72259j000443
$$ 434813156 435270920 436075325 437398262 438582458 439064255 438552818 438325996 437853737 436853294
1306.8D36853294q02993p06368p29980o08368k8839l14064k28997k6664l95661k64892
$$ 436853294 436050301 435343933 434613953 434005585 433976746 433662682 433433685 433407021 433011360 432746468
1316.4D32746468k60659J25885L8910O3095M03557N57938J092453J319465J287766
$$ 432746468 432485809 432611694 432650604 432713699 433117256 433675194 434767647 436087112 437374878
1325.1D37374878R35326P28225K18888P705m96750j239013r86023p99027n60608j51443
$$ 437374878 438310204 439038429 439257317 439265022 438768272 437529259 436543236 435744209 435183601 435032158
1334.7D35032158P50198R06143M25873M37508k06375m2877J44004P17392O42243J09978
$$ 435032158 435782356 436688499 437114372 437551880 437345505 437302628 437446632 438164024 438806267 438916245
1344.4D38916245N96504P68470J283303J295318J187668L03231n08042l05633l82386
$$ 438916245 439512749 440281219 441564522 442859840 444047508 444350739 443842697 443537064 443154678
1353.1D43154678n31997j061669n81207j71356J41678L18069L70674K43874m72031
$$ 443154678 442622681 441561012 440979805 440808449 440950127 441268196 441638870 441882744 441410713
1361.7D41410713o141j454430j046181k70958o42700m91753p74803n36384l27912M85611
$$ 441410713 441404572 439950142 438903961 438633003 437990303 437498550 436723747 436187363 435859451 436345062
1371.4D36345062N47867O80771M56352r99756k89344o64025l03459k30293k69203j51749
$$ 436345062 436892929 437573700 438030052 437030296 436740952 436076927 435773468 435543175 435273972 435122223
1381D35122223m85916q4458j257438j285172k46544o7863k820091k668763j036491
$$ 435122223 434636307 434551849 433294411 432009239 431762695 431694832 428874741 426205978 425169487
1389.7D25169487j971207j801757j845932p76101j315002l557701j800232j701355
$$ 425169487 423198280 421396523 419550591 418774490 417459488 413901787 412101555 410400200
1397.4D10400200j242371l936004l828621j749840k661629k079315j292419k013436
$$ 410400200 409157829 405221825 401393204 399643364 396981735 394902420 393610001 391596565
1405.1C91596565k664871j525421j573906k040100j576767j801720j668854k170715
$$ 391596565 388931694 387406273 385832367 383792267 382215500 380413780 378744926 376574211
1412.8C76574211j649132j016655j099777n95932m66614J012803j847878j415024O05126
$$ 376574211 374925079 373908424 372808647 372212715 371746101 372758904 370911026 369496002 370101128
1421.5C70101128p9003P10297j495667m654J019783L96271J586571J215782J685829
$$ 370101128 370022125 370732422 369236755 369232101 370251884 370648155 372234726 373450508 375136337
1430.2C75136337R69429J578675J394233J441613K698631K090950J520424O85425K754364
$$ 375136337 376105766 377684441 379078674 380520287 383218918 385309868 386830292 387515717 390270081
1438.9C90270081J894874J792374K761917J798363K060165J417732K104531J871414
$$ 390270081 392164955 393957329 396719246 398517609 400577774 401995506 404100037 405971451
1446.6D05971451J964073J210175J163330K489204J342239K230606J875306K600250
$$ 405971451 407935524 409145699 410309029 412798233 414140472 416371078 418246384 420846634
1454.3D20846634K719841J952782K717475j671066K612229J268844K322083J958923
$$ 420846634 423566475 425519257 428236732 426565666 429177895 430446739 432768822 434727745
1462D34727745J711655L666687J823311J440086J566696K820931K629737K148324L318939
$$ 434727745 436439400 440106087 441929398 443369484 444936180 447757111 450386848 452535172 455854111
1470.7D55854111K479057L277359K606735L525505L661614K122383J520615K345886
$$ 455854111 458333168 461610527 464217262 467742767 471404381 473526764 475047379 477393265
1478.4D77393265K253113J650924J858597J477013J930732J846276J153373J969834
$$ 477393265 479646378 481297302 483155899 484632912 486563644 488409920 489563293 491533127
1486.1D91533127J581154Q98895K412758J534920j985054r62296j51634n34859J26801
$$ 491533127 493114281 494013176 496425934 497960854 495975800 495013504 494861870 494327011 494453812
1494.8D94453812M43573m541245k68478k57874l140526n29403q98018j904411j401101
$$ 494453812 494897385 490356140 490087662 489829788 486689262 486159859 485261841 483357430 481956329
1503.5D81956329J194802J531830k552376l430100m84161P00416j267013K02522q50525
$$ 481956329 483151131 484682961 482130585 478700485 478216324 478916740 477649727 477852249 477001724
1512.2D77001724k214164k96212n49011K39716l50762l241119K49862K609368J681976
$$ 477001724 474787560 474491348 473942337 474182053 473831291 470590172 470840034 473449402 475131378
1520.8D75131378j035347j334724l98216K079086l01094l93601R50051k8153M11606
$$ 475131378 474096031 472761307 472363091 474442177 474141083 473747482 474697533 474669380 475080986
1529.5D75080986J062775J402816J465950J884003k240448R6665K46887N39322L224640
$$ 475080986 476143761 477546577 479012527 480896530 478656082 478752747 478999634 479538956 482763596
1538.2D82763596l62473m824524J152916J937409M96902J189613J234055k634964L45688
$$ 482763596 482401123 477576599 478729515 480666924 481163826 482353439 483587494 480952530 481298218
1546.9D81298218J79596J055641K02331k234458L86276R10034K189255k607270j345367
$$ 481298218 481477814 482533455 482735786 480501328 480887604 481797638 483986893 481379623 480034256
1555.6D80034256K530785M503212J769561j1011505l438911j548844O23436j206131
$$ 480034256 482565041 487068253 488837814 477826309 474387398 472838554 473461990 472255859
1563.3D72255859j209182k767182k837410j082649j854134N41535r599304m462319
$$ 472255859 471046677 468279495 465442085 464359436 462505302 463046837 453447533 448985214
1571D48985214k303962m090348l212242k716293l62892j3281365k059555l062630m777565
$$ 448985214 446681252 442590904 439378662 436662369 436299477 423018112 420958557 417895927 413118362
1579.7D13118362m306144o027794m270859o473503l922195n793496m773025m306679
$$ 413118362 408812218 402784424 398513565 392040062 388117867 382324371 377551346 373244667
1587.4C73244667n156059k857018n902328l311730n653457l570290m099007n324554
$$ 373244667 368088608 365231590 359329262 356017532 350364075 346793785 342694778 337370224
1595.1C37370224k937317n223923k114486m530487k161751l278885k934341j656609
$$ 337370224 334432907 329208984 327094498 322564011 320402260 317123375 314189034 312532425
1602.8C12532425m489479j584740l866157r13697k900295j429825j082325l119373
$$ 312532425 308042946 306458206 302592049 301678352 298778057 297348232 296265907 293146534
1610.5B93146534M77543k125797M45175k029553P50065J499081o800289J058063j153335
$$ 293146534 293624077 291498280 291943455 289913902 290663967 292163048 285362759 286420822 285267487
1619.2B85267487J356754j456070J366730J451873k272529Q39920k26784K779579j065998
$$ 285267487 286624241 285168171 286534901 287986774 285714245 286554165 286327381 289106960 288040962
1627.9B88040962M18434K34928P18518J270160L5248L251381J518650L130589k123127
$$ 288040962 288459396 288694324 289412842 290683002 290718250 293969631 295488281 298618870 296495743
1636.6B96495743K153148J173687J146794K289123m88128K615146O90842K884712L095970
$$ 296495743 298648891 299822578 300969372 303258495 302770367 305385513 306076355 308961067 312057037
1645.3C12057037J327172M248256k060222K621975J411991L714828M076042K563591
$$ 312057037 313384209 317632465 315572243 318194218 319606209 323321037 327397079 329960670
1653C29960670k725067j555977L538628J827355L328094J907005K454338K699242K836304
$$ 329960670 327235603 325679626 329218254 331045609 334373703 336280708 338735046 341434288 344270592
1661.6C44270592M123153j96495L147278J922531K721138L464280L688583L801689
$$ 344270592 348393745 348197250 351344528 353267059 355988197 359452477 363141060 366942749
1669.4C66942749J711388N525245K215920L760185L991432L624649K478638K705574
$$ 366942749 368654137 374179382 376395302 380155487 384146919 387771568 390250206 392955780
1677.1C92955780M453468L290062N292931L079758M918594P838936P679214K698136
$$ 392955780 397409248 400699310 405992241 409071999 413990593 421829529 429508743 432206879
1684.8D32206879k077980N684623M835968L994561M187622L317947M602356M652519
$$ 432206879 430128899 435813522 440649490 444644051 448831673 452149620 456751976 461404495
1692.5D61404495N612984O336327P565460K442131M076156N954895P285576Q555985
$$ 461404495 467017479 473353806 480919266 483361397 487437553 493392448 500678024 509234009
1700.2E09234009p851258N539055N437813M727059M167518M261742K713241K205468
$$ 509234009 501382751 506921806 512359619 517086678 521254196 525515938 528229179 530434647
1707.9E30434647M291343K809143J239434J573181K190628L231430J404304Q92487
$$ 530434647 534725990 537535133 538774567 540347748 542538376 545769806 547174110 548066597
1715.6E48066597M541016M782524l929100R15336K850609J684342J500968R76830J78223
$$ 548066597 552607613 557390137 553461037 554376373 557226982 558911324 560412292 561389122 561567345
1724.3E61567345R04274J362228J215820K041169L513526J723099N570L598213M309044
$$ 561567345 562471619 563833847 565049667 567090836 570604362 572327461 572333031 575931244 580240288
1733E80240288m5204n468598J621437L166657J845779L812790K602768j479721M146461
$$ 580240288 580195084 574726486 576347923 579514580 581360359 585173149 587775917 586296196 590442657
1741.7E90442657M254456J886025J268234L261833L433800K768631L621406J188660
$$ 590442657 594697113 596583138 597851372 601113205 604547005 607315636 610937042 612125702
1749.4F12125702M648132L510132L32985M698334L690605L803863M435502J081199
$$ 612125702 616773834 620283966 620616951 625315285 629005890 632809753 637245255 638326454
1757.1F38326454J073151K169609K237549M347381J142731q04825L396073K722168
$$ 638326454 639399605 641569214 643806763 648154144 649296875 648492050 651888123 654610291
1764.8F54610291K175827K536850K845459j634751R24301M539643J408386j394577
$$ 654610291 656786118 659322968 662168427 660533676 661457977 665997620 667406006 666011429
1772.5F66011429l138733L710937L671952k77710K111664J341323J635666M03443j538086
$$ 666011429 662872696 666583633 670255585 669977875 672089539 673430862 675066528 675469971 673931885
1781.2F73931885O65817J756287K193374l40576k45361K052994K025146J121674J974411
$$ 673931885 674597702 676353989 678547363 678206787 677961426 680014420 682039566 683161240 685135651
1789.9F85135651J359558P99560j402588k349624K907638J554642l31345J093064K420196
$$ 685135651 686495209 687294769 685892181 683542557 686450195 688004837 687673492 688766556 691186752
1798.6F91186752J891632p86056J705475l11356o28128R77020K44675Q88443Q20694
$$ 691186752 693078384 692292328 693997803 693686447 693058319 694035339 694280014 695168457 695989151
1807.3F95989151Q97293J284790J927643m30222L15171J105346k79312N98908K3269
$$ 695989151 696886444 698171234 700098877 699668655 699983826 701089172 700809860 701408768 701432037
1815.9G01432037R20639k43301o5536J223068M24194J615524M82788J306458J732025
$$ 701432037 702352676 702109375 702043839 703266907 703691101 705306625 705789413 707095871 708827896
1824.6G08827896k364654r30863J435852K175598J344529l434983l60794K768479Q02078
$$ 708827896 706463242 705532379 706968231 709143829 710488358 707053375 706692581 709461060 710263138
1833.3G10263138N53894L74679J30005J64566r97162P67670J50452N63736P39746K024383
$$ 710263138 710817032 711191711 711321716 711486282 710489120 711256790 711407242 711970978 712710724 714735107
1842.9G14735107L050309m720307N01480K101136M28543o67801m80194N45730m07715
$$ 714735107 717785416 713065109 713566589 715667725 716096268 715428467 714948273 715494003 715086288
1851.6G15086288O06614J70898P06863J051178N78385Q78906o8359M02679m46701o08826
$$ 715086288 715692902 715863800 716570663 717621841 718200226 719079132 719010773 719413452 718966751 718357925
1861.3G18357925o81076m5700L92533M56390J923523Q38318J559143K823k229996r2010
$$ 718357925 717676849 717631149 718023682 718480072 720403595 721241913 722801056 722803879 720573883 720481873
1870.9G20481873L92532J71661o95495J13449k11640L52555P95593P92236J142655
$$ 720481873 720874405 721046066 720350571 720464020 720252380 720604935 721400528 722192764 723335419
1879.6G23335419J5793M66537n85709k92511j3504q64334l64456k42233J749115J218872
$$ 723335419 723351212 723817749 723232040 722939529 722926025 722061691 721697235 721455002 723204117 724422989
1889.2G24422989j171036K54669J137085K62909N82733j70974k050553r5672j82038
$$ 724422989 723251953 723506622 724643707 724906616 725489349 725318375 723267822 723172150 722990112
1897.9G22990112J3123N62668M54483J008301O89163R60388m09622n79376Q926l61862
$$ 722990112 723003235 723565903 724020386 725028687 725717850 726678238 726268616 725689240 725698166 725336304
1907.6G25336304m69666k02026p4616m54940J070556N99060P00760N22232J02768J728211
$$ 725336304 724866638 724664612 724589996 724135056 725205612 725804672 726505432 727027664 727130432 728858643
1917.2G28858643j907807k152939J86005K2430O67191j71051l63770Q53272J256409
$$ 728858643 726950836 724797897 724983902 725006332 725673523 725502472 725138702 725991974 727248383
1925.9G27248383J20849L39127n3025q53271o89545o44302J15051k98767R9106L57285
$$ 727248383 727369232 727708359 727655334 726802063 726112518 725468216 725583267 725284500 725383606 725740891
1935.5G25740891P87200O97709L7994M17404n38864M42352l00979k476807k16293R59625
$$ 725740891 726528091 727225800 727263794 727681198 727142334 727584686 727283707 724806900 724590607 725550232
1945.2G25550232L68881m55627O81991P34101M63714k17056q69980l79562o51703k42386
$$ 725550232 725919113 725463486 726145477 726879578 727343292 727126236 726256256 725876694 725224991 724982605
1954.8G24982605k58255p4005l891K31171N65185M51202O74439k72369l43705n57098
$$ 724982605 724724350 724650345 724646454 724877625 725442810 725894012 726568451 726296082 725952377 725395279
1964.5G25395279k82974J37710p68814o20346J73264Q94622M23279N53360J69373l85742
$$ 725395279 725112305 725250015 724481201 723860855 724034119 724928741 725352020 725905380 726074753 725689011
1974.1G25689011k90909n25055j22376r43908n15747q7510N112Q20618O50635O74972
$$ 725689011 725398102 724873047 724750671 723806763 723291016 723203506 723208618 724029236 724679871 725354843
1983.7G25354843J33820j5259p03049p18078n20096j046524J85318M82177j92108r6054
$$ 725354843 725488663 725473404 724770355 724052277 723532181 722485657 722670975 723153152 722961044 722864990
1993.4G22864990P93991N38178P7514J92185k81601o96793j303787n36880m86374l40882
$$ 722864990 723658981 724197159 724274673 724466858 724185257 723488464 722184677 721647797 721161423 720820541
2003G20820541N19333O51169P19910R0942M42734J9226m38309p87277j210251o16226
$$ 720820541 721339874 721991043 722710953 722801895 723244629 723263855 722825546 722038269 720828018 720211792
2012.7G20211792o47583j7548M33197O98243J90582K78931N39321k91290l61862j078110
$$ 720211792 719564209 719546661 719979858 720678101 720868683 721147614 721686935 721395645 721033783 719955673
2022.3G19955673l94058o92673j083679l4637J50756P81174M89121N91888K45590l34320
$$ 719955673 719561615 718868942 717785263 717750626 717901382 718682556 719171677 719763565 720009155 719674835
2032G19674835p67593q96988l86887j063995n23071k81983J06507O95037J006394P30362
$$ 719674835 718907242 718010254 717623367 716559372 716036301 715754318 715860825 716555862 717562256 718292618
2041.6G18292618l77960K38571m86984o17829p92312j270829o58340l88184P52335
$$ 718292618 717914658 718153229 717666245 717048416 716256104 714985275 714326935 713938751 714691086
2050.3G14691086N46493O27823M21524K68097M60816l40958n66254j598129j038589
$$ 714691086 715237579 715865402 716286926 716555023 717015839 716674881 716108627 714510498 713471909
2059G13471909l54844m1275J29700J03378J309586R56116K24151n47485m55246l15628
$$ 713471909 713117065 713075790 713205490 713308868 714618454 715574570 715798721 715251236 714795990 714480362
2068.6G14480362n26047n45044r67331j14517p706N77851P42492M91715P33414J05362
$$ 714480362 713954315 713409271 712441940 712327423 712319717 712897568 713640060 714131775 714865189 714970551
2078.2G14970551j33439j031112q35648p25097o77262k56653j22680N44738L98255
$$ 714970551 714837112 713806000 712970352 712245255 711567993 711311340 711188660 711733398 712131653
2086.9G12131653P82242M53109K44599m08402j028824n91659j060486m08554m70352
$$ 712131653 712913895 713367004 713611603 713203201 712174377 711582718 710522232 710113678 709643326
2095.6G09643326n3559N12085L49122N43518J73263L86276l94287n49316n01862p15790
$$ 709643326 709589767 710101852 710450974 710994492 711167755 711554031 711159744 710610428 710108566 709392776
2105.2G09392776o65664n45883J19629j47171O13327N89599J22528L2730j30844o0882
$$ 709392776 708727112 708181229 708300858 708153687 708767014 709356613 709479141 709511871 709381027 709320145
2114.9G09320145j014634p94372o83746j14136J6250q4152O28815M57611Q65555J34048
$$ 709320145 708305511 707511139 706827393 706713257 706729507 706645355 707274170 707731781 708597336 708731384
2124.5G08731384o2179l43933r64508o78635o56509K4032k27051R6970K60620P42493
$$ 708731384 708669205 708325272 707360764 706682129 706025620 706049652 705822601 705919571 706180191 706922684
2134.2G06922684J150055J05362J04217l47671m68598p03277n55802l60336m45633
$$ 706922684 708072739 708178101 708282318 707934647 707466049 706762772 706206970 705846634 705401001
2142.9G05401001M22592O77109J013489L43628J31530J94168k51236n25817r46961
$$ 705401001 705823593 706500702 707514191 707857819 707989349 708183517 707932281 707406464 706459503
2151.5G06459503n42755o25305L2883J97067L22113P26929M86755Q01620N1880j01318
$$ 706459503 705916748 705291443 705324326 705521393 705843506 706570435 707057190 707858810 707910690 707809372
2161.2G07809372n23377o91909k74735l65753j74561l8146P95440N65109O11420K52915
$$ 707809372 707285995 706594086 706319351 705953598 705779037 705740891 706536331 707101440 707712860 707965775
2170.8G07965775j33133L204q22983k60086l88336l74527j17416O07070Q45795l15780
$$ 707965775 707832642 707835846 707012863 706752777 706364441 705989914 705872498 706479568 707325363 707009583
2180.5G07009583N04074N01327K08511j94778m12826j27869l11051j7318m15421J86691
$$ 707009583 707513657 708014984 708223495 708028717 707615891 707488022 707176971 707159653 706744232 706930923
2190.1G06930923M15879O49338N94100o6528J85013m71420l58277k88391K1134j37406
$$ 706930923 707346802 707996140 708590240 708523712 708708725 708237305 707879028 707590637 707611771 707474365
2199.8G07474365l91388M03672L13949N60761L87725L65601j80893j16577k0294q82569
$$ 707474365 707082977 707486649 707800598 708361359 708749084 709114685 708933792 708817215 708796921 707914352
2209.4G07914352j35574k15607J57395L16849L72238N77240l8834M04358k670j94016
$$ 707914352 707778778 707563171 707720566 708037415 708409653 708986893 708948059 709352417 709349747 709155731
2219G09155731l44162m42276l94363k30637K83127P1030M37088L00598N41153J46103
$$ 709155731 708811569 708369293 707974930 707744293 708027420 708098450 708535538 708836136 709377289 709523392
2228.7G09523392j92795J38702m40674k80227n55954j10321j19477K62452Q58612o2866
$$ 709523392 709330597 709469299 709028625 708748398 708192444 708082123 707962646 708225098 709083710 709020844
2238.3G09020844J29852j19553J36948k1057n58930m24728k76337K15912L50876P67364
$$ 709020844 709150696 709031143 709168091 709147034 708588104 708163376 707887039 708102951 708453827 709221191
2248G09221191Q3771K40631L8529n46494J0376m60739q7738j46408J86920J76010j5869
$$ 709221191 709304962 709545593 709584122 709037628 709048004 708587265 708499527 708353119 708540039 708716049 708700180
2258.6G08700180N16739L3951L62091j11389k0295K41700k41776n77621p57752k670
$$ 708700180 709216919 709250870 709612961 709501572 709481277 709722977 709481201 708903580 708145828 708143158
2268.2G08143158O6528N25437K50702J71966J97144k45514J71356k95563m54941p75528
$$ 708143158 708209686 708735123 708985825 709157791 709354935 709109421 709280777 708985214 708530273 707754745
2277.9G07754745j11846M5318P324O97785j24817O6223m6234L31421J71280l02048
$$ 707754745 707642899 707688217 707695541 708393326 708268509 708334732 708288498 708619919 708791199 708489151
2287.5G08489151O1264n17883N8288m84543J04523Q16345M70429J035766O6605J49155
$$ 708489151 708550415 708032532 708090820 707606277 707710800 708527145 708997574 710033340 710099945 710249100
2297.2G10249100R536l51181k29492m69894k25754J35117O81686J42593Q34046J050186
$$ 710249100 710258636 709907455 709677963 709208069 708982315 709117432 709799118 709941711 710775757 711825943
2306.8G11825943L38516N56488k37426k63062L09219N73273m34265p89795N03464J089325
$$ 711825943 712164459 712720947 712483521 712220459 712529678 713102951 712668686 711878891 712382355 713471680
2316.4G13471680J412429R03016N70526J125183J108169k43911m97589K23541k97241
$$ 713471680 714884109 715787125 716357651 717482834 718591003 718347092 717849503 718073044 717775803
2325.1G17775803j25122L36837M68369P38754J160812L20130m24271M40827J29699
$$ 717775803 717650681 717987518 718455887 719194641 720355453 720675583 720251312 720692139 720821838
2333.8G20821838n89523M20609K02407k038421J28097K123871k27203m98963O00663
$$ 720821838 720232315 720652924 720855331 718816910 718945007 721068878 720841675 720342712 720943375
2342.5G20943375r461r46350j264419k243882k811966k672500K29645L279876K098923
$$ 720943375 720933914 719987564 718723145 716479263 713667297 710994797 711224442 714504318 716603241
2351.2G16603241J934586K310943J786118J642837L53317J577454j74408r92203p68051
$$ 716603241 718537827 720848770 722634888 724277725 724631042 726208496 726034088 725041885 724273834
2359.8G24273834l99780j77231k7695N63813p85523l36609k082519j866379j929703
$$ 724273834 723874054 723696823 723669128 724232941 723447418 723110809 721028290 719161911 717232208
2368.5G17232208k101822r07516j978073j249924j650696j608810p05719m09241j072845
$$ 717232208 715130386 714222870 712244797 710994873 709344177 707735367 707029648 706620407 705547562
2377.2G05547562j667023q88367j585083j506805j322098j119156o95190o90079M0894
$$ 705547562 703880539 702992172 701407089 699900284 698578186 697459030 696763840 696073761 696114655
2385.9F96114655j45188k9068j08032r6741Q545n76248p03278q23898k03018l77197
$$ 696114655 695969467 695940399 695832367 695735626 695744171 695167923 694464645 693640747 693437729 693060532
2395.5F93060532l29667R4605K48718M43039p2326J53045n24216p31430o45904q82340
$$ 693060532 692730865 692825470 693074188 693517227 693444901 693597946 693073730 692342300 691696396 690814056
2405.2F90814056l32641m24347k8229K9526L01132M42200R079k44217n92957m84848
$$ 690814056 690481415 690057068 690028839 690058365 690359497 690801697 690810776 690566559 689973602 689488754
2414.8F89488754q25271p63398o80389j85547J54953j61819K01263L93982L83072m45786
$$ 689488754 688663483 687900085 687219696 687034149 687189102 687027283 687228546 687622528 688005600 687559814
2424.5F87559814n48782o10886o54602l69110r26361l87878j09940J88065J22909M9668
$$ 687559814 687011032 686400146 685745544 685376434 684450073 684062195 683952255 684140320 684263229 684312897
2434.1F84312897r156q84094m03366l53165m02298o57501n04989j23978m74701N7983
$$ 684312897 684303741 683419647 683016281 682663116 682260818 681603317 681098328 680974350 680499649 680557632
2443.7F80557632j31759L05l4180K4185j38015j242905r02176l02048K02332l18222
$$ 680557632 680425873 680426178 680391998 680416183 680278168 679035263 678133087 677831039 678033371 677715149
2453.4F77715149n50537k87094j07804M80576j11923l61252o53153l95279l78265q84170
$$ 677715149 677164612 676877518 676769714 677250290 677138367 676777115 676123962 675728683 675350418 674466248
2463F74466248l71705n42144k82669R6206M6845l60565n18952k62527l59574l30047
$$ 674466248 674094543 673552399 673269730 673365936 673412781 673052216 672533264 672270737 671911163 671581116
2472.7F71581116r53675j012649n10025R7809J04141m91028k24914j42670k20719n04760
$$ 671581116 670627441 669614792 669104767 669202576 669306717 668815689 668590775 668448105 668227386 667722626
2482.3F67722626m78974n85327q37021n71594k85873L967l52325j44654o3553l74984
$$ 667722626 667243652 666658325 665821304 665249710 664963837 664967804 664615479 664470825 664407272 664032288
2492F64032288l35846l22953m79965q70514n30700p30820p57218n92346m81338L06701
$$ 664032288 663696442 663373489 662893524 662023010 661492310 660761490 660004272 659411926 658930588 659237289
2501.6F59237289K97928k79998p74384j11771k97699j032028o89621n44510n59005
$$ 659237289 659535217 659255219 658480835 658369064 658071365 657039337 656349716 655805206 655246201
2510.3F55246201q24738n2032l6622k06298l5324o10581j59683l63236n61752p42493
$$ 655246201 654421463 654369431 654332809 654126511 654091187 653480606 653320923 652957687 652395935 651653442
2519.9F51653442o36749k35214o21262k28119k8457n4169l86887l12576k96173p16553
$$ 651653442 651016693 650781479 650160217 649932098 649903641 649849472 649462585 649150009 648853836 648137283
2529.6F48137283n26962p95746n60913k99454l03573k41852O7139j16120o60629k60391
$$ 648137283 647610321 646814575 646253662 645954208 645650635 645408783 645475922 645359802 644699173 644438782
2539.2F44438782m54026m45175o95495o60172l03039n05906L1205k09885l23486j17264
$$ 644438782 643984756 643539581 642844086 642183914 641880875 641374969 641406174 641196289 640872803 640755539
2548.9F40755539r5520n85022q90389m72946q40072m38958m88090o98204k36092N226
$$ 640755539 640660019 640074997 639184608 638711662 637871590 637432632 636944542 636246338 636010246 636015472
2558.5F36015472J55259q5068K708l96080n75371r26284r58634m63600p07397m14124
$$ 636015472 636170731 636085663 636088371 635692291 635116920 634190636 633232002 632768402 632061005 631646881
2568.1F31646881j17836L99170J37215q202R7351p52182q31909q83751n80902m77028
$$ 631646881 631529045 631928215 632065430 632057228 632154579 631402397 630570488 629686737 629105835 628628807
2577.8F28628807k21023k61422p07245J53695L1242l98178j69830l09220r60235o53611
$$ 628628807 628407784 628146362 627439117 627592812 627624054 627225876 627056046 626746826 625786591 625132980
2587.4F25132980k41661p08542l51295m07410r7923j91k39258j87034o59027n19562
$$ 625132980 624891319 624182777 623831482 623424072 623326149 623325958 623086700 622899666 622240639 621721077
2597.1F21721077n65224n18837p14798n23147m53034o95038m9743m63715k72331J3618
$$ 621721077 621155853 620637016 619922218 619399071 618946037 618250999 618201256 617737541 617465210 617478828
2606.7F17478828k4337j13411q35572p62481r48181p26510m66499n92155m20723j13678
$$ 617478828 617454491 617341080 616505508 615743027 614794846 614068336 613601837 613009682 612588959 612475281
2616.4F12475281N4588k01454k64893o48727o77834p33795q38699q41637p48596k66228
$$ 612475281 612529869 612328415 612063522 611414795 610736961 610003166 609164467 608322830 607574234 607308006
2626F07308006l64532j21651m42161m99382j16387l24554l40233p85523q87756q31604
$$ 607308006 606943474 606821823 606379662 605880280 605763893 605439339 605099106 604313583 603425827 602594223
2635.6F02594223m32320p80487q22639J22642k66227k3346k1706l64456n88532r04846
$$ 602594223 602161903 601381416 600558777 600681419 600415192 600391846 600370140 600005684 599417152 598512306
2645.3E98512306o29654p53288o96640p21588l23753j37253q9417k67m07028l78799
$$ 598512306 597882652 597129364 596432724 595711136 595387383 595250130 595160713 595160446 594753418 594374619
2654.9E94374619q14438n16625m99840j049652p03964k13814R8648m02145l46794j18485
$$ 594374619 593560181 593043556 592543716 591494064 590790100 590576286 590674934 590272789 589925995 589807510
2664.6E89807510m9896j06621m58221l53317o35720j043357r15642N4054k82784q11691
$$ 589807510 589757614 589650993 589192772 588839455 588203735 587160378 586244736 586298790 586016006 585204315
2674.2E85204315N1918J01891J12533l77922p21931m17786n23224o98661o75049j66931
$$ 585204315 585256233 585358124 585470657 585092735 584370804 583953018 583429794 582731133 582056084 581889153
2683.9E81889153j03188k81105m56200l44887l03382o18935n08499o5346P8812r77135
$$ 581889153 581785965 581504860 581048660 580703773 580400391 579781456 579272957 579207611 579286423 578309288
2693.5E78309288j001625k11296j90125k34069k90604N989k29683k84119j93328n38559
$$ 578309288 577307663 577096367 576906242 576672173 576381569 576387558 576157875 575873756 575680428 575141869
2703.1E75141869o36406o36368n89028o88285j98250K9907r5291j33400l40996l06320
$$ 575141869 574505463 573869095 573280067 572591782 572393532 572423439 572328148 572194748 571853752 571547432
2712.8E71547432l46413j12495l66593p01065m02412j93176k50511r8458R5062m15649
$$ 571547432 571201019 571088524 570721931 570020866 569618454 569425278 569174767 569076309 569171371 568755722
2722.4E68755722l38669j29547j83029n81551r42840m57573l66860J40458J2893m77371
$$ 568755722 568417053 568287506 568104477 567522926 566580086 566122513 565755653 565896111 565909004 565431633
2732.1E65431633j8730o9275k24686o2866o87o42776n33905N6801j63079l27224l59993
$$ 565431633 565412903 565343628 565118942 565056076 565055389 564412613 563878708 563935509 563772430 563445206 563085213
2742.7E63085213L1776l4752m03213k95868m0779j47896m57840m98924n73082l48130
$$ 563085213 563116989 563082237 562679024 562383156 562342377 562194481 561736641 561237717 560664635 560316505
2752.3E60316505l80363n5122J77269l26882m30107o3591L95584l79181p93800m02336
$$ 560316505 559936142 559881020 560058289 559731407 559301300 559237709 559633293 559254112 558460312 558057976
2762E58057976k21443k09618m85153k70615l02200J03226L0555n28335m54903m96330
$$ 558057976 557836533 557626915 557141762 556871147 556568947 556672173 556702728 556174393 555719490 555223160
2771.6E55223160j42784m84238m59900k65236o83059o84243n27496j1482J4419l2005
$$ 555223160 555080376 554596138 554136238 553871002 553187943 552503700 551976204 551964722 551979141 551947136
2781.3E51947136m89578r28917o44722o39687n10826m25301k29911l63694j78299J93482
$$ 551947136 551457558 550528641 549883919 549244232 548733406 548308105 548078194 547714500 547536201 547729683
2790.9E47729683m81224q12874n31883p19033r37652m23431n57747p36351p58706o82830
$$ 547729683 547248459 546435585 545903702 545184669 544247017 543823586 543265839 542529488 541770782 541087952
2800.5E41087952m7684m85992m90189m10843o77986o84967j033745o39534l40385n66750
$$ 541087952 541040268 540554276 540064087 539653244 538975258 538290291 537256546 536617012 536276627 535709877
2810.2E35709877j032448j104545q25119m88587l42293q95652p47376n73807p59811
$$ 535709877 534677429 533572884 532747765 532259178 531916885 531021233 530273857 529700050 528940239
2818.9E28940239r34448o77376o08902j315842r96284o90232o19659m32701o03333
$$ 528940239 528005791 527328415 526719513 525403671 524407387 523717155 523097496 522664795 522061462
2827.6E22061462q21571q99315j075058j183281o79092j168060j231308q31376r38797
$$ 522061462 521239891 520340576 519265518 518082237 517403145 516235085 515003777 514172401 513233604
2836.2E13233604o70852j138916j126099j410408k045135j867600j863708j971093
$$ 513233604 512562752 511423836 510297737 508887329 506842194 504974594 503110886 501139793
2843.9E01139793j933441j503944j754913k195092k145157j604881j415291j877060
$$ 501139793 499206352 497702408 495947495 493752403 491607246 490002365 488587074 486710014
2851.7D86710014j583938j110001m35486o20079o25725n874P5378N43518K60849j42059
$$ 486710014 485126076 484016075 483580589 482960510 482334785 482328911 482404289 482947807 483208656 483066597
2861.3D83066597n51147o94771q26302r30557l44124q68301p94525p94526j066513
$$ 483066597 482515450 481820679 480994377 480063820 479719696 478851395 478056870 477262344 476195831
2870D76195831n36194m30374m13856r90257j064454o30302m06494o05774p02858m43268
$$ 476195831 475659637 475229263 474815407 473825150 472760696 472130394 471723900 471118126 470415268 469972000
2879.6D69972000q79860p71866q92028r96972p89985q77915o52275j076965j243172
$$ 469972000 469092140 468320274 467428246 466431274 465641289 464763374 464111099 463034134 461790962
2888.3D61790962r75952r93805j035881o22520l80211q65937q06732p77778j093865
$$ 461790962 460815010 459821205 458785324 458162804 457782593 456916656 456109924 455332146 454238281
2897D54238281j278496j044426q27293p56225m71497m85916n34287q99391q69560o14014
$$ 454238281 452959785 451915359 451088066 450331841 449860344 449374428 448840141 447940750 447071190 446457176
2906.6D46457176o97059p08046r44176r84840j191521j346512j505966j358414j094017
$$ 446457176 445760117 445052071 444107895 443123055 441931534 440585022 439079056 437720642 436626625
2915.3D36626625j248245j003113j274528j603051j473617p64427n75562j403122p47108
$$ 436626625 435378380 434375267 433100739 431497688 430024071 429259644 428684082 427280960 426533852
2924D26533852M1580k38686l09868M31176R18159L56941m02527m20951K98843K06871
$$ 426533852 426575432 426336746 426026878 426458054 427376213 427733154 427330627 426909676 427208519 427415390
2933.6D27415390M60358P88345O0081p0877N72129J044311O98014O65588Q60481Q29430
$$ 427415390 427875748 428664093 428724174 428653297 429225426 430269737 430967751 431633339 432493820 433323250
2943.3D33323250M73823J20545P49855Q14056M83666K05688L08037P35283M50859M63600
$$ 433323250 433797073 433917618 434667473 435481529 435965195 436170883 436478920 437214203 437665062 438128662
2952.9D38128662M28734J30005J39808L56827M49753O58836N84526J74103P20825J055756
$$ 438128662 438557396 438687401 438827209 439184036 439633789 440292625 440877151 441051254 441772079 442827835
2962.6D42827835P39327L19366N18227Q62083M98123N68123M99153M56505L54767O30112
$$ 442827835 443567162 443886528 444404755 445266838 445764961 446333084 446832237 447288742 447643509 448273621
2972.2D48273621J521034J180916L99055P3776M02413P78427L92761j15700m6081M12483
$$ 448273621 449794655 450975571 451374626 451448402 451850815 452629242 453022003 452906303 452860222 453272705
2981.8D53272705K09999k45056P1335N71136M03939L37562J05095k70920j34964j39961
$$ 453272705 453482704 453237648 453308983 453880119 454284058 454621620 454726715 454455795 454320831 454180870
2991.5D54180870j35422l85017k58827l7346N4016K12097n03731m62913l67241q25996
$$ 454180870 454045448 453660431 453401604 453364258 453418274 453630371 453126640 452663727 452296486 451470490
3001.1D51470490m26331j90010o61507o95381l80173p39441p54814n19829k99186j59874
$$ 451470490 451044159 450854149 450192642 449497261 449117088 448377647 447622833 447103004 446803818 446643944
3010.8D46643944m00658o95877r82552m24919o19163q73451m94996p78923n39856n76858
$$ 446643944 446243286 445547409 444564857 444139938 443520775 442647324 442152328 441373405 440833549 440256691
3020.4D40256691q02994p33146l49884j46866o79589r84306j428375j259613p96585
$$ 440256691 439453697 438720551 438370667 438223801 437544212 436559906 435131531 433871918 433075333
3029.1D33075333m94194l38631o85349m09660n53055j007499o86455p54967j061668
$$ 433075333 432581139 432242508 431557159 431147499 430594444 429586945 428900490 428145523 427083855
3037.8D27083855o95305o40450r10110r37653q77456n59807p25098p83729r11408r32617
$$ 427083855 426388550 425748100 424837990 423900337 423022881 422463074 421737976 420954247 420042839 419110222
3047.4D19110222m14848q56553r78622m71344m78745j045951j104927o29654o21376
$$ 419110222 418695374 417838821 416860199 416388855 415910110 414864159 413759232 413129578 412508202
3056.1D12508202q21686j333122p69692l76930r45931q19244o47202n27381p20940
$$ 412508202 411686516 410353394 409583702 409206772 408260841 407441597 406794395 406267014 405546074
3064.8D05546074n23415m50554p44857o29807r45320j111603j065178q32710o62155
$$ 405546074 405022659 404572105 403827248 403197441 402252121 401140518 400075340 399242630 398580475
3073.5C98580475m44145m98543p65419n99823o85120k53868o50520j119576o34803
$$ 398580475 398136330 397637787 396872368 396272545 395587425 395333557 394683037 393563461 392928658
3082.1C92928658p20635o31752q83179p71293m23508m72870n37491p11250n62058p38906
$$ 392928658 392208023 391576271 390693092 389921799 389498291 389025421 388487930 387776680 387214622 386475716
3091.8C86475716p02896r11370j060982p90214q17833k12059k58331p09916p04994
$$ 386475716 385772820 384861450 383800468 383010254 382192421 381980362 381722031 381012115 380307121
3100.5C80307121p66258p79304q38509n23758l35312o26602j109467j087875l47481
$$ 380307121 379540863 378761559 377923050 377399292 377063980 376437378 375327911 374240036 373892555
3109.1C73892555l85093j000710q07648m44870o04210r62944j064376m89274m20913
$$ 373892555 373507462 372506752 371699104 371254234 370650024 369687080 368622704 368133430 367712517
3117.8C67712517j174584j280746m61731p1793n18798r60312j038399o09169n79567
$$ 367712517 366537933 365257187 364795456 364723663 364204865 363244553 362206154 361596985 361017418
3126.5C61017418q92792j076622r48028m37050n98755m05083q25615j325722o11763
$$ 361017418 360124626 359048004 358099976 357662926 357064171 356659088 355833473 354507751 353895988
3135.2C53895988p33375q39501q80203m68864k69547q02536r95369j446457p59964
$$ 353895988 353162613 352323112 351442909 350974045 350704498 349901962 348906593 347460136 346700172
3143.9C46700172l61671l97263p7056o59638r32007j021881o85005o53534j156502
$$ 346700172 346338501 345941238 345864182 345204544 344272537 343250656 342565651 341912117 340755615
3152.5C40755615r38492o17103n32990q84704j030007p81898k92359k68669r53598
$$ 340755615 339817123 339200020 338667030 337782326 336752319 335970421 335678062 335409393 334455795
3161.2C34455795j080017p93266o53420q45565p07550m49868o83937o99310m33731
$$ 334455795 333375778 332582512 331929092 331083527 330375977 329926109 329242172 328542862 328109131
3169.9C28109131o04057q47970n26809o36521q85582j006240q02041n08193j104622
$$ 328109131 327505074 326657104 326130295 325493774 324608192 323601952 322799911 322291718 321187096
3178.6C21187096p93763m09030o70338m90379n95246p47204p51342l34301k56672j145134
$$ 321187096 320393333 319984303 319313965 318823586 318228340 317481136 316729794 316395493 316138821 314993687
3188.2C14993687j262455n97821n52291o74267n79396n27839l37181o21548r79633
$$ 314993687 313731232 313133411 312581120 311906853 311327457 310799618 310462437 309840889 308861256
3196.9C08861256p74613o20498q09765p81632m26788m99325n52025o37455m92954k20680
$$ 308861256 308086643 307466145 306656380 305874748 305447960 304948635 304396610 303759155 303266201 303045521
3206.5C03045521n14031p87391j154709r81693o52981k60163j76811j166382q53233
$$ 303045521 302531490 301744099 300589390 299607697 298954716 298694553 298517742 297351360 296498127
3215.2B96498127r1705k82097p19662q16555k36854j99795p44496r43889n64060l13550
$$ 296498127 296406422 296124325 295404663 294588108 294351254 294151459 293406963 292463074 291899014 291585464
3224.9B91585464l73916p63874r49097m33597l84236k76756j31817p09839j082363
$$ 291585464 291211548 290447674 289498577 289064980 288680744 288403988 288272171 287562332 286479969
3233.5B86479969o16398n22861p44706m08573o27155o02970m02794k85759j07441p82070
$$ 286479969 285863571 285340710 284596004 284187431 283560276 282957306 282554512 282268753 282161312 281379242
3243.2B81379242o83270k42366n13821o38084k30046j58348n39055m73880q00000l28731
$$ 281379242 280695972 280453606 279939785 279301701 279071655 278913307 278374252 277900372 277100372 276771641
3252.8B76771641L29685j00060l13224m98505q10585j297779q09403p1067k77768o50577
$$ 276771641 277101326 277001266 276688042 276189537 275378952 274081173 273271770 273200703 272922935 272272358
3262.5B72272358p16934K84080J87264o77796m97436o13308p08580m36897J010K72656
$$ 272272358 271555424 271839504 272026768 271348972 270851536 270238228 269529648 269092751 269093761 269366417
3272.1B69366417o0864n55362k42138M9152q51803j089725o72932l54881P8678l56750
$$ 269366417 269305553 268750191 268508053 268557205 267705402 266615677 265942745 265587864 265666542 265309792
3281.8B65309792l66688Q4438k83146k29988l81317o84986j6422L20415l40500q40645
$$ 265309792 264943104 265027542 264744396 264514408 264133091 263448105 263431683 263752098 263411598 262570953
3291.4B62570953j51462k9755m82998n26085p18765k58713k19059J1883J60523o98071
$$ 262570953 262419491 262389736 261906738 261380653 260661888 260403175 260184116 260195999 260356522 259658451
3301B59658451n74360n30605k53601j25466p22999l66497j38397l14045k74010j76430
$$ 259658451 259084091 258553486 258299885 258174419 257451420 257084923 256946526 256632481 256358471 256182041
3310.7B56182041l57475j93577p7209m15020n61314p27825j74694l18108o02817k40879
$$ 256182041 255824566 255630989 255553780 255138760 254577446 253849621 253674927 253356819 252754002 252513123
3320.3B52513123m58184l03173o70414o23741j18503o07930q95595o91090m71878o43406
$$ 252513123 252054939 251751766 251081352 250457611 250339108 249731178 248835583 248144493 247672615 247029209
3330B47029209k62604r0789l68348l33938m89617l30810o91910q79440n92118n17578
$$ 247029209 246766605 246675816 246307468 245973530 245483913 245153103 244461193 243581753 242989635 242472057
3339.6B42472057l74050p09572m76360j64127j63002k51046q63399n83820j47477k58369
$$ 242472057 242098007 241388435 240912075 240747948 240584946 240333900 239470501 238886681 238739204 238480835
3349.3B38480835m5109r5253k29740m56924o42090j11962r6054l25565j00994j70517
$$ 238480835 238435726 238340473 238110733 237653809 237011719 236899757 236803703 236478138 236377144 236206627
3358.9B36206627l20339K8000L36628m09317n66788m32663n82409J18904K47173L0480
$$ 236206627 235886288 235914288 236250916 235841599 235274811 234842148 234259739 234378643 234625816 234656296
3368.6B34656296n36061m79946L4848l99838l567J6919k32697k63805l63522J8387
$$ 234656296 234120235 233640289 233675137 233275299 233271732 233288651 233055954 232792149 232428627 232447014
3378.2B32447014l65963l58715P9632L20282K18277k23790l79772o86359k49558M32568
$$ 232447014 232081051 231722336 231801968 232122250 232340527 232116737 231736965 231050606 230801048 231233616
3387.8B31233616M67167Q6021P7763K16789n02739n36575K22816L30067k62089m32567
$$ 231233616 231700783 231786804 231864567 232081356 231578617 231042042 231264858 231594925 231332836 230900269
3397.5B30900269q831M84790L98941m40654j88179j6652j02367J08604j26400J91632
$$ 230900269 230891438 231376228 231775169 231334515 231146336 231129684 231027317 231135921 231009521 231201153
3407.1B31201153O1912j89628J11809K38189L8586k54135n0755J16310M72813N57461
$$ 231201153 231263065 231073437 231185246 231423435 231462021 231207886 231157131 231273441 231746254 232303715
3416.8B32303715K12860K20833K13413k9011j38187L03516L88031L49522L48663j71204
$$ 232303715 232516575 232737408 232950821 232921810 232783623 233087139 233475170 233824692 234173355 234002151
3426.4B34002151k00634L54157O19545L54519O9294j6194K03324N71575N28774K33784
$$ 234002151 233801517 234155674 234775219 235129738 235199032 235182838 235386162 235957737 236486511 236720295
3436.1B36720295L05214O52504K50225j97926K66514O73351M34342L47805K57587R3632
$$ 236720295 237025509 237678013 237928238 237730312 237996826 238670177 239104519 239452324 239709911 239803543
3445.7B39803543M65908N30605Q03891M97436j06735O60629P35474L81546L64208L74146
$$ 239803543 240269451 240800056 241603947 242101383 241994648 242655277 243390751 243772297 244136505 244510651
3455.3B44510651P49607P49283M00867K00539N41401R14344R56498K56633l24Q82015
$$ 244510651 245260258 246009541 246410408 246610947 247152348 248066692 249023190 249279823 249279499 250161514
3465B50161514Q88367J44367k95524M71038J261177Q98896M68597L44830P63759R77879
$$ 250161514 251049881 251194248 250898724 251369762 252630939 253529835 253998432 254343262 255107021 256084900
3474.6B56084900M67167L20225R50088J145287R12094P71522O83918O04210J2531P74212
$$ 256084900 256552067 256872292 257822380 258967667 259879761 260651283 261335201 261939411 261951942 262726154
3484.3B62726154J152764M80861R75514Q20942J10893L86620J162204P47376L89137
$$ 262726154 263878918 264359779 265335293 266156235 266267128 266653748 267815952 268563328 268952465
3493B68952465R97658J117744J197434R3021Q2607J171360J231156J363544J216774
$$ 268952465 269950123 271067867 272265301 272358322 272440929 273612289 274843445 276206989 277423763
3501.6B77423763Q57449J90677N81894O62117L64438J173343J473789R34945N1593
$$ 277423763 278281212 278471889 279053783 279715900 280080338 281253681 282727470 283662415 283714008
3510.3B83714008Q64888J178054M62399P21512R97467R65595O63490J202565J528511
$$ 283714008 284578896 285756950 286219349 286940861 287938328 288903923 289567413 290769978 292298489
3519B92298489R94835P23037J196499J462040Q99124J365376Q95748O36120J027717
$$ 292298489 293293324 294016361 295212860 296674900 297574024 298939400 299835148 300471268 301498985
3527.7C01498985O92978O97251Q60347J162930J092396J329460R34582J162776J251259
$$ 301498985 302191963 302889214 303749561 304912491 306004887 307334347 308268929 309431705 310682964
3536.4C10682964N82505J557159J314182J392269J005326N33523J309738J866704J860580
$$ 310682964 311265469 312822628 314136810 315529079 316534405 317067928 318377666 320244370 322104950
3545C22104950O13022J310653M34075Q61320K088929J778526K004776K56119J321754
$$ 322104950 322717972 324028625 324462700 325324020 327412949 329191475 331196251 331452370 332774124
3553.7C32774124J284828J507759K464257J025924J694680J462021J742973N62935
$$ 332774124 334058952 335566711 338030968 339056892 340751572 342213593 343956566 344519501
3561.4C44519501J446037K758598J215859M257889J691284j24741J146088p54547K605972
$$ 344519501 345965538 348724136 349939995 354197884 355889168 355764427 356910515 356155968 358761940
3570.1C58761940J598778J472702J930504K113762J653747J400032K667465J183854
$$ 358761940 360360718 361833420 363763924 365877686 367531433 368931465 371598930 372782784
3577.8C72782784K383575K081413R83315J878166K285500K175750P34635L788070L602333
$$ 372782784 375166359 377247772 378231087 380109253 382394753 384570503 385305138 389093208 392695541
3586.5C92695541R75571J382713j308288K396507K951584L267708K439232J468010
$$ 392695541 393671112 395053825 393745537 396142044 399093628 402361336 404800568 406268578
3594.2D06268578M115295l02849J195412L775444J355095K944526K109185J269760
$$ 406268578 410383873 410081024 411276436 415051880 416406975 419351501 421460686 422730446
3601.9D22730446K771034K101936J690293L495331L742866n1460L045769M99115p56302
$$ 422730446 425501480 427603416 429293709 432789040 436531906 436480446 439526215 440025330 439269028
3610.6D39269028P925377L999900j913223L801346o4278L646355N756683K064553L115463
$$ 439269028 447194405 451194305 449281082 453082428 453018150 456664505 462421188 464485741 467601204
3619.3D67601204l92761N80749L328400L245506L068581L175773L353806L071594Q045235
$$ 467601204 467208443 467789192 471117592 474363098 477431679 480607452 483961258 487032852 495078087
3628D95078087O296882j0276260J233788M277839N928116L453522o34613K277641L700218
$$ 495078087 501374969 491098709 492332497 496610336 502538452 505991974 505357361 507635002 511335220
3636.6E11335220L438874J817321K476807K818146L225632K728538R39713K752151
$$ 511335220 514774094 516591415 519068222 521886368 525112000 527840538 528780251 531532402
3644.4E31532402M535637P908058K394219l283310P663993K845040l713722l042717
$$ 531532402 536068039 543976097 546370316 543087006 550750999 553596039 549882317 546839600
3652.1E46839600M916610N600548M414559O571426o631012P14645O463814K444801
$$ 546839600 551756210 557356758 561771317 568342743 561711731 562426376 568890190 571334991
3659.8E71334991K174035Q43544K723693J810418J581344K589073J302758N283813
$$ 571334991 573509026 574352570 577076263 578886681 580468025 583057098 584359856 589643669
3667.5E89643669M559059J995468J209908q553238J659699R523544J1691665L482399
$$ 589643669 594202728 596198196 597408104 588854866 590514565 600038109 611729774 615212173
3675.2F15212173j8945541o89583O969643N399094j540757J35269L158761J963844
$$ 615212173 596266632 595577049 602546692 607945786 606405029 606540298 609699059 611662903
3682.9F11662903J222153Q69178P12509L855134Q237533o935158m804039J0922661
$$ 611662903 612885056 613754234 614466743 618321877 626559410 619624252 614820213 625742874
3690.6F25742874m376526l388481M485397P28455K001381J157722N9510Q22868J94931
$$ 625742874 621366348 617977867 622463264 623191719 625193100 626350822 626410332 627233200 627428131
3699.3F27428131L170281M565811l979073m017486M190826K202072M14848N78995L452149
$$ 627428131 630598412 635164223 631185150 627167664 631358490 633560562 633975410 634554405 638006554
3708F38006554O574592p752189K019920P779236j4375649J338997M225731L17535O80123
$$ 638006554 644581146 636828957 638848877 646628113 632252464 633591461 637817192 638134727 638814850
3716.7F38814850K295227K245102k555313M67987O502609j782227o277542M666825
$$ 638814850 641110077 643355179 640799866 641267853 647770462 645988235 639710693 644377518
3724.4F44377518K713470Q42667k646942j878510L411484J205597O932831q46711j0100784
$$ 644377518 647090988 647933655 645286713 643408203 646819687 648025284 654958115 654111404 644010620
3733.1F44010620R803620L898544j0334625j984940J208191n65796J992645M429093
$$ 644010620 653814240 657712784 647378159 645393219 646601410 646035614 648028259 652457352
3740.8F52457352l713761J955414J3484039p810974k1047592J0526276O290512O439667
$$ 652457352 648743591 650699005 664183044 656372070 635324478 645850754 652141266 658580933
3748.5F58580933l85971j0679780J2939683l056489j2618026M013900L976746M828568
$$ 658580933 658194962 647515182 660454865 657398376 644780350 648794250 652770996 657599564
3756.2F57599564n163422N29938P714538n927734m499054K878189J710663R67483M949952
$$ 657599564 652436142 652966080 660680618 654752884 650253830 653132019 654842682 655810165 660760117
3764.9F60760117r91517p055130J515961O175156K810211j0362854k03476L308258
$$ 660760117 659768600 652713470 654229431 660404587 663214798 652851944 652648468 655956726
3772.6F55956726O42090J467667m05503J61133L74222M341278K602920q669281N3559
$$ 655956726 656598816 658066483 657660980 657822113 658196335 662537613 665140533 656471252 656524811
3781.3F56524811J353836J235504L245621k012253j423645P26395L92761N53131j30768
$$ 656524811 657878647 659114151 662359772 660347519 658923874 659650269 660043030 660596161 660465393
3790F60465393j99737p53327m9667J1825J867600N404205k215805o810989J024933
$$ 660465393 660265656 659512329 659462662 659474487 661342087 666746292 664530487 657719498 658744431
3798.7F58744431N749511R154740n484085j3549729L301773J851654M666062P898712
$$ 658744431 664493942 673648682 668164597 654614868 657916641 659768295 664434357 672333069
3806.4F72333069q232880p235107L680115K329254L07312l15934n08728J624299P255706
$$ 672333069 664100189 656865082 660545197 662874451 663181763 662865829 662357101 663981400 671237106
3815.1F71237106J489334j6379089K686844O532898O486282N584793j7228546k615967
$$ 671237106 672726440 656347351 659034195 665567093 672053375 677638168 660409622 657793655
3822.8F57793655L894425J695175L466797Q41751n208893r02557J836014M282302L817292
$$ 657793655 661688080 663383255 666850052 667691803 662482910 661580353 663416367 667698669 671515961
3831.4F71515961j0080872P55615Q891907n859680k069779R748536o902237o375122
$$ 671515961 661435089 662190704 671082611 665222931 663153152 672901688 665999451 659624329
3839.2F59624329R138183m748535k855530Q123169j173477o250687J693955J680755
$$ 659624329 668762512 664013977 661158447 669281616 668108139 661857452 663551407 665232162
3846.9F65232162K05307J740113p70035K126694P618332k248688K785187j7191391
$$ 665232162 665437469 667177582 666407547 668534241 676152573 673903885 676689072 659497681
3854.6F59497681l569794J1380310o88934l961487J507034K630310M374466m986419
$$ 659497681 655927887 667308197 666619263 662657776 664164810 666795120 671169586 666183167
3862.3F66183167j982041Q127518l341141q208084K304001M654541P907181l437653
$$ 666183167 664201126 672328644 668987503 660779419 663083420 667737961 675645142 672207489
3870F72207489j2095795J583710O666107O193009j0972672k288742M445953j38778
$$ 672207489 660111694 661695404 668361511 674554520 663581848 661293106 665739059 665600281
3877.7F65600281K870559P937699l466187j2614746L751602J803589K275772P919464
$$ 665600281 668470840 676408539 672942352 660327606 664079208 665882797 668158569 676078033
3885.4F76078033j3218612j920853M119721R86328N383682R29108r058304m84238L216019
$$ 676078033 662859421 660938568 665058289 666044617 671428299 672357407 663299103 662814865 666030884
3894.1F66030884j560517K85340J321640M017639M584808j1247177L644562M298553
$$ 666030884 664470367 664755707 666077347 670094986 674679794 663432617 667077179 671375732
3901.8F71375732n757446M634705k896500l114700q06580k83508K228851k11715K25372
$$ 671375732 665618286 670252991 667356491 664241791 663435211 663151703 665380554 665168839 665394211
3910.5F65394211j66092K17514k4033r55886J783447L088531k153167m600449L565445
$$ 665394211 665228119 665445633 665421600 664465714 666249161 669337692 667184525 662584076 666149521
3919.2F66149521J104126m815445J670380K512893J642304j528015m029007J166915
$$ 666149521 667253647 662438202 664108582 666621475 668263779 666735764 662706757 663873672
3926.9F63873672J534958J290436n70526j344070K513733j424256k300873J232605
$$ 663873672 665408630 666699066 666128540 664784470 667298203 665873947 663573074 664805679
3934.6F64805679r2086m5243N85785j6250p57905l96881K055817J743546l716660j781540
$$ 664805679 664713593 664668350 665254135 665237885 664479980 664083099 666138916 667882462 664165802 662384262
3944.3F62384262J101837J042710J642913j443252P71026Q08487l033218J083832P80639
$$ 662384262 663486099 664528809 666171722 664728470 665499496 666307983 663274765 664358597 665139236
3953F65139236k08587J51901l26767K90222o83975L21960P5760M09623N80978j706619
$$ 665139236 664930649 665082550 664755783 665046005 664362030 664683990 664759750 665169373 665750351 664043732
3962.6F64043732o17524Q9417j07574L28521N73883K75421n05905n17883K86942J74179
$$ 664043732 663426208 663515625 663408051 663736572 664310455 664585876 664079971 663562088 663849030 664023209
3972.2F64023209j32752L38822P858K89459o0654P8049L69644o58722l8070K32238
$$ 664023209 663890457 664229279 664237137 664526596 664465942 664543991 664913635 664254913 664216843 664449081
3981.9F64449081J23215k33765k15835J09634j86233j05210p8964P39212j64413n76019
$$ 664449081 664572296 664338531 664122696 664232330 664046097 663940887 663861923 664601135 664436722 663860703
3991.5F63860703L27758K97699K42615n35736K21405L35846M9515J90429m85000
$$ 663860703 664188461 664486160 664728775 664193039 664414444 664750290 664799805 664990234 664505234
4000.2F64505234
$$ 664505234
##END=$$ End of the data block
