##TITLE=$$ Begin of the data block
##JCAMP-DX=5.00 $$ ACD/SpecManager v 10.08
##SPECTROMETER/DATA SYSTEM=Varian
##DATE=14 Jan 2013 09:53:00
##DATA TYPE=INFRARED SPECTRUM
##DATA CLASS=XYDATA
##ORIGIN=
##OWNER=
##NPOINTS=3735
##FIRSTX=399.26403809
##LASTX=4000.35498047
##MAXX=4000.35498047
##MINX=399.26403809
##MAXY=73.03799438
##MINY=23.08972359
##XFACTOR=1.0000000000
##YFACTOR=0.000000100000000
##FIRSTY=44.83010101
##DELTAX=0.96440572
##XUNITS=1/CM
##YUNITS=TRANSMITTANCE
##XYDATA=(X++(Y..Y))
399.3 448301010 449771805 453497810 454607353 451767616 446406860 443070793 440979462 444242401
407 444242401 445995560 444256287 442883072 438976440 444413414 453956947 452242279 443188515 438599701
415.7 438599701 441555710 439803238 433527374 434892845 436425629 441858559 443238411 442540550 444743004
424.3 444743004 443222809 441031113 441342049 442387352 439394417 435520973 436036720 437312202 439793930
433 439793930 441833115 440992661 439699326 437807159 438440056 438915443 434068947 433502731 441316986
441.7 441316986 446254768 445936356 445179367 444181519 442520523 444515190 445938606 440977135 437723999
450.4 437723999 436836014 438990326 442790680 440344009 438287888 439578781 441069717 436589928 437844315
459.1 437844315 441560135 436447334 432442551 433366051 433474464 433217545 430728645 431401939 435230942
467.7 435230942 432689514 430612259 432873344 433119736 429380188 424421387 426193504 429588242 428662453
476.4 428662453 429298592 431000481 428250656 424162369 427259560 429935799 425850906 422979050 420507469
485.1 420507469 419645386 420428352 420921249 422886734 423964348 425077057 424969215 422730331 420722809
493.8 420722809 418707199 418018875 417079773 416853294 419446411 420050278 418619156 420263290 421693687
502.5 421693687 420019264 419033623 416547012 415965271 416448212 413521233 413918152 415512657 414766655
511.1 414766655 414949150 414767914 414459076 415263023 415044136 410092468 405994339 406901131 406603470
519.8 406603470 405448036 405637283 408632545 410029602 406887741 406688042 407986565 406370544 405184746
528.5 405184746 404448509 403933830 403348465 402945137 404715271 406705322 406209602 406405525 407498436
537.2 407498436 406327019 403115616 401605225 401559181 401369209 402896538 402901192 402892609 404587440 403611450
546.8 403611450 400899696 398470764 398392410 398620987 397126007 394724274 393206367 394007683 393636627
555.5 393636627 394180984 395664177 396527100 396449051 394477654 393689613 392893829 392330513 392194977 391243210
565.1 391243210 391638184 393533058 394222183 393308525 394056892 394383888 392911148 391784096 391662674
573.8 391662674 391484222 390230141 390828018 391573639 392004776 393746185 394107742 392897110 393412399
582.5 393412399 394354057 392730064 391016350 389856224 389173088 390292206 392442665 394701424 395973396
591.2 395973396 396507187 396367989 396535492 395270958 393900414 394506302 393257256 392138519 392346344
599.9 392346344 392957268 393896523 394851761 397043114 397463455 395286064 393193665 391490784 389378052
608.5 389378052 387213516 386206589 386632080 387973785 389281693 390134048 389169960 388616829 388578300
617.2 388578300 386554413 384653435 383522186 384580574 386399651 386811180 387439003 389746933 392827606
625.9 392827606 394356728 395094719 395270653 395272408 394831314 394631195 395514297 396717987 399308434 402174416
635.5 402174416 405372505 407936058 408919983 410349083 411042595 410560608 409973679 409735413 410507088
644.2 410507088 412010307 413685989 416538315 420111885 421929131 422770348 422848206 422882080 423579597
652.9 423579597 422307930 420109673 419018021 419391747 421476135 423679314 424401855 424433784 424758797
661.6 424758797 424000778 422195663 419593163 417374268 418328285 420541229 424070015 425363083 425000267
670.3 425000267 425435524 427316628 428618889 428282967 427549248 426999741 426852226 427307281 428596420
678.9 428596420 430797615 433512344 436707001 439917603 441925278 441247826 439915237 439652786 438719559
687.6 438719559 438844566 439943695 440905457 442630157 444292030 446005211 447242889 448414841 449715919
696.3 449715919 449758949 449046440 448399010 447789345 447162018 447631416 448882294 450492249 452630882
705 452630882 454703827 456523170 457025185 456667252 456180611 455292664 454491119 455167580 457144699 458999748
714.6 458999748 460669670 461648064 463075943 464538193 465470467 465985641 464549065 463613396 463293228
723.3 463293228 463809013 465373955 466555023 468633118 470929146 473265839 475132217 475191422 474091644
732 474091644 473142471 473138809 473677826 474439011 475715218 477708130 478742294 479817848 481870689 482835770
741.6 482835770 481870842 480232048 480250092 479994736 479396973 480160561 481917419 484092560 486142273
750.3 486142273 488281631 489243546 490425987 491079903 490632172 490274277 489661217 490941238 492444763
759 492444763 494494820 496646576 497967148 500437126 502038498 502383041 501293526 500675659 500592728
767.7 500592728 499956322 500089836 501134796 503120193 504038849 505304108 506098824 505149612 504240570
776.4 504240570 503169899 502356758 500562172 499228554 499386024 500797272 503014526 504392471 505648766
785 505648766 506787376 508614731 509539185 508449745 507220383 506647758 506013107 505318794 506469765
793.7 506469765 507908859 509175148 510594902 511004677 510308952 508685760 506471367 504004822 502435226
802.4 502435226 500715866 498994255 498017693 497514610 496736259 495770073 495542679 493944931 491529465
811.1 491529465 488480949 485379791 483372154 481681595 480914383 479969025 480015373 481120644 482582817
819.7 482582817 484610100 485141258 484943314 484769058 485656929 486568298 487709045 491006317 494350090
828.4 494350090 498495064 503658295 508367500 512048111 514771271 516471977 517786026 519679260
836.1 519679260 520949516 522608109 525313950 528151093 531131706 535363960 538435020 539686050
843.9 539686050 540683746 539710083 539133492 538902435 539544716 540538788 541254082 543922920 546248055
852.5 546248055 549543152 552566757 554548187 556326218 556783447 556874237 556963806 558734741 559694519
861.2 559694519 560411186 561947556 563223343 564965286 565956230 566447983 565358505 563866119 561917267
869.9 561917267 559384651 557448120 556279030 556186867 555652084 555744820 555527687 555117187 554597740 552935867
879.5 552935867 550844383 548199997 546871490 545815506 544891319 544445343 544499512 545198059 545488892
888.2 545488892 545575562 544496613 543440018 541672554 540208817 539671326 538524017 538575897 538919067
896.9 538919067 540124207 541456451 541559753 540808296 539679565 538815422 537322960 536661797 537313004
905.6 537313004 539772110 542925453 546108055 549660568 552564240 555037422 555124474 554797668 553368988
914.3 553368988 550225525 548266754 546811142 545066948 542269135 541128044 540386200 537859573 534916229
922.9 534916229 531523476 527919693 523915710 520505791 516630745 512244339 508604469 505850792
930.7 505850792 503804207 502344513 501732330 500011520 497801857 495771675 493592186 491466103 489362984
939.3 489362984 488344803 487020035 485611801 485120583 485415306 485856209 485151062 484314690 483778152
948 483778152 483475838 482939453 482430916 481997070 481393051 481774368 482484856 482493668 481270714 479883575
957.7 479883575 478415337 475945854 472533722 468557777 465766602 463689003 461785889 460600014
965.4 460600014 459705772 458803825 457859497 456491470 454233513 451638985 447947273 443792458 440404320
974.1 440404320 436830559 433373299 430570297 428017807 424681549 420520859 416052895 410997696
981.8 410997696 406027603 400096474 393266258 387984505 382798004 377953262 374223976 370128174
989.5 370128174 366473923 363249435 360169182 356727753 353341103 350139961 346759300 343407860
997.2 343407860 340134277 337740021 335226555 332854958 330554924 328487892 326963310 324879379
1004.9 324879379 322375679 319571686 317500439 315419693 313499622 311762981 310496044 309583702
1012.6 309583702 307575512 306146469 303838711 301825809 300263405 297641468 295091515 292361450
1020.3 292361450 290521851 288135300 286275253 284837761 283443127 282139149 280046921 279246502
1028.1 279246502 278157959 276932793 274298668 272440491 272240944 271043911 271723366 272582932 273580170
1036.7 273580170 275051994 277521343 280081120 282311764 284562149 284619350 284929867 284493427 284052982
1045.4 284052982 284159775 284419231 284780655 284200802 284204903 282400188 280469627 277800865 275474129
1054.1 275474129 274775620 272990494 272305660 271251373 271351337 271401939 272515125 275543346 277607536
1062.8 277607536 280449104 282445412 284423332 284929676 285615559 287306957 288626976 291208057 292690754
1071.5 292690754 294091015 295035744 296036549 296475887 296322250 296755219 296346436 296442490 296528168 297861805
1081.1 297861805 298690739 299657898 301430569 301864662 302796707 303529358 305502281 306497345 306650257
1089.8 306650257 307600918 308037338 309558544 311096401 313041782 314912624 316760807 318557549 319741402
1098.5 319741402 319995213 319912357 321432915 322370644 323232880 324305153 325784073 327875519 329563103
1107.1 329563103 330926514 331960030 333156395 331977997 331087265 331455956 331332741 332630272 334625778
1115.8 334625778 337170830 337880249 337565575 337638969 337798309 338018303 336820641 336045074 335566826
1124.5 335566826 336023941 337511444 339296303 340915337 342049904 344744911 347334938 349209290
1132.2 349209290 350909653 352876740 355228577 357665443 359493523 360456657 363377991 367107849
1139.9 367107849 369641151 371002274 372208519 373617439 374189034 374399414 374177208 374129715 374232407
1148.6 374232407 374528389 375239868 376027184 376904335 376669540 376165771 375610352 375063820 374282188 372592697
1158.3 372592697 371467209 370396538 369854927 370005608 370119896 370886421 372686424 374873314 376639900
1166.9 376639900 378756065 381023293 383343239 385635605 387951050 390921478 394804611 398781204
1174.6 398781204 402184792 405830116 409514236 412595406 414685974 416624222 418961258 421370125
1182.4 421370125 422986488 424296494 426514778 428744812 430856323 432866364 434280548 434835358
1190.1 434835358 435458145 435714531 434847298 433960381 433068314 432465515 431931305 431652832 431648331 431371078
1199.7 431371078 430751572 429311752 427771530 426160698 424873734 423786087 422124596 420892601
1207.4 420892601 420662613 421425667 421787872 421656952 421933823 421635475 420689583 419588852 418717270
1216.1 418717270 417680054 416886673 416767883 416654625 416608238 416251068 416121025 416134682 415591888 414488869
1225.8 414488869 412819252 411251526 409843750 408816910 408287201 408198128 407992020 407285080 407057304
1234.4 407057304 406688538 406186180 405554428 404953651 404883385 404206772 403480034 403304977 403557777 403642769
1244.1 403642769 403388939 403104973 402626266 402632294 402205086 401084824 400292816 399880524 399782715 399734993
1253.7 399734993 399794579 400016823 400238533 400157928 400122795 399913940 399622650 399436798 398998222 399247894
1263.4 399247894 399749565 400409889 401469536 402529030 403720703 404680901 405510445 406285629 406792526
1272 406792526 407141876 407893372 409026375 410192299 411034622 412476959 414501915 415437355 416607971
1280.7 416607971 418044205 419225655 420560570 421824799 423099480 424008446 425273285 427030487
1288.4 427030487 428828125 430137711 431100540 432313156 433782272 434783173 434667168 434922409 435261650
1297.1 435261650 435538483 436249580 436780777 437356224 438113441 438766060 438841209 438877983 438392410 437802887
1306.8 437802887 437633514 436640549 435377655 434384537 433937912 433721619 433406563 433399849 433262215 432975426
1316.4 432975426 432649803 432584496 432720833 433036194 433540001 434243393 435370789 436542397 437859535
1325.1 437859535 438826447 439243584 439568901 439709435 439157753 438180847 437060471 436050568 435584259
1333.8 435584259 435333633 435798416 436408844 436576195 437106857 437580261 437826424 437762871 438271065 438669281
1343.4 438669281 438846817 439927750 441392326 443123779 444160423 444907036 445263710 444945374 444259224
1352.1 444259224 443334961 442903061 441947403 441311455 441266327 441313095 441579628 441728973 441773376 441645775
1361.7 441645775 441667519 440063782 439034882 438681679 437929687 437493439 436851997 436627007 436482124
1370.4 436482124 436709747 437300835 437816010 437855453 436890869 436807709 436903305 436724243 435996933 435707512
1380.1 435707512 435685844 435074310 434597893 433762474 432939529 432143974 431574669 429176216 426952057
1388.7 426952057 425719757 423302727 421342278 419723282 419095917 417917175 414871674 413204269
1396.4 413204269 410955353 409067154 405473022 401995735 400256653 397615204 395282326 393789444
1404.2 393789444 391737289 389141006 387778206 386563110 384632339 382622910 380338402 378608856
1411.9 378608856 376932755 375571632 374501038 373408012 372924118 372356415 373159409 371275177 369716949
1420.6 369716949 370357399 370048141 370768394 369945946 369853477 371030006 371674919 373023186 373997612
1429.2 373997612 375420723 376406517 378113632 379695282 381170883 383728065 385788193 387123795
1437 387123795 387671051 390449829 392586937 394716721 397438278 399041862 401230621 402757721 404689560
1445.6 404689560 406385574 408473701 409790497 410629616 413147316 414577942 416610909 418347359
1453.3 418347359 420891533 424145927 426734848 428996773 426940804 429376297 430831451 433347778
1461.1 433347778 435334053 436837311 440068016 441668549 443811989 445684891 448229637 450591431
1468.8 450591431 452873878 456543045 459592743 463647385 465411911 467654266 471133652 473832893
1476.5 473832893 475437012 477585640 480008087 481895523 483893509 485386429 487038383 488838120
1484.2 488838120 490319672 492864723 494822998 495018463 496799622 498231277 496488686 495238838
1491.9 495238838 494982338 494591026 495084877 496138458 491401253 491261444 490851555 486854210 486244278
1500.6 486244278 485403824 483972816 482513733 483423729 485286102 482610016 478395081 477325020 478232079
1509.3 478232079 477450829 478291397 478067436 475765953 475491829 474761429 474595108 473534241 470693665
1518 470693665 472160072 475258522 476403465 473934708 472644577 472584114 474195595 473848343 474060097
1526.6 474060097 475206375 475143547 475691719 477013702 478324280 479486923 481387215 479346962 479290733
1535.3 479290733 479865265 480708008 483627930 484041519 479966049 480310097 481751633 481783867 483249702
1544 483249702 484590569 481838951 482183609 482363129 483423424 483941307 482010193 482189026 482686539
1552.7 482686539 484331856 482013741 480995064 483493881 487460823 484718208 474596100 475488052
1560.4 475488052 474214096 474341202 472728233 471753693 468797188 465951843 465430908 463940773 464339752
1569.1 464339752 454479103 450309753 447843018 443703690 440839882 438102264 437353516 424004402
1576.8 424004402 421996880 418849869 414226913 410051842 403756409 399490318 393143959 388995514
1584.5 388995514 383162193 378444519 374098206 368875542 365805969 359954033 356832008 351136513
1592.2 351136513 347309380 342833023 337567444 334905739 329737854 327503662 322952766 320950432
1599.9 320950432 317619820 314633522 313039131 308633118 307048073 303072605 302085133 298993244
1607.6 298993244 297490005 296472244 293532696 294249802 292068005 292312908 290202236 290739040 291601048
1616.3 291601048 284961662 286248817 284839439 286199112 285329113 287292309 287889919 284640999 286283627
1625 286283627 286472416 289197903 287773800 288621178 289401722 290121632 291227322 291120548 294225845
1633.7 294225845 295771599 298733883 296545506 298990269 300080204 301029701 303450050 303334427 306055775
1642.4 306055775 306450329 309145966 312162018 312740917 316304874 315298710 318568153 320091400 324110985
1651 324110985 327644653 327997169 326389809 325580025 330018272 331909904 335056801 336994209 339412193
1659.7 339412193 341957550 344629517 348798294 348285332 351548309 354049454 357215691 360629044
1667.4 360629044 363931847 367570686 368936348 374421959 376824036 380761871 385351791 389130936
1675.1 389130936 391061249 393839226 398452377 401896858 406757202 409547005 414570045 422117348
1682.9 422117348 428557434 431986732 431264915 436439476 440789413 445368919 450160637 453549194
1690.6 453549194 458072128 462666512 468305626 474661636 482054863 484284515 488359184 494229164
1698.3 494229164 501310272 509370499 502465057 507930603 513153725 518083992 522206726 526087151
1706 526087151 529411430 531710129 535434227 537977524 539058037 540768280 543499107 546840172 548548584
1714.7 548548584 550064850 554350662 558629189 554738312 555762138 558617516 560709076 562525864
1722.4 562525864 562830544 562270088 563209076 564724731 565979233 568185310 571714325 572993889 573054047
1731.1 573054047 577051392 581524582 580326157 574305191 576643677 580175972 582563248 586564407
1738.8 586564407 589140587 587664680 591560669 595897369 598022194 599155159 602290726 606000137
1746.5 606000137 609039917 612017441 613116150 618148003 621474800 621958580 627085037 630920448
1754.2 630920448 634483490 638607750 639227715 640359650 642802505 645013733 649079437 649731979 649432831
1762.9 649432831 653128510 655763321 658140182 660625534 663110275 661388016 662717819 667693634
1770.6 667693634 668811874 666732330 664016647 668110580 671754608 671188507 673131866 674657822
1778.3 674657822 676890945 677624130 675834579 676060486 677581635 679862366 679758987 679805527 681690521
1787 681690521 683333359 684385147 686174698 687425537 688399658 686856079 684479904 687323074 689016495
1795.7 689016495 689139023 690134506 692322388 694101257 693257370 695188217 695225143 694928055 695801544
1804.4 695801544 695592422 696622162 697588272 697853394 698879547 701012268 700723495 701338654 702490005
1813 702490005 702091675 702790756 702664413 703206406 703091965 703577423 704883194 705149384 706614227 706604691
1822.7 706604691 707862091 710134125 708158112 707191010 708754272 711168442 712263794 708429794
1830.4 708429794 707830200 710323181 711511612 712494049 712967377 713475952 713717575 712147217 712588882
1839.1 712588882 712891464 713508377 713860245 715734329 718994141 714211884 714827194 717050171 717423096
1847.8 717423096 716897659 716416016 716817245 716369858 716782608 716886063 717607956 718561630 719265366 720305557
1857.4 720305557 720194855 720362320 720039139 720072479 719638214 719466705 719849854 720177002 721846771 722553101
1867.1 722553101 723972778 723644714 721561203 721780930 722106857 722210541 721505356 721579514 721516113 722051315
1876.7 722051315 723039780 723773117 724689026 724531479 724755859 724634628 724576645 724041214 723420181 723340149
1886.3 723340149 723010025 724794388 726144333 725089417 725056610 725934753 725947571 726211014 726218719 724865112
1896 724865112 724906693 724542847 724722595 725198135 725569839 726548691 726863098 727787399 727696533 727295456
1905.6 727295456 727263641 726920166 726319504 725857086 725659943 725175934 726474838 727232895 728134995 728703690
1915.3 728703690 728574066 730379944 728374252 726042404 726160431 726195755 727113113 727154770 726727982
1923.9 726727982 727115784 728336258 728992233 729460449 729233398 728377914 727645874 726601257 726596298 726652832
1933.6 726652832 726990814 727361984 727805023 728163910 728415527 729082184 728410416 728872986 728793488 726585007
1943.2 726585007 726387787 726570358 726529236 726531677 727348099 728112946 728400497 728083115 727510681 727198563
1952.9 727198563 726578827 726288300 726133957 726284256 726163483 726468887 726998672 727200928 727883759 727838898
1962.5 727838898 727678909 727045593 726697769 726480789 725395966 725061188 725418396 726284714 726486130
1971.2 726486130 727060165 727418213 726950455 726806030 726495743 726428909 725518494 724944000 724834290 724800339
1980.8 724800339 725465393 725992279 726785660 727181778 727141876 726461868 725923996 725032806 723661194 724061432
1990.5 724061432 724867172 724734192 724440613 725271072 725738220 725751953 725946655 725419006 724729996 723587112
2000.1 723587112 723291168 723075180 722873154 723263855 723471985 724380188 724878845 725063171 724680252 723955460
2009.8 723955460 723214645 722359161 721768494 721136627 721360092 721605148 722120972 722514648 722803040 722986450
2019.4 722986450 722471466 722493973 721760864 721203766 720159912 719123917 719366608 719406586 720087585 720468674
2029.1 720468674 720998459 721264496 720870132 720221558 719302673 718936462 718170013 718085937 717858810 717450562
2038.7 717450562 718125000 719135513 719453430 719043350 719281387 718944244 718729858 717945175 716621399
2047.4 716621399 716066513 715712814 716500015 716979370 717501144 717981567 718501358 718773422 717839813 717258148
2057 717258148 716045761 715322418 714831924 714463501 714731903 715018463 716298599 717204208 717595596 717234879
2066.7 717234879 716885376 716354370 715201340 714579086 713756256 713473206 713368530 714108276 715248108
2075.4 715248108 716020584 716711655 716471558 716411285 715623169 714536057 713529816 712606888 712546692 712862930
2085 712862930 713529663 713837509 714272614 714623108 715059891 714920883 714026413 713115234 711865997 711623154
2094.6 711623154 711331558 711444778 711852417 711983795 712799530 713172531 713177338 712522125 712020493 711370697
2104.3 711370697 710618820 710236130 709613571 709686279 709847183 710605087 711177673 711285172 711604614 711433563
2113.9 711433563 711006393 710233078 709474411 708395920 708247681 708384171 708186646 708777695 709367599
2122.6 709367599 710167847 710257187 710256500 709888992 709072266 708800278 707876816 707145615 707082748 707587128
2132.3 707587128 708001175 708749390 709637756 709929886 710137329 709622269 709101639 708310013 707880173 707623978
2141.9 707623978 707126999 707287979 707637558 708491058 708849792 709186478 709354401 709218063 709010391 708307266
2151.5 708307266 708207321 707662659 707458572 707594604 707802658 708370209 708718414 709264221 709245148 709340973
2161.2 709340973 708886490 708306198 708048859 707651978 707772903 707743454 708230438 708571625 709117584 709617615
2170.8 709617615 709543533 709401550 708986206 709067078 708416901 707980042 707876205 708090134 708580170 708361053
2180.5 708361053 709106522 709727097 709916458 709480896 709083481 708979645 708501663 708663483 708387451 708598328
2190.1 708598328 708881760 709271088 709944839 710014801 710151062 709648132 709540100 709406815 709273453 709216995
2199.8 709216995 708954010 709217148 709653549 710550842 710577774 710529861 710720596 710789185 710527725 709593048
2209.4 709593048 709672394 709618759 709602814 709813538 710280533 710638428 710383301 710902100 710789108 710338211
2219 710338211 710157623 710220337 710031891 709704056 710073166 710197601 710655823 711063843 711647797 711666183
2228.7 711666183 711125565 711048508 710604248 710425034 709913406 709788971 709862671 710013962 710550919 710721893
2238.3 710721893 711194916 711006927 710767441 710340271 709933853 709855728 709483566 709715652 710052872 710663376
2248 710663376 710872803 711047134 711197281 710980148 710958939 710547791 710415573 710055161 709926605 709913406
2257.6 709913406 710160141 710582504 710622711 711363754 711199341 710941315 710945435 710697632 710328598 709806137
2267.3 709806137 709915619 709668427 709949493 710544128 711236420 711338959 710958633 711156006 710549927 710257034
2276.9 710257034 709858856 709744873 709429245 709171295 710151062 709987793 709972763 710076828 710387878 710645828
2286.5 710645828 710267334 710257950 709668961 709711456 709655151 709719162 710121078 710400085 711249237 711455460
2296.2 711455460 711546173 711197205 710993042 711006851 710852280 710777054 710554886 711122665 711413651 712312317
2305.8 712312317 713296127 713540497 713876801 713577728 713787231 714162598 714576111 714277649 713819275 714569473
2315.5 714569473 714713440 715547943 716976700 717547989 718993607 720530548 720150681 719297638 718666153
2324.2 718666153 718449020 719363174 720067978 720335617 720885162 721233444 721340485 722599335 723152847
2332.8 723152847 722470703 722072220 721466751 721355591 720381699 720162582 721543045 722007141 722146606
2341.5 722146606 722004013 722002335 721934738 720728531 718182755 715204620 712514343 713137741 716784973
2350.2 716784973 718469315 719993134 722557373 724624557 726271439 726836166 727818909 726722412 726273651
2358.9 726273651 725261078 724792786 724202805 723962479 726044083 724244156 723258133 722025223 720722961
2367.6 720722961 719555740 717659988 717054062 714677734 713043137 711033096 709229889 708992844 708445511
2376.2 708445511 707603760 705965881 704754562 703485107 701970673 700337143 699117355 698474731 697697906
2384.9 697697906 697673874 697709427 697729568 697395248 697190781 697522049 697221756 696539001 695215683 694463654
2394.6 694463654 694645081 695013733 694872360 694469376 694543610 694496994 694816589 694458084 693906479 693398819
2404.2 693398819 692501907 692202072 691700897 691544113 691742783 692120361 692306900 692190018 692139664 691676025
2413.8 691676025 691275635 690496902 689828339 689220200 688764648 688787155 688623428 688754578 688860931 688855057
2423.5 688855057 688547134 688424759 688094635 687452545 687134705 686063766 685356445 685258865 685434723 685780563
2433.1 685780563 685923080 685976181 685633240 685309219 684761353 684183502 683314209 682640762 682429962 682216721
2442.8 682216721 682431259 682032852 681621246 681567612 681699371 681722870 681109390 680380936 679573669 679441757
2452.4 679441757 679223557 678883286 678943405 678809052 678555298 678287888 678072510 677484589 677116699 676482468
2462.1 676482468 675862503 675732727 675253601 674987335 674735718 674603653 674308243 674183273 674040756 673342743
2471.7 673342743 672753906 672097321 671718292 670859604 670490646 670622711 670308228 670448151 670120544 669664459
2481.3 669664459 669292374 669040985 668448105 667539368 667229843 666730423 666185150 665626144 665681686 665770187
2491 665770187 665489807 665443649 664946136 664319305 663394089 662632294 662131653 661606903 661154785 660881653
2500.6 660881653 660691910 660185776 660258713 660061035 659426880 658720932 658005753 657664108 657109909 656739731
2510.3 656739731 656145706 655895615 656067276 656054077 655934601 655358810 654989090 654434280 653860703 653177490
2519.9 653177490 652417526 652137222 651647415 651072388 650867615 651161194 651137924 650916977 650505295 649815216
2529.6 649815216 649313431 648673248 647956390 647146835 646948776 646804199 646710281 646853867 646624756 646407623
2539.2 646407623 645620193 645028229 644413986 643852844 643556137 642866058 642545242 642143784 642099991 642200623
2548.9 642200623 642380295 642271118 641294022 640476990 639579544 639129601 638595505 637906914 637547684 637432976
2558.5 637432976 637640610 637522583 637537041 637162361 636647949 636059723 635265427 634682426 634067879 633705635
2568.1 633705635 633168564 633292885 633395081 633104210 633063240 632631760 632265511 631640053 631138000 630333099
2577.8 630333099 629434128 629235229 629007111 628746376 628341827 628465538 628601418 628342209 627885208 627295914
2587.4 627295914 626682014 625656166 624848938 624169426 624131355 624241142 623997231 623836021 623479729 623298798
2597.1 623298798 622600174 621914177 621296425 620402527 619715157 619302101 619389076 619084930 618977890 619038048
2606.7 619038048 618607025 618237801 617761536 617030487 616290245 615492935 614485474 614029045 613791847
2615.4 613791847 613946495 614293556 614031448 613566132 612659073 611829071 610894318 610446510 610080757 609295273
2625 609295273 608984795 608344460 608171158 607704239 607363586 607586937 606917801 606448631 605617371 604608574
2634.7 604608574 604016075 603560143 602811356 602094231 602059555 601700821 601801414 601997337 601578941 600813675
2644.3 600813675 599920998 599309692 598449364 597633705 597079201 596873093 596350021 596006165 596234016 596090546
2654 596090546 595827332 594989395 594315987 593849106 593021965 592469063 592204552 591957932 591739082 591707649
2663.6 591707649 591333275 591266251 590801468 589825668 589387627 588803673 588299484 587588959 587478371 587499847
2673.3 587499847 586899796 586828880 586984024 587095222 586389427 585571251 585234070 584937477 584331856 583357162
2682.9 583357162 583012924 582761955 582653008 582529068 582175636 581803398 581223145 580853882 580524902 580115280
2692.5 580115280 579234467 578583603 578197250 578036232 578390923 578023491 577711487 577741127 577547379 576822243
2702.2 576822243 576064301 575804100 575144844 574397087 573677406 573486061 573769989 573801231 573707733 573526382
2711.8 573526382 573490219 573110466 572391281 571668510 571140213 570868683 570667343 570411491 570266609 570262451
2721.5 570262451 569875069 569716339 569545898 569194336 568696709 567864952 567436638 567349777 567597160 567216835
2731.1 567216835 566735649 567009315 567026863 566695175 566281548 566311722 565920067 565251999 564845886 564540367
2740.8 564540367 564622231 564514923 564712486 564513130 563792229 563598404 563532944 563220482 562868690 562988548
2750.4 562988548 562658501 561855507 561312218 561243553 561569023 561508942 561104546 561058159 561272507 560500031
2760 560500031 559664307 559271965 558680840 558600883 558677864 558443871 557966919 558018570 558095932 557763290 557544289
2770.7 557544289 557051086 556393509 555499763 555223579 555092735 554447441 554039650 553798141 553851929 553798981
2780.3 553798981 553578339 552571754 551376305 550986443 550600586 550441437 550346756 550067749 549527817
2789 549527817 548976212 548613358 548328056 547911835 547273674 546817360 545978889 545257645 544621048 543871994
2798.6 543871994 543170204 542451897 542426376 542091560 541538925 540999146 540040855 538892403 538111305 538052902
2808.3 538052902 537673187 537056274 536098938 535313263 534601555 533738365 533410263 532590027 531872940 531067238
2817.9 531067238 530283203 529664803 528426247 527539978 526856079 526423988 525746841 524852028 523939056
2826.6 523939056 522768860 522247009 521649284 520589180 519363594 518280449 517483749 516798706 515785065
2835.3 515785065 514641533 513920097 512727127 511450882 510006638 508551521 507085495 504715500
2843 504715500 502690506 500984879 499187050 497291908 495132675 492860641 490879097 489436188 487976151
2851.7 487976151 486740417 485545387 484709282 484413338 484410934 484448509 484157524 484269829 484396019 484372330
2861.3 484372330 483702354 482821007 482651062 482046127 481016846 479845505 478920059 478035774 477084236
2870 477084236 476493645 476059570 475790138 475159035 474272270 473358345 472833443 472290192 471379738 470834961
2879.6 470834961 470198174 469643440 469125214 468410645 467485542 466255150 464959526 463992348 463477249
2888.3 463477249 462570114 461627312 460581474 459536438 458738747 457778931 457181511 456286964 455307846
2897 455307846 454518242 453509903 452467957 451589279 450910378 450140915 449826469 449162064 448109703
2905.7 448109703 447356071 446603165 446105690 445308571 444250717 442979050 441612968 440028038 438502350
2914.3 438502350 438029976 437464867 436348877 434885254 433128738 431540604 430340195 429457283 428625488
2923 428625488 428016968 427623291 427573471 427626801 427728882 427962761 428269119 428376846 428143234 428219872
2932.7 428219872 428103981 428289261 429136276 429743614 430060654 430680618 431821899 432568665 433268585
2941.3 433268585 433715935 434028740 434708252 435107193 435660362 435904808 436353188 437298088 437965279 438545647
2951 438545647 439130745 439977531 440395279 440465317 440428505 440523796 441206398 441709175 441928291 442243080
2960.6 442243080 442973518 443741913 444306068 444783707 445474358 446421585 447066650 447616272 448038750 448639870
2970.3 448639870 449336662 450092735 451284637 452385139 452941284 453040886 453568306 454025154 454152718
2979 454152718 454218521 453961716 454291420 454746437 454766960 454962463 455543861 456100426 456180992 455999718
2988.6 455999718 455923920 455903511 455709991 455760231 455602226 455003281 454583626 454409790 454370193 454209671
2998.2 454209671 454208450 453887444 452969780 452212372 451873093 451374207 450557137 450326042 449868050 448843002
3007.9 448843002 448531723 448736992 448404541 447789040 447109337 446110497 445527000 444839897 444118996 443507195
3017.5 443507195 442686920 442347298 441812935 441070442 440283585 439731598 439374428 438490562 437317581
3026.2 437317581 436028290 435570221 435228233 434379730 433733482 433087120 432581711 432033424 431389198
3034.9 431389198 430400352 429515991 428811913 427746429 426957092 426297836 425634079 424932251 424033966
3043.6 424033966 422988243 422107239 421429863 420597382 419673424 418814392 418534317 417904205 416849976
3052.2 416849976 416202927 415140266 414090652 413572311 412920990 411893311 411006851 410460892 409907036
3060.9 409907036 408886986 407794151 407179222 406494980 406143074 405785675 405102501 404485855 403578300
3069.6 403578300 402710152 401892357 400896645 399708366 399222794 398842354 397993546 397856293 397453270
3078.3 397453270 396806602 395842438 394767265 394359665 393329201 392241745 391559486 390990639 390695076
3087 390695076 390286369 389464684 388587646 388035316 387521400 387024193 386159477 385299644 384647827 383853035
3096.6 383853035 383231392 382589111 381857224 381222038 381119766 380865135 380129662 379008560 377711029
3105.3 377711029 377329674 376659431 375408554 374447212 373731995 373246231 372777977 372457008 371769867
3114 371769867 371162720 370642281 369579582 368704033 368060570 366988487 365767174 365461884 365024033
3122.6 365024033 364148407 363898888 363316536 362284241 361496811 360906219 360079613 358757019 357508583
3131.3 357508583 357237358 357141991 356317177 355665283 354954414 354010201 353185425 352512856 351615181 350349388
3141 350349388 349714966 349296989 348552628 347935867 347496109 346824341 345990143 345348358 344616127 344025574
3150.6 344025574 343226471 342211914 341471405 340505333 339640999 339135780 338602638 338156967 337711258
3159.3 337711258 336921158 336188393 335343590 334273415 333508263 332770996 331959648 330702248 329552650
3168 329552650 329233055 329186211 329089088 328427086 327514343 326719208 326008720 325030746 323719482 323111610
3177.6 323111610 322668152 321740227 320906448 320463257 320319939 319886570 318858490 317883568 317075081
3186.3 317075081 315919056 314985771 314310741 313811989 313607464 313187218 312781315 312506542 312022495
3195 312022495 311076622 310190983 309591885 308747044 307673340 306661816 306092110 305536289 304917221 304532413
3204.6 304532413 304169788 303906269 303634377 302792568 301424694 300587769 300037098 299641953 299570694 298851795
3214.3 298851795 297893238 297413654 297172661 296589813 296071758 295822124 295029774 294102402 293052006
3222.9 293052006 292092648 291780033 291572113 291231842 290771103 290191135 289605713 288929920 288599491 288480835
3232.6 288480835 287636814 286748104 286136303 285680065 285248547 284602795 284683475 284347515 283204021 282486935
3242.2 282486935 282280540 282334137 281899548 281470909 280724735 279631119 279150753 279081001 279187260 278800144
3251.9 278800144 278511410 278294849 277573109 277093163 276532860 275744267 275310879 275049572 274451141 273964233
3261.5 273964233 273527203 273203545 273054352 272409687 272061386 271746864 271031170 270687256 270517673 270008755
3271.2 270008755 269603024 269559498 269239349 269078312 268743382 268162041 268149357 267801971 267020512 266311970
3280.8 266311970 265706711 265783272 266166725 265485115 264775639 264699802 264453678 264562054 264388103 263964863
3290.4 263964863 263865528 263650646 263120422 262530708 262230244 261780586 261681099 261320190 260483742 260090942
3300.1 260090942 260007153 260217037 259684353 259308777 259387226 258845673 258456192 258251896 258104324 257643623
3309.7 257643623 257084885 256714230 256313000 255795078 255560398 255673904 254923573 254422646 254407215 253885441
3319.4 253885441 253258896 252880630 253041897 252609158 251498890 250574150 250259342 249681377 248351192
3328.1 248351192 247922783 247843952 247727909 247671146 247288494 246663399 245857735 245491753 244952202 244490547
3337.7 244490547 244138584 243164501 242314930 241706104 241433887 241460476 241087303 240307636 239907684 239687176
3347.3 239687176 239097080 238689728 238612385 238633003 238575935 238388882 237924767 237461796 237217979 237027626
3357 237027626 237122993 236994724 236566868 236326618 236059685 235715847 235675945 235595303 235251617 235010986
3366.6 235010986 234625664 234637852 234763908 234481373 234069614 233284168 233018131 233347836 233599644 233383369
3376.3 233383369 232895164 232852402 232699928 232394943 232091331 232192631 232615852 232245083 231647339 231493759
3385.9 231493759 231645908 231792946 231641216 231640835 231952877 231933632 231765079 231902847 231931820 232013741 231906929
3396.5 231906929 231207695 230897236 231267319 231259499 231082687 231599503 231811504 231359024 231134319 231307030
3406.2 231307030 231360722 231184692 231347179 231470051 231455708 231805534 232223606 232378635 232280121 232309952
3415.8 232309952 232601299 232845001 233109360 233393803 233486786 233431892 233408127 233838902 233989811 233747139
3425.5 233747139 234065609 234225883 234385967 234709320 235037098 235445194 235489750 235910606 236169548 235995903
3435.1 235995903 236124382 236812134 237663651 237762184 237854919 238567009 239730186 239745102 239372196 240265865
3444.7 240265865 240805321 241306000 241139908 241078682 242072601 242518272 243162422 243587418 243783741 244287739
3454.4 244287739 244851513 245799828 246393871 246508598 246471043 246906395 247851582 248794727 249451752 249944077
3464 249944077 250641403 250978642 251470642 252343712 253062878 253514538 253652153 254245968 255422134 256593285
3473.7 256593285 257082787 256975250 257221603 258060780 259254303 260294018 260865974 261673088 262224541
3482.3 262224541 262315273 263651218 264471283 264366665 265569973 266948204 267319069 267368793 268062496
3491 268062496 268892231 269627762 270482349 271381969 273078518 273966923 273886948 274351578 275357914 276517982
3500.7 276517982 277595978 278607655 278752441 279134121 280081406 280972176 282052670 283521023 285011635
3509.4 285011635 285293427 285694675 286495552 287276611 287883301 288417492 289613209 290886116 292161922
3518 292161922 292917137 293717480 294963112 296531296 298115387 297980747 298378220 299824963 301240692
3526.7 301240692 302658596 303634357 304292755 305153599 306041451 306486301 307888012 309463749 311071568
3535.4 311071568 312567940 312881203 313677120 314420929 315924072 317597618 318708057 320005569 321648979
3544.1 321648979 323187180 323208542 324870720 326283417 327058258 328605766 330230751 332547493 332875023
3552.7 332875023 334135284 335814552 337362862 339891129 340835381 342117996 343575554 345268707
3560.5 345268707 346284409 347999382 349899483 350547333 355255547 358230400 358016930 357904015 357412643
3569.1 357412643 360783234 362590103 363820229 365502701 367656670 369582253 371090775 373951073
3576.9 373951073 374771767 376577988 378833961 380265350 382338066 384351921 386540604 387301102 391387558
3585.5 391387558 395607910 395487366 396780167 395824547 398277130 401212311 404283371 407155228 408097878
3594.2 408097878 411638641 411744156 413396492 417258530 418560944 421741028 423194046 424141197 426842117
3602.9 426842117 429268036 431716385 435027618 439057503 439290428 442554054 443564377 441993408
3610.6 441993408 449225578 453077164 452186890 456521378 456660538 460301628 465911751 467891769 470116692
3619.3 470116692 469873161 471244431 474403191 476948128 479709587 482986145 485915756 489559669
3627 489559669 499340172 504800720 492318039 494596519 499067230 505150948 509132423 507874680
3634.7 507874680 510131416 514569511 518659592 520324821 521988029 524629211 527559700 530264320
3642.4 530264320 531727333 534415855 538929329 547246094 550062065 545997238 553212128 556716423
3650.1 556716423 554257469 551358681 554973450 559762802 564922028 573041000 566472664 565668221
3657.9 565668221 571337776 574062462 576553497 577144203 579767380 581491928 582838440 585316391
3665.6 585316391 586772690 592301712 597202415 600082970 603036003 594730606 594639091 602988625 614104462
3674.3 614104462 619181137 601073418 598166580 604999390 611027794 609971733 609893074 612143440
3682 612143440 613844986 615520668 616451759 617395821 622091980 630897293 623902664 618861618 628837891
3690.6 628837891 623018494 620070686 625423622 626403618 628515701 629955559 630012627 630730476 630555649
3699.3 630555649 633540688 638512802 635145149 630720825 634322433 636472664 636613655 637041779 640612183
3708 640612183 647049713 639825554 642238922 650360794 635588036 636520119 641049423 641108551 641414490
3716.7 641414490 644219284 646912460 643788986 643670044 650077667 648611832 642343521 646796494
3724.4 646796494 649654083 650375443 648129501 646835556 649791336 650656738 657754974 656819687 646182632
3733.1 646182632 655459442 659610901 650388489 648704300 650584564 650865631 652294159 655510178
3740.8 655510178 651735840 653924103 668405380 666615219 642345810 649933548 656114197 663198929
3748.5 663198929 662268600 650272446 662765884 660161743 648299255 652213058 655887451 659699326
3756.2 659699326 654842377 657169876 664246292 655797119 652024689 656408997 658573685 658749847
3763.9 658749847 662903442 661591797 655510483 658217926 664498672 666289444 655342636 655757217
3771.7 655757217 659330902 659779358 661219864 660904999 661421204 661384354 664193344 665639191 657207031
3780.3 657207031 658575668 661165314 662360611 665499878 663827972 662262268 662751846 662859268 663147049
3789 663147049 662852249 662858734 662631760 662835388 662769394 664470062 669594269 667507019 661937103 663149185
3798.7 663149185 668000183 676684723 671490707 657558289 660419998 662790375 667704620 674745026
3806.4 674745026 665858459 659080658 663082657 665160446 665558701 666010284 665532074 666608658 672980347
3815.1 672980347 674207001 659122467 661987610 668241348 674535599 681131668 663369598 660941544
3822.8 660941544 665465546 666466904 669914169 671052704 665445404 664880447 667041016 670353012
3830.5 670353012 672902908 664045639 665391388 674155731 668195419 665964279 677050705 671680298
3838.2 671680298 664051056 671642532 666547318 664524918 671925812 670101013 664455490 666325455
3845.9 666325455 668089828 668472977 670446701 669472885 671578293 679610138 677108917 680124588 663391876
3854.6 663391876 659092102 669742203 669143066 665673370 666777420 669434052 674316940 669813461
3862.3 669813461 668191071 675863037 671155853 663099823 666232834 671157684 679507828 676518707
3870 676518707 662896194 663954391 670717468 677577744 667406006 664934616 668809204 668116226
3877.7 668116226 670593414 677266159 674247742 664067688 668387833 670866394 672787170 679336243
3885.4 679336243 665324783 663318634 667191010 668065948 673601303 674493637 666213760 666716309 669899673
3894.1 669899673 668147278 668566742 669536896 672879791 677275543 666270905 669525146 672493744
3901.8 672493744 666568298 671987686 669819565 667833252 667036667 665532684 667312851 667763367 668408356
3910.5 668408356 668417130 668774033 668654938 667692184 669203262 672082977 670047379 665653915 669067993
3919.2 669067993 669499435 665283585 667516632 669989395 671305847 668854752 665638046 667695389
3926.9 667695389 669018326 670074463 669091568 667409897 669786835 668440933 666125107 667080460 667177200
3935.6 667177200 667951813 668953094 668510818 667624283 666951599 668716812 671205292 667576904 664949799
3944.3 664949799 665789719 666972733 668711700 666743011 667193680 668891678 666480179 667479630 668094101
3953 668094101 667423935 667932434 668059769 668103638 667658157 667869110 667556229 668086472 668473587 666844254
3962.6 666844254 666901398 666949234 666236877 666713715 667815781 668079834 667378464 667044449 667776031 667819901
3972.2 667819901 666761780 666506119 666437073 666322174 666030807 666653214 667549667 667279968 667286301 667208710
3981.9 667208710 667590256 667286301 666456528 666586838 666605225 666552124 666615448 667543716 667626724 666899261
3991.5 666899261 666576309 666892319 667999039 667529449 667056122 667179260 667077103 667100601 667204666
4000.2 667204666
##END=$$ End of the data block
