##TITLE=$$ Begin of the data block
##JCAMP-DX=5.00 $$ ACD/SpecManager v 10.08
##SPECTROMETER/DATA SYSTEM=Varian
##DATE=14 Jan 2013 09:52:40
##DATA TYPE=INFRARED SPECTRUM
##DATA CLASS=XYDATA
##ORIGIN=
##OWNER=
##NPOINTS=3735
##FIRSTX=399.26403809
##LASTX=4000.35498047
##MAXX=4000.35498047
##MINX=399.26403809
##MAXY=73.87556458
##MINY=23.47779083
##XFACTOR=1.0000000000
##YFACTOR=0.000000100000000
##FIRSTY=44.89233780
##DELTAX=0.96440572
##XUNITS=1/CM
##YUNITS=TRANSMITTANCE
##XYDATA=(X++(Y..Y))
399.3D48923378K233582M828453O681022n737991j453781J721763k664566j0824394
407D43707466n563660J3875504Q450775o002159m019890L655510N7221p65038K575264
415.7D55970993m468193r501839k42462J1895332q871231j357002O578827L257904
423.4D53262329l297729l97606O036987L69988o637230r433480j663017Q038559J237106
432.1D47515907j361236J592331j134415j612091k81715p64008J37939p25059m22974
440.7D42944679L166924j302033J49842Q119049L382950l127900k994461r57107q45948
449.4D48535995j452217l373718Q99391L845368J812248J150246l180466n615082m235725
458.1D38386040M295883L754311n16701m774056l254356M605675O11190j662712K094117
$$ plain form
399.3 448923378 451156960 455985413 462666435 456928444 455474663 457196426 454531860 443707466
407 443707466 438143806 452019310 460470085 454467926 450448036 454103546 454160767 453395729 455970993
415.7 455970993 451502800 442000961 441758499 453653831 444782600 443425598 450004425 453262329
423.4 453262329 449964600 449566994 455603981 455973969 449336739 439903259 438240242 446278801 447515907
432.1 447515907 446154671 447747002 446612587 445000496 444718781 443954773 444092712 443367653 442944679
440.7 442944679 446111603 444809570 444959412 453078461 456461411 453333511 450339050 449381943 448535995
449.4 448535995 447083778 443710060 444609451 448454819 450267067 451417313 448236847 442621765 438386040
458.1 438386040 442681923 446436234 445919533 441145477 437891121 442496796 443107986 441445274 443539391
466.8D43539391j556969m497833k50359N601158K349358j200676n562172n223465p36466
475.5D32461967j225395J361351k33497j517868J078224j102181J27678P18003j026230
484.1D30642052l457413l425026M77562N10216J919975M160690j560402l288230J775856
492.8D27755280J089553k401886l486900j356049j978683j278191L989716L516426
500.5D25849266J913796K534027j818772n291443k166366K498436k459526l543473
508.2D17515945Q12607l5820P49474J714325j506081j366424J62048j023445k623520
516.9D14399109k643547O54144J151314l54576P84149J482773m50325k118149R49326
525.6D13854218J734504k198105k873497q98704J394348J38283r25484n32188J133041
$$ plain form
466.8 443539391 441982422 437484589 437234230 442835388 445184746 443984070 438421898 433198433 432461967
475.5 432461967 431236572 432597923 432364426 430846558 431924782 430822601 430950279 431668282 430642052
484.1 430642052 427184639 423759613 424237175 424747391 426667366 430828056 429267654 425979424 427755280
492.8 427755280 428844833 426442947 422956047 421599998 419621315 418343124 422332840 425849266
500.5 425849266 427763062 430297089 428478317 423186874 421020508 423518944 421059418 417515945
508.2 417515945 418328552 418292732 419042206 420756531 419250450 417884026 418046074 417022629 414399109
516.9 414399109 411755562 412409706 413561020 413206444 413990593 415473366 415023041 412904892 413854218
525.6 413854218 415588722 413390617 410517120 409618416 411012764 411151047 410225563 409693375 410826416
534.3D10826416K451286m4937m40178r37881l562164k474251j057778k99530Q56934
543D05317917J53007J59455L29895q06694J83677j08566l295784k802963L91464n80788
552.6C98940620k078895O8626J702347R37233L8071J269264O39000j259499j833954
561.3C98422813j644706M76570j78490o18934L75671q4915J577835J792488O19736
570D00738068J91116j685905k542878n93338K86446m27094J35308L81279R39445J438294
579.6C98860741J205406P4768j315613j650696j348533n61982Q4916J62086q10242
588.3C94700851J206360L283272J156616O28701N05981J31531r73091j559372n17159
597C98563690m72221J38778O9085L68499O33622Q48465J152381p22312k317620k950172
$$ plain form
534.3 410826416 413277702 413232765 412792587 411854706 408292542 405818291 404760513 404460983 405317917
543 405317917 405470924 405630379 405960274 405153580 405337257 405228691 401932907 399129944 399521408 398940620
552.6 398940620 396861725 396930351 398632698 399569931 399608002 400877266 401516266 400256767 398422813
561.3 398422813 396778107 397254677 397076187 396457253 396832924 396748009 398325844 400118332 400738068
570 400738068 400929184 399243279 396700401 396107063 396393509 395966415 396101723 396483002 397422447 398860741
579.6 398860741 400066147 400140915 398825302 397174606 395826073 395264091 395349007 395511093 394700851
588.3 394700851 395907211 399190483 400347099 400975800 401481781 401613312 400640221 399080849 398563690
597 398563690 398091469 398230247 398299332 398667831 399301453 400149918 401302299 400579987 398262367 395312195
606.6C95312195k135658j907998j033744J193657P96394K55356J02615L28407j15318
615.3C92795906L08113N04685k089577k075081q48236j48125O99272K162323L400956
624C94710236K751731R44710P43675J504822L7270J05057m0932o61888J131172K123680
633.6D03349533K593193K354889K555695K268715J092948J030770P42531O44226m31252
642.3D16201248q67462O66122J315079K369118L359184K951508J819534J018181P95250
651D29627762o88820j170731q29239j404647k82975J062890J572570J411858L10936
659.7D29609604n3635K3575q39996k433892k084236l22303J667366M078483K059059
668.3D31704025k645073R36699J749916J710396J645699J82800j585922q39157L12271
$$ plain form
606.6 395312195 393176537 391268539 390234795 391428452 392224846 392480202 392582817 392911224 392795906
615.3 392795906 393104019 393608704 391519127 389444046 388595810 388447685 389146957 391309280 394710236
624 394710236 397461967 398406677 399150352 400655174 400692444 400797501 400756569 400094681 401225853 403349533
633.6 403349533 405942726 408297615 410853310 413122025 414214973 415245743 415988274 416632500 416201248
642.3 416201248 415333786 415999908 417314987 419684105 423043289 425994797 427814331 428832512 429627762
651 429627762 428938942 427768211 426938972 425534325 425251350 426314240 427886810 429298668 429609604
659.7 429609604 429555969 429579544 428739548 426305656 424221420 423899117 425566483 429644966 431704025
668.3 431704025 429058952 429995651 431745567 433455963 435101662 435284462 433698540 432859383 433171654
677D33171654R62715J217041K280922L380394J731148J897964K411575O85997k51922
685.7D47487488o49719k25563J62048l58620L8185J200447K207489K805748K198792
694.4D54866295J375084L83491r00573n36576n01747p37266O3438Q50105J913414K118645
704D58894310J470108J432800J757546J083832k61231p56111m82788K54669J009026
712.7D64402161O91299O71997J845398J756744R67484R69543J451722N74073j871833
721.4D71458588j341782L67737N49354Q78373K261009K666855K071647K090988O56319
730.1D81659088j90277n8403p05872k17247N28908J082039J475372J115227Q03909
738.7D85492744J653367K308845J462326k24495r22699n71441r05571N14717Q88900
$$ plain form
677 433171654 434134369 435351410 437632332 441012726 442743874 444641838 447053413 447739410 447487488
685.7 447487488 446837769 446612206 446774254 446415634 446453819 447654266 449861755 452667503 454866295
694.4 454866295 456241379 456624870 455724297 455187721 454685974 453948708 454012146 454862251 456775665 458894310
704 458894310 460364418 461797218 463554764 464638596 464377365 463621254 463138466 463393135 464402161
712.7 464402161 465093460 465765457 467610855 469367599 470335083 471304626 472756348 473330421 471458588
721.4 471458588 470116806 470484543 471033897 471912270 474173279 476840134 478911781 481002769 481659088
730.1 481659088 481468811 481410408 480704536 480487289 481016197 482098236 483573608 484688835 485492744
738.7 485492744 487146111 489454956 490917282 490692787 489770088 489198647 488293076 488807793 489696693
747.4D89696693O19507K527161K189064Q01086O94886J303405L99704l68385n61943
756.1D97301178p29637J437912J775627J442757J373710J723519L231048K278900N12276
764.8E10347290m70123n02243j214981r95636l39966M57535K137718J209602J167298
773.5E11796494J094093K78625q59642k442856j691017o97097j81199p40737P48138
782.1E07304802K425842J962204J675186N83039R60617L18298q95500q21610k41241
790.8E13271637p62634j067505J713600J730003J181145J039276K42272P9116j660728
799.5E15766182k215691k385406k452049k247010j248169l79219j106224q16803q93135
808.2E02022476j581840k036476k213059k188301k223244k816581k618638n69839q5487
$$ plain form
747.4 489696693 490316200 492843361 495032425 495833511 496528397 497831802 498231506 497863121 497301178
756.1 497301178 496571541 498009453 499785080 501227837 502601547 504325066 507556114 509835014 510347290
764.8 510347290 509877167 509374924 508159943 507164307 506824341 507281876 509419594 510629196 511796494
773.5 511796494 512890587 513169212 512309570 509866714 508175697 507478600 507297401 506556664 507304802
782.1 507304802 509730644 511692848 513368034 513951073 514911690 515229988 514334488 513512878 513271637
790.8 513271637 512509003 511441498 513155098 514885101 516066246 517105522 517347794 517426910 515766182
799.5 515766182 513550491 511165085 508713036 506466026 505217857 504838638 503732414 502915611 502022476
808.2 502022476 500440636 498404160 496191101 494002800 491779556 488962975 486344337 485774498 485689011
816.9D85689011n76363M57191K165070J832352M03900K56729P9803N10750J057892
825.5D91876335K131272K880516L053932M104576M917641N098876L335152K814102
833.3E20212402K012406J334800K593308J782379J742058J461944J836472L415680
841E36391449L963280K867164J152993J119384O94161N03387m06952M31633J025849
849.6E47742348P22274K001496K339859L374252J726837J789666K169342K08015O32134
858.3E62706223j90011M22135J450996J734772O59447Q34312K743340R74960q24394
867E70511780j002999k43759k784271k926369k50892p96585n96276j327324m36439
875.7E60146866O39648l01475j577301j821900j437263k665940j599121j106681j029053
$$ plain form
816.9 485689011 485112648 485569839 487734909 489567261 489971161 490227890 490307693 490818443 491876335
825.5 491876335 494007607 496888123 499942055 504046631 508964272 514063148 517398300 520212402
833.3 520212402 522224808 523559608 526152916 527935295 529677353 531139297 532975769 536391449
841 536391449 540354729 543221893 544374886 545494270 546188431 546691818 546284866 546716499 547742348
849.6 547742348 548464622 550466118 552805977 556180229 557907066 559696732 561866074 562074089 562706223
858.3 562706223 562516212 562938347 564389343 566124115 566783562 567617874 570361214 571336174 570511780
867 570511780 569508781 569265022 566480751 563554382 563303490 562506905 561910629 560583305 560146866
875.7 560146866 560786514 560485039 558907738 557085838 555648575 552982635 551383514 550276833 549247780
884.4E49247780l04833K44446L83797m35104L50074n98983j615983k009239j357803
893E43904152l62244q28514O52161J132393R48562O85425j62239j488419j692657o36024
902.7E42152596j399003m38385J032296K228508K955818L449211L998299K543373J648903
911.4E58171616l2540o82525j416092k256928k189445k597771j955719j997032j045189
920E43998375j587601k026253j723251l526344m211464m924164m523468m280205l851967
928.7E13343658k821807l098603k199211r27658r09119j753959j322098j299973k076988
937.4D96934242k349968k876205j524887q54378j100273m59633O64215J018181o40488
946.1D88810806p21969o55251j170387o41518m51088n33752k82364N50766L0708j017036
$$ plain form
884.4 549247780 548942947 549187393 549571190 549136086 549486160 548887177 547271194 545261955 543904152
893 543904152 543541908 542713394 543365555 544497948 545446510 546131935 545969696 544481277 542788620 542152596
902.7 542152596 540753593 540315208 541347504 543576012 546531830 549981041 553979340 556522713 558171616
911.4 558171616 558139076 557456551 556040459 553783531 551594086 548996315 547040596 545043564 543998375
920 543998375 542410774 540384521 538661270 535134926 530923462 525999298 521475830 517195625 513343658
928.7 513343658 510521851 507423248 505224037 504296379 503387260 501633301 500311203 499011230 496934242
937.4 496934242 494584274 491708069 490183182 489328804 488228531 487768898 488433113 489451294 488810806
946.1 488810806 488088837 487433586 486263199 485621681 485170593 484636841 484354477 484905243 484935951 483918915
955.7D83918915j057167j196366k031974l047753l213196k925949k610054k548980
963.4D65287476k025414q64677q94089j391106j294632j568069k240601l024482l418084
972.1D48566322l362121l707581l897514l393746k793464l043099l476448l974266
979.8D20918083m496116m875222n540237n537567n924530o008759n483208m654769
987.6C78397675l768158m107438m003295l091507k260933l256913m014396l621445
995.3C50273590l148155k757607l214759k888756k798767k192955j926041j934433
1003C29412117j632614k179604k312469k980385k229900j991272k768898j651211n1670
1011.7C11614094q28305k430629j083527j234417j978741k591133k923050k506008
$$ plain form
955.7 483918915 482861748 481665382 479633408 476585655 473372459 470446510 467836456 465287476
963.4 465287476 463262062 462397385 461503296 460112190 458817558 457249489 455008888 451984406 448566322
972.1 448566322 445204201 441496620 437599106 434205360 431411896 428368797 424892349 420918083
979.8 420918083 416421967 411546745 406006508 400468941 394544411 388535652 383052444 378397675
987.6 378397675 374629517 370522079 366518784 363427277 361166344 357909431 353895035 350273590
995.3 350273590 347125435 344367828 341153069 338264313 335465546 333272591 331346550 329412117
1003 329412117 327779503 325599899 323287430 320307045 318077145 316085873 313316975 311665764 311614094
1011.7 311614094 310785789 308355160 307271633 306037216 304058475 301467342 298544292 296038284
1019.4B96038284k947197k009353k250347j669636j613827j548805n43766j134129
1027.1B82321224j349792k229862j016236j445885j910877r43661l03840J267166J34411
1035.8B74522648J011734K083778K684975J685581Q31089J974869M81720N36766l21350
1044.5B85491810k63634L33691j12477o17065j557179k47783j028023o36749j530419
1053.1B79832172k683525j458549j337967l86582j228637J35689Q07189J281930K517375
1061.8B77479095K460461K640076J334305J642646N50499J615181K575608J555328
1069.5B91853199K225075J425552J241264M80958J100559M15096n70602j21613q90617
1078.2B97158871K34871J085510J798897M99591Q26111J665383M64821O71615O85349
$$ plain form
1019.4 296038284 293091087 291081734 288831387 287161751 285547924 283999119 283455353 282321224
1027.1 282321224 280971432 278741570 277725334 276279449 274368572 273424911 273121071 274388237 274522648
1035.8 274522648 275534382 277618160 280303135 281988716 282819805 284794674 285276394 285813160 285491810
1044.5 285491810 285228176 285561867 285449390 284832325 283275146 283027363 281999340 281362591 279832172
1053.1 279832172 277148647 275690098 274352131 273965549 272736912 272872601 273679790 274961720 277479095
1061.8 277479095 279939556 282579632 283913937 285556583 286107082 287722263 290297871 291853199
1069.5 291853199 294078274 295503826 296745090 297226048 298326607 298741703 298171101 298049488 297158871
1078.2 297158871 297393742 298479252 300278149 300777740 301603851 303269234 303734055 304405670 305091019
1086.9C05091019J629238Q49705Q29200O71482J109219K152405J520061K437973P48406
1095.6C17038708Q50982J271706O11382P16610Q70361J999397O5651Q68492J512222
1104.2C25805511R06830K285958K190132J607742O52008P30591j14021N4893K71378
1112.9C34391022l9711J363640J362075J150856N59693O75888K670J95351L32794r58672
1122.6C39035606p5798p68203P6103R41543R77707J867256K043114K668915J628342
1131.2C48394585J951027K232284K191963K059326J767960K390900J539459K465744
1139C64993248K786026K099648K193565J672859J286354M81949q125l64991m50210
1147.6C74690323M6196Q82187R11865M35524M57153O8817L63884n8326o35453j111717
$$ plain form
1086.9 305091019 306720257 307569962 308399162 309070644 310179863 312332268 313852329 316290302 317038708
1095.6 317038708 317889690 319161396 319772778 320489388 321359749 323359146 323424797 324293289 325805511
1104.2 325805511 326712341 328998299 331188431 332796173 333448181 334178772 334064751 334119644 334391022
1112.9 334391022 334351311 335714951 337077026 338227882 338787575 339463463 339466133 339661484 339994278 339035606
1122.6 339035606 338959808 338191605 338267708 339209251 340186958 342054214 344097328 346766243 348394585
1131.2 348394585 350345612 352577896 354769859 356829185 358597145 360988045 362527504 364993248
1139 364993248 367779274 369878922 372072487 373745346 375031700 375513649 375505524 375140533 374690323
1147.6 374690323 374736519 375618706 376530571 376966095 377423248 377492065 377855949 377797623 377162170 376050453
1157.3C76050453j685676j296921j222344m68521k32696K12631J178284J864700K403908
1166C76803818J716041J715126K077942K122383K369194L035927K833405K967033L759766
1174.6C99400635L707847L886795L454132K895432K027779J723137K398414K632332
1182.4D22126503K178040J996688K300644K191315K310715J243362O38275J075287
1190.1D36060829P21321K8076n62286q38356j306572p13310j74256n6228K93922m85038
1199.7D32968102j114197j128006r25370j137199j343079j437187j868820j411896
1207.4D22602348k77824Q83827N99747L776K36969n44967q22869p44056j034317j036415
1217.1D19866219p43103k68288k16599l10363m59404m02337l36418m15496q55027j227417
$$ plain form
1157.3 376050453 374364777 373067856 371845512 371376991 371144295 371356926 372535210 374399910 376803818
1166 376803818 378519859 380234985 382312927 384435310 386804504 389840431 392673836 395640869 399400635
1174.6 399400635 403108482 406995277 410449409 413344841 415372620 417095757 419494171 422126503
1182.4 422126503 424304543 426301231 428601875 430793190 433103905 434347267 434985542 436060829
1190.1 436060829 436782150 436810226 436247940 435409584 434103012 433389702 433215446 433159218 433453140 432968102
1199.7 432968102 431853905 430725899 429800529 428663330 427320251 425883064 424014244 422602348
1207.4 422602348 422324524 423208351 423808098 423811874 424048843 423503876 422681007 421936951 420902634 419866219
1217.1 419866219 419123116 418854828 418638229 418327866 417868462 417466125 417129707 416714211 415859184 414631767
1226.7D14631767j149330j224289o40678o13823p99599l65410n85098n74799n57785
1235.4D08120956m23317m98237n32036l27454o30951l22952o637R8457L9558K7962
1245D05545349j80015n83573m79317n94978n13267m71306m68598n38482j24054M66652
1254.7D02058411J80092J92337j07232K2507j90773m92287Q3924j71585j07079J50185
1264.3D01618500R08699J266174R51614J046486J149712J143951J54992R1476R54285
1273D09285889R35173N40962R03587J313134J405105J860657J495056J340027J095505
1281.7D20175095R54551J150093J259385J663627J428642J434899J600075J691856
1289.4D31358223J169434Q44650J150665J297112J029739J38474L05480J38169K41051
$$ plain form
1226.7 414631767 413482437 412258148 411617470 411003647 410204048 409838638 409253540 408678741 408120956
1235.4 408120956 407697639 407199402 406667366 406339912 405708961 405386009 405379372 405477829 405517387 405545349
1245 405545349 405365334 404781761 404302444 403707466 403194199 402722893 402254295 401715813 401591759 402058411
1254.7 402058411 402238503 402430840 402323608 402346115 402155342 401663055 401746979 401575394 401468315 401618500
1264.3 401618500 402527199 403793373 404744987 405791473 406941185 408085136 408240128 408331604 409285889
1273 409285889 410221062 410762024 411665611 412978745 414383850 416244507 417739563 419079590 420175095
1281.7 420175095 421129646 422279739 423539124 425202751 426631393 428066292 429666367 431358223
1289.4 431358223 432527657 433372307 434522972 435820084 436849823 436988297 437293777 437431946 437672997
1298.1D37672997R71565P82280N22804O55098R10988J03683n3253k06909r17244j030312
1307.7D39411697j087379o89659k64664n4550n89371n96771k2087J34811M4861n49316
1317.4D35737572R2125L43M7150R20219P62444J217918J019096R60274J321564P67135
1327D42845840o8321m06608o18897j059875j046791q20504m23774j98899L32795P87353
1336.7D39322319K90680L77426N61028K56004n83916Q4305J142273R32121P20673O83365
1346.3D43786278J182174J385499J377487M80308l13186m94996j027870r79957j013146
1355D44382591l23143o9847P5188L35235K34452J90277j96419L62930j627731j515617
1364.6D41847916l49579q43048l33252m22402l44925k11372Q7700N19752N03579M26979
$$ plain form
1298.1 437672997 438644562 439426842 439949646 440604744 441515732 441619415 441566162 441359253 440442009 439411697
1307.7 439411697 438324318 437634659 437369995 437315445 436726074 436129303 436107216 436242027 436286888 435737572
1317.4 435737572 435829697 435830040 435877190 436797409 437559853 438777771 439796867 440757141 442078705 442845840
1327 442845840 442777519 442370911 441752014 440692139 439645348 438824844 438401070 438202171 438534966 439322319
1336.7 439322319 439612999 439990425 440551453 440807457 440223541 440307846 441450119 442382240 443102913 443786278
1346.3 443786278 444968452 446353951 447731438 448211746 447898560 447403564 446375694 445395737 444382591
1355 444382591 444059448 443989601 444064789 444400024 444634476 444824753 444628334 444991264 443363533 441847916
1364.6 441847916 441498337 440655289 440322037 439899635 439554710 439343338 439431038 439950790 440454369 440881348
1374.3D40881348m34380l10364m29802m28733n79377l11813k3384m92401n76363p91969
1383.9D36502762n90820p95136n81894k325134k552643j113052k104760k259025k006264
1392.6D22174034r09386j338386l138085j559333j637497j217270l482323m231949
1400.3D04659805k168655k495651j823540j147118k329254k627449j267319j348610
1408C89452209k034912k026748k037545j779022j965141j328659j002998p23801L9673
1416.7C76593056o50292L96195k470513j360778J183242n8899K34681j203423J25809
1425.4C72789078J220207P68890J568871J278305J184463L31116J829834J617165J029854
1434.1C83617783K466087K235832J409416N85022K897683K153472J972733K428131
$$ plain form
1374.3 440881348 440446968 440136604 439706802 439278069 438698692 438386879 438363495 437871094 437294731 436502762
1383.9 436502762 435911942 435116806 434534912 432209778 429657135 428544083 426439323 424180298 422174034
1392.6 422174034 421264648 419926262 416788177 415228844 413591347 412374077 408891754 404659805
1400.3 404659805 402491150 399995499 398171959 397024841 394695587 392068138 390800819 389452209
1408 389452209 387417297 385390549 383353004 381573982 379608841 378280182 377277184 376553383 376593056
1416.7 376593056 375942764 376338959 373868446 372507668 373690910 373632011 373866692 372663269 372789078
1425.4 372789078 374009285 374778175 376347046 377625351 378809814 379140930 380970764 382587929 383617783
1434.1 383617783 386083870 388319702 389729118 390314140 393211823 395365295 397338028 399766159
1441.8C99766159J602554K249337J232032K088662K022399J767998J266709J264495
1449.5D13260345K542763J661606K313118J336479K469635L307839K130928K618789
1457.2D31641502j365318K578812J068229K107354K138137K037011L576126J188469
1464.9D44970322J518287J867600K762642K745361K346725L591767L652420L730431
1472.6D67185555R11865L148269M217606K709389J167183K125854K328949J748200
1480.3D85542870J842308J430015J916084J762467J272964K264481J339188M60891
1488.1D97831268K714653J977654k539787j417504j21765o92177r498Q85162m384918
1496.7D94243088o5689Q7280l573647q87947j286354j848945j202774J619873L429412
$$ plain form
1441.8 399766159 401368713 403618050 404850082 406938744 408961143 410729141 411995850 413260345
1449.5 413260345 415803108 417464714 419777832 421114311 423583946 426891785 429022713 431641502
1457.2 431641502 430276184 432854996 433923225 436030579 438168716 440205727 443781853 444970322
1464.9 444970322 446488609 448356209 451118851 453864212 456210937 459802704 463455124 467185555
1472.6 467185555 468097420 471245689 475463295 478172684 479339867 481465721 483794670 485542870
1480.3 485542870 487385178 488815193 490731277 492493744 493766708 496031189 497370377 497831268
1488.1 497831268 500545921 502523575 499983788 498566284 498444519 497752342 497742844 498628006 494243088
1496.7 494243088 494177399 494264679 490691032 489803085 488516731 486667786 485465012 487084885 490514297
1505.4D90514297L59154p176285k421722J702423r51424o6375o57616k491112M7303
1514.1D78858643J31225K56157j100311l615570J246109K970237M70887j652489k37083
1522.8D77327805J83868J934166o01006r1438J222000k43759O50177J360855J557770
1531.5D83300438J882973K208213k040367l07655J60561P00264K987251J195526l041992
1540.1D87045212N69458J545181r08089R29718J051712k550544P64579O5995P48787
1548.8D89262009K77481k347298K81715J216393K639847k796822j458244K847900L944626
1557.5D93867607J060677q475342m447556k152557o1874j413689p17812k532730k963409
1566.2D72163315p34444j525688K39067r505539m367981k549553m139175l182831k874451
$$ plain form
1505.4 490514297 490873451 483697166 481275444 482977867 482026443 481960068 481302452 478811340 478858643
1514.1 478858643 478989868 479246025 478145714 474530144 475776253 478746490 479217377 477564888 477327805
1522.8 477327805 477511673 479445839 478844833 478753395 479975395 479731636 480381813 481742668 483300438
1531.5 483300438 485183411 487391624 485351257 485043602 485204163 485904427 488891678 490087204 487045212
1540.1 487045212 487614670 489159851 488251762 489181480 490233192 487682648 488447227 488513222 489262009
1548.8 489262009 489539490 487192192 487473907 488690300 491330147 488533325 487075081 489922981 493867607
1557.5 493867607 494928284 486452942 482005386 479852829 479790955 478377266 477659454 475126724 472163315
1566.2 472163315 471428871 469903183 470142250 460636711 456268730 453719177 449580002 446397171 443522720
1574.9D43522720l76968j3729897k611618k978515m529724m076577n838737m424324
1582.6D04956360o855621m213295o080704m844780l979035n210723l052445o162414
1590.3C64557343l600350n546989l955384m352913n206222l296318n433083k042045
1598C31124039m371033k397041l611718k920990j792678m360142j500683m181442j331482
1606.7C04656830l194332j444035j100845k852097M41799k759685M36020j504364O24580
1615.4B93303871P58419o643123R92775j588269J240139j004562J775970P83272k729416
1624B86889076J413021L7327K515984j631642P94106N91488P67269J309528J23806
1632.7B92809963L211422J579590L224068k393818K706814J040954O90117K650910
$$ plain form
1574.9 443522720 443145752 429415855 426804237 423825722 419295998 415219421 409380684 404956360
1582.6 404956360 398100739 393887444 387806740 382961960 378982925 373772202 370719757 364557343
1590.3 364557343 360956993 355410004 351454620 347101707 341895485 338599167 333166084 331124039
1598 331124039 326753006 324355965 320744247 317823257 316030579 311670437 310169754 305988312 304656830
1606.7 304656830 301462498 300018463 298917618 296065521 296507320 293747635 294183655 292679291 293303871
1615.4 293303871 294062290 287419167 288411942 286823673 288063812 287059250 288835220 289618492 286889076
1624 286889076 288302097 288339424 290855408 289223766 290017872 290609360 291376629 292686157 292809963
1632.7 292809963 296021385 297600975 300825043 298431225 301138039 302178993 302869110 305520020
1640.4C05520020J31549K621766L19232K496911L005447J715507L545037j168041L474407
1649.1C21661835J065902L874855M150887R35593j836892l81393M059563J573333L142624
1657.8C38246307K000618K621994K918892K772904M109077k51655L096351K094612
1665.5C57609100K851372L548279M123268M724541J550903M837151J678962M349518
1673.2C85273094M999085L811493J540336K736778M859047L527336M961854L523139
1680.9D15232162N422097P021332M744873L906517R1667N869789M907417L917542M184913
1689.6D55298309L526574M483489M535523N850410O680336P694130J551018L965836
1697.3D93585625O366920P045593O518021o161346O074371N689735M965897L897209
$$ plain form
1640.4 305520020 305651569 308273335 308592567 311089478 314094925 315810432 319355469 318187428 321661835
1649.1 321661835 322727737 326602592 330753479 331689072 329852180 329470787 333530350 335103683 338246307
1657.8 338246307 340246925 342868919 345787811 348560715 352669792 352418137 355514488 357609100
1665.5 357609100 360460472 364008751 368132019 372856560 374407463 379244614 380923576 385273094
1673.2 385273094 390272179 394083672 395624008 398360786 403219833 406747169 411709023 415232162
1680.9 415232162 420654259 427675591 432420464 436326981 436418648 442288437 447195854 451113396 455298309
1689.6 455298309 458824883 463308372 467843895 473694305 480374641 488068771 489619789 493585625
1697.3 493585625 499952545 506998138 513516159 507354813 513429184 519118919 524084816 527982025
1705E27982025M281807L128395K145462L999520K711181J173935J826744K545014L221435
1713.7E53015518J902161J210365M281349M184456m996033J403466L436317J907997
1721.4E66345596J243172P62444n6572P98568J536522J207772K107658L691864J647835
1730.1E79284859k00348L767738M829750k47726o674919J742820L643875K259560L793411
1738.8E92199020K421647j868897M059448M391785K222099J654053L267288L482704
1746.5F11829147K734337L104439J103172M813271M068680N79605M460716L785248
1754.2F36478615L805809M322586J043548J148301K309951K223816M131241O31333
1761.9F56095200n22309L781281K790985K194595K865601L366165k001038Q78449M909668
$$ plain form
1705 527982025 532263832 535392227 537537689 541537209 544248390 545422325 547249069 549794083 553015518
1713.7 553015518 554917679 556128044 560409393 564593849 559597816 561001282 564437599 566345596
1721.4 566345596 567588768 568351212 568294640 569093208 570629730 571837502 573945160 577637024 579284859
1730.1 579284859 579084511 582852249 587681999 587434273 580759354 582502174 586146049 588405609 592199020
1738.8 592199020 594620667 592751770 596811218 601203003 603425102 605079155 608346443 611829147
1746.5 611829147 614563484 617667923 618771095 623584366 627653046 628232651 632693367 636478615
1754.2 636478615 640284424 644607010 645650558 646798859 649108810 651332626 655463867 656095200
1761.9 656095200 655572891 659354172 662145157 664339752 667205353 670571518 668570480 669448929 674358597
1770.6F74358597J375732j589050l344269L858261L631897l33938K325515J390839
1778.3F81673584J712036O12106j318054M17404J468888K449493N0736l23487J807785
1787F88550491J720047R36509K102813J340027Q70133j032563k502594K827683J593628
1795.7F96406174k66800J128692K459641J800613o68487J890106o41632o23551J149140
1804.4G02633896K43072R56345Q33054P95974J231613K183075l64685l05J026688q7662
1814G09451065O97022k05536P38296R7199M20684J141434K45209J633606L76282J073532
1823.7G15668793J568069k167129r51310J731949K689820J105652m066391m69513L139343
1832.3G18249283J138458N16281N27268M68979K52151j365814M69436J0224P37991
$$ plain form
1770.6 674358597 675734329 674145279 670801010 674659271 678291168 677957230 680282745 681673584
1778.3 681673584 683385620 683997726 682679672 683097076 684565964 687015457 687066193 686742706 688550491
1787 688550491 690270538 691207047 693309860 694649887 695520020 694487457 691984863 694812546 696406174
1795.7 696406174 696139374 697268066 699727707 701528320 700859833 702749939 702108307 701484756 702633896
1804.4 702633896 702876968 703833313 704666367 705462341 706693954 708877029 708512344 708512039 709538727 709451065
1814 709451065 710148087 709942551 710680847 710778046 711198730 712340164 712585373 714218979 714595261 715668793
1823.7 715668793 717236862 715069733 714118423 715850372 718540192 719645844 715579453 715109940 718249283
1832.3 718249283 719387741 719904022 720431290 720900269 721152420 719786606 720256042 720266266 721004257
1841G21004257R00116J699677K499542m711685J228790K412796J90430r36356o40793
1849.7G23646774O22788k00501N84793J82953P31964R58634P16400R40323j84937J56403
1859.3G28155594l80783Q6975q01010n92041N32684P01904K013703P06634J487961
1868G31911621P4539k108154L4256J21460k18735q24890J72424Q3771O26907Q95920
1877.7G30769119R24759J166611r4299K00424m41742n3101l72314o97403j74637k53983
1887.3G30973434J850510Q62274j047439N19485J217575J58005J67236j26877j768264
1896G32805939j38169l29361J43052Q10165N60837Q11615L24325Q39997l44849m15421
1905.6G35068130L6011l9139k82592n69992l12195o24008J488494J039505O70548N57861
$$ plain form
1841 721004257 721904373 723604050 726103592 721391907 722620697 725033493 725223923 724287567 723646774
1849.7 723646774 724269562 724069061 724653854 724836807 725568771 726527405 727243805 728184128 727999191 728155594
1859.3 728155594 727774811 727861786 727060776 726468735 727001419 727703323 729717026 730423660 731911621
1868 731911621 731986160 729878006 729912262 730033722 729814987 728990097 729162521 729246292 729873199 730769119
1877.7 730769119 731693878 732860489 732766190 732966614 732524872 732471771 732099457 731402054 731227417 730973434
1887.3 730973434 732823944 733686218 732638779 733158264 734375839 734533844 734701080 734574203 732805939
1896 732805939 732667770 732338409 732481461 733291626 733852463 734664078 734988403 735828400 735483551 735068130
1905.6 735068130 735104141 735065002 734782410 734212418 733900223 733276215 734764709 735804214 736474762 737032623
1915.3G37032623N6916J666107k308808k238235M39224J75553O58264n74951m94919
1923.9G34411774J039200J570053L79257K79159l48205r58710l68652n76630j87530
1932.6G35239716l86124L67432M32281N37033M10309j8768O94503m28619N98068j76696
1942.3G37269135k607193j47706P53479Q3771l48816R56726O73218K24533Q1330o35300
1951.9G36303177n61829n93796k26058n10941n6839o8588K53982J052323L84369K29568
1961.6G36205368j82342l0900n04531l76664K87476n59845q00552p8965J036301P30667
1971.2G35726013O26297O3324n89371l64151n65185l12119q06274k80762l4179J24588
1980.8G33588181O49185M17480O75812J90582J4496o36291m50440p84836j328277N53283
$$ plain form
1915.3 737032623 737089539 738755646 736446838 734208603 734647827 734823380 735481644 734906693 734411774
1923.9 734411774 735450974 737021027 737400284 737679443 737331238 736372528 736003876 735427246 735239716
1932.6 735239716 734853592 735221024 735653305 736190338 736600647 736581879 737276382 736847763 737445831 737269135
1942.3 737269135 734661942 734514236 735267715 735351486 735002670 735959396 736632614 736857147 736938477 736303177
1951.9 736303177 735741348 735147552 734921494 734410553 734353714 734285126 734539108 735591431 735975800 736205368
1961.6 736205368 736023026 735992126 735487595 735110931 735398407 734838562 734038010 733959045 734995346 735726013
1971.2 735726013 736352310 736415634 735826263 735462112 734896927 734584808 733778534 733497772 733463593 733588181
1980.8 733588181 734237366 734654846 735330658 735521240 735535736 734899445 734449005 733664169 732335892 732889175
1990.5G32889175O80314j66092j38779Q47015N46646N2185J44196q36182o78100q62045
2000.1G32478333o95267m60129N2795O65970M03900O02265J00097J33362j29547m39606
2009.8G32712173r59396r43375j57775n86930j19705K30255O71463L10364L19519M81186
2019.4G31957779m80270r9717p73162p27158q88672p48978J96381J85852P84378M15802
2029.1G29822235O86646J38702m89502o21414r43527l60260p40815k93960n62058k35824
2038.7G26400223P11746Q99887P68967k55509O4240p15943p21740n37339q19702k92053
2048.4G25502777l63464N00946M66766N11627M93164M03290q1482o85272l83301j379852
2058G24985199q00476l68424J96381M98428n1651J028748P32727J78375l56598j58767
$$ plain form
1990.5 732889175 733569489 733403397 733264618 734111633 734658279 734710464 734854660 734018478 733340378 732478333
2000.1 732478333 731783066 731322937 731375732 732041702 732445602 733047867 733147964 733281326 733151779 732712173
2009.8 732712173 731752777 730809402 730651627 730064697 729944992 730175247 730846710 731157074 731476593 731957779
2019.4 731957779 731477509 731377792 730604630 729877472 728988800 728239822 728436203 728622055 729406433 729822235
2029.1 729822235 730508881 730647583 730158081 729536667 728593140 728232880 727492065 727198105 726636047 726400223
2038.7 726400223 727111969 728011856 728780823 728525314 728589554 727873611 727151871 726614532 725794830 725502777
2048.4 725502777 725139313 725640259 726107025 726618652 727111816 727515106 727433624 726748352 726365051 724985199
2058 724985199 724184723 723816299 724012680 724511108 724459457 725488205 726220932 726399307 726042709 725883942
2067.6G25883942k51770j015091q38623o91758J2436j09024M39911P67975R08585P02285
2077.3G25808868k72979J32675n95856j075134j249771o37894p3700J42365Q96759
2086G23075333J78299O30493O21795K89612m12674q80966n98984j286316l82461m47693
2095.6G20786438J29623O07376q2321L16162L75367P90100l44925j096573j026077
2104.3G20455170o90003m03671p29294K365M23584J102677L42331j8235N84183K32315
2113.9G21301422k10800j066208r50470j195526l55759J79749K33993P16019L10440
2122.6G18962860Q73871J97525J35574k67028j040955n93414o87409k48184m74396
2131.3G16858444L74222O68869P63168J176300N6229k85721o16684m73556q30384m71420
$$ plain form
2067.6 725883942 725632172 724617081 723778458 723086700 723099136 722990112 723430023 724197998 725106583 725808868
2077.3 725808868 725535889 725668564 725072708 723997574 722747803 722109909 722036209 722178574 723075333
2086 723075333 723253632 723884125 724505920 724795532 724382858 723501892 722902908 721616592 721234131 720786438
2095.6 720786438 720916061 721523437 721441116 721757278 722132645 722922745 722577820 721481247 720455170
2104.3 720455170 719765167 719361496 718632202 718634567 719058151 720160828 720503159 720484924 721069107 721301422
2113.9 721301422 721090622 720024414 719073944 717878418 717522659 717702408 717936401 718652420 718962860
2122.6 718962860 719836731 720034256 720169830 719902802 718861847 718268433 717581024 717332840 716858444
2131.3 716858444 717232666 717901535 718664703 719841003 719897232 719611511 718994827 718521271 717690887 717219467
2140.9G17219467j755k97012L73840N96695Q15506P859k5406K62603J20087j75400
2150.6G18896484j115799p11975k52609M27017M7531L58277P84225L4104M97512Q4992
2160.2G19049759J80054l49808p21054m06723k97775J73797j29013M92172K06909M66233
2169.9G18664551N51986Q5755K78168n11780k15759n40848m38156l81470J44501R26590
2179.5G18563538P0037N67399M24652L18832m39301o87713M6539m34265k1515p5455
2189.1G18332748L28980K77786L35236O23932Q6746J50528j96686q7585l78952J2283
2198.8G19485016j05133m55933K02790R0560O82068O03485M36860l28370l15246O6452
2208.4G20362549p69882j79901j58997L17993K87094L97415P30057j09711K46201l2349
$$ plain form
2140.9 717219467 717217712 716920700 717294540 717891235 718706741 718714600 718689194 718951797 719071884 718896484
2150.6 718896484 717780685 717068710 716816101 717243118 717290649 717648926 718433151 718467255 718964767 719049759
2160.2 719049759 719229813 718880005 718158951 717752228 717454453 717628250 717499237 717991409 718198318 718664551
2169.9 718664551 719216537 719302292 719580460 719068680 718852921 718312073 717873917 717492447 717636948 718563538
2179.5 718563538 718633575 719200974 719625626 719944458 719505157 718817444 718863983 718429718 718408203 718332748
2189.1 718332748 718661728 718939514 719274750 719898682 719985428 720135956 719939270 719851685 719472733 719485016
2198.8 719485016 719379883 718923950 719126740 719217300 719899368 720502853 720939713 720611343 720296097 720362549
2208.4 720362549 719592667 719412766 719253769 719571762 719858856 720256271 720986328 720876617 721122818 721090469
2218.1G21090469k23846m15192k62680k51388j67466N03922K2964L11509K48184M06799
2227.7G21263275j02844o56662l1128j92032r0332m98199q9264N1574K40250M83322
2237.4G20377960J76163P34634j15966k61689j63421j87531l84674p26471Q0109N16357
2247G20045471Q60596P8888K62680J26114m59061j06506l14636K05764n09491k46277
2256.7G19943542K73972R3155L65982J42212K66800r2392L09067l54767m40445k36588
2266.3G20270538o47278K56577k52762J09024K89536N99060O26297m5471M4174p52945
2275.9G20496750j38931l60032l00598l49273l23334P87048J10779N63126L39508J49231
2285.6G20974274k20719m56314R4147r07059l04107l13340K43149Q39157P72934Q78449
$$ plain form
2218.1 721090469 720866623 720451431 720188751 719937363 719769897 720273819 720296783 720608292 720856476 721263275
2227.7 721263275 721160431 720503769 720472641 720280609 720190277 719692078 719602814 719654388 719894638 720377960
2237.4 720377960 720554123 721288757 721172791 720911102 720747681 720560150 720175476 719449005 719529114 720045471
2247 720045471 720906067 720984955 721247635 721373749 720914688 720808182 720493546 720699310 720189819 719943542
2256.7 719943542 720217514 720310669 720676651 720818863 721085663 720993271 721302338 720947571 720507126 720270538
2266.3 720270538 719623260 719879837 719627075 719736099 720025635 720624695 721250992 721205521 721249695 720496750
2275.9 720496750 720357819 719997787 719697189 719347916 719024582 719811630 719922409 720485535 720825043 720974274
2285.6 720974274 720753555 720297241 720391388 719484329 719180222 718866882 719110031 719949188 720722122 721600571
2295.2G21600571k53373K20871q1634K8076M8752o21719k71378R0408J166306K39715
2304.9G22166595J15967P14417O88934O72302m28466P0724K62146K67105K8229l54691
2314.5G24203262Q6441K62299J519165J810150P50122N17655P10907o9962l51715l37677
2324.2G29100647k20413N85861L42255N22689M44413J000442R81903p6599L05252l23944
2333.8G32662506n86395J82648r6741j141052M95452J778412K24228J45874J50910
2342.5G33815842q98896j006698j231690k718353k959061k847976K40326M173050K732391
2351.2G29298935J671219J882171J632157K243957J51902j67008m49829M52805p11747
2359.8G36004562K69928m48227j676406J746368j83563k77024j627578k122956j603012
$$ plain form
2295.2 721600571 721347198 721568069 721486435 721514511 721563263 720941544 720670166 720760574 721926880 722166595
2304.9 722166595 722282562 722996979 723685913 724358215 723929749 724000473 724262619 724529724 724557953 724203262
2314.5 724203262 724289703 724552002 726071167 727881317 728631439 729149094 729860001 729790039 729438324 729100647
2324.2 729100647 728880234 729466095 729808350 730331039 730775452 731775894 732757797 732681198 732986450 732662506
2333.8 732662506 732076111 732258759 732162018 731020966 731516418 733294830 733519058 733664932 733815842
2342.5 733815842 732916946 731910248 730678558 727960205 725001144 722153168 722393494 726566544 729298935
2351.2 729298935 730970154 732852325 734484482 736728439 736880341 736713333 736263504 736716309 736004562
2359.8 736004562 736274490 735826263 734149857 735896225 735712662 735435638 733808060 731685104 730082092
2368.5G30082092k457809k143402k761002q61816o96793r33533j023101j139222r08508
2377.2G17156906j669769j049271j429214j530991j272659r82590r14612j261062M5852
2385.9G07092590M34800J63650k92435l29055j12839m00391o57425j313247l10593
2394.6G04275055J91116O0425j0834j26648L61863O5689O6223n20478m31747m67606
2404.2G03463058r87930o46896o86798M5776K82898N97076K51694m16336k30942o30493
2413.8G01041107n18646o52771n31159m59289j68610n8975k90985L31879K34375J36413
2423.5F99063339m48913n74417n65262p00684l74222p33490m67605m23432L45612N29175
2433.1F95650101j06125j92414n56564p8735m64173o81762q06198p19605k06451m22974
$$ plain form
2368.5 730082092 727624283 725480881 722719879 721858063 721161270 720227737 719204636 718065414 717156906
2377.2 717156906 715487137 714437866 713008652 711477661 710205002 709222412 708307800 707046738 707092590
2385.9 707092590 707527390 707691040 707398605 707069550 706956711 706556320 705898895 704585648 704275055
2394.6 704275055 704466171 704526596 704515762 704389114 704750977 704816666 704882889 704362411 703930664 703463058
2404.2 703463058 702475128 701828232 701141434 701187210 701470108 702067184 702318878 701902542 701671600 701041107
2413.8 701041107 700522461 699869690 699338531 698879242 698710632 698651657 698360672 698692551 698926926 699063339
2423.5 699063339 698614426 698040009 697474747 696774063 696399841 695666351 695198746 694775314 695120926 695650101
2433.1 695650101 695543976 695351562 694794998 694716263 694252090 693570328 692764130 692044525 691838074 691415100
2442.8F91415100J68228Q0643j18103m8447n7144m02832o44150n72891q43582j79520
2452.4F88797302o12030n05829P1717j37177L59802N5161k87933n47257o16989q66928
2462.1F85709839o97327m38232p24182j93863L5171M00315p4158l22952k35672o79245
2471.7F82779694o20346j068345p08999n28870j20010J90353j52588j82037o60477
2480.4F78928375p7362m9972o93131j054153n56183q5983q21457o56052j79062L23715
2490F75078735k41928l96805j22451n31617l53317p23648n11169q63648q64944m02756
2499.7F70066452m27551J62964O1798j29242o66046k72446p04193j125031j65634p87201
2509.3F66013870n14755l41110j64948m0741k43759n4626o69175l47061l24554l91007
$$ plain form
2442.8 691415100 691583328 691663971 691545868 691497421 691440277 691037445 690393295 689820404 688976822 688797302
2452.4 688797302 688185272 687679443 687751160 687613983 687973785 688028946 687741013 687193756 686576767 685709839
2462.1 685709839 685012512 684574280 683850098 683656235 683691406 684091721 684017563 683694611 683458939 682779694
2471.7 682779694 682159348 681091003 680382004 679853134 679733124 679923477 679770889 679588852 678928375
2480.4 678928375 678851013 678801041 678107910 677053757 676497574 676411591 675590134 674934082 674755020 675078735
2490 675078735 674836807 674440002 674317551 673785934 673432617 672708969 672197800 671334152 670469208 670066452
2499.7 670066452 669638901 669801865 669863663 669734421 669068375 668795929 668091736 666966705 666801071 666013870
2509.3 666013870 665499115 665158005 664993057 664952316 664708557 664653931 663984756 663637695 663313141 662922134
2519F62922134q52813r68628j42212l67356k80227j28479O3934k37503l64532n89753
2528.6F59054565o93435l33405j114502p28073k74200k899o0578l23715L5171k89154
2538.2F55269775j71432q49686o96716o9809n95017o97784n67627k32391l54233Q2855
2547.9F51117935N9357j87378l84140q29773n65414r82895p13501l81623j87530j22528
2557.5F46822510j26877J76163j75171m0589q61129q46177l49426q68072p31583p51800
2567.2F42247849m17862j27793J28861j60904r3231m2725n51300k78244n82810m00428
2576.8F39721413r98345j123733k67372r1134M73557j90773m12407j57242j19018n45044
2586.5F36289902r54438l31993l77884n53779j026077l45078J12877k31094K9716m43687
$$ plain form
2519 662922134 662069321 661100693 660958481 660591125 660310898 660182419 660246353 660008850 659644318 659054565
2528.6 659054565 658361130 658027725 656913223 656185150 655910950 655908051 655847473 655523758 655558929 655269775
2538.2 655269775 655098343 654248657 653551941 653482132 652887115 652189331 651621704 651389313 651035080 651117935
2547.9 651117935 651177292 650989914 650605774 649776001 649210587 648227692 647514191 647132568 646945038 646822510
2557.5 646822510 646695633 646871796 646696625 646656036 645794907 644948730 644599304 643731232 642999649 642247849
2567.2 642247849 641829987 641702194 641831055 641670151 641576920 641534195 640982895 640704651 640121841 639721413
2576.8 639721413 638723068 637599335 637331963 637240829 637714386 637523613 637111206 636953964 636834946 636289902
2586.5 636289902 635335464 635003471 634625587 634071808 633045731 632700653 632813530 632582436 632612152 632168465
2596.1F32168465l59383m73518l75481m88968q67157p76176o30036L205n53666l66935
2605.7F27280350J67198o4774j17454l91655r43718j451569p04498n95245l38326k51388
2615.4F22588921m12064L49808k93045m79088m95644q47969r94873q53157l69148m98657
2625F17695084k94724m25377k07100l21541n32913k70500p19337o24428p55577o06156
2634.7F12937431n51338o79359m08058l83492k02064m32206k04544J17417j10703r45282
2644.3F09137802j135864l79639n23834p90443q02117l46298l79944j33743K73514
2653F04919434l93258m68826n69305n08347p03697j018448r14574m78477m3831k85797
2662.6E99534874K25067O0730j70708l76205q27065k80380m04205p33452j008987l65143
$$ plain form
2596.1 632168465 631809082 631335564 630960083 630471115 629603958 628827782 628197746 628200951 627647285 627280350
2605.7 627280350 627447548 627382774 627265320 626873665 625929947 624478378 623773880 623178635 622840309 622588921
2615.4 622588921 622176857 622526665 622233620 621754532 621258888 620410919 619416046 618562889 618193741 617695084
2625 617695084 617400360 616974983 616767883 616446342 615913429 615642929 614923592 614299164 613543587 612937431
2634.7 612937431 612386093 611706734 611298676 610915184 610713120 610280914 610076370 610193787 610083084 609137802
2644.3 609137802 608001938 607622299 607098465 606308022 605505905 605159607 604779663 604645920 604919434
2653 604919434 604526176 604057350 603488045 602979698 602276001 601257553 600342979 599864502 599820671 599534874
2662.6 599534874 599759941 599820671 599649963 599273758 598446693 598166313 597762108 597028656 596019669 595654526
2672.3E95654526k16446o24237M1542j73226r8686N608l55225n96885n42641n80712
2681.9E92513618r63935m83933r4490l509m38538j50681K14386o07109o28509n13115
2691.6E88844185m12827q20083p21550r1133m43116l61633j6060K49443o6757m44145
2701.2E85716324n36308n62439n14107n75600l97911p99255m32091J92261j18904j12877
2710.9E81859093J17759L3799n85404n73349m07867o97212p39289n15938j17950K80800
2720.5E78654442J85127m15573l21617j52970j61933n47219p05375k32735l99628j24779
2730.2E75777740m25605o34537J22642L46261P9383m34494k58026n57403o16265j39732
2739.8E73259964l32909m57000k91138L46832P7477m12979k79923J81694M7073p57179
$$ plain form
2672.3 595654526 595438080 594813843 594855385 594682159 594583473 594589081 594233856 593636971 593094330 592513618
2681.9 592513618 591549683 591065750 590971260 590967751 590529213 590378532 590592918 589985809 589357300 588844185
2691.6 588844185 588431358 587611275 586889725 586798592 586355476 585993843 585977783 586227226 586160469 585716324
2701.2 585716324 585180016 584617577 584103470 583527870 583129959 582330704 581898613 582090874 581971970 581859093
2710.9 581859093 581976852 582010651 581425247 580851898 580444031 579746819 579007530 578491592 578373642 578654442
2720.5 578654442 578839569 578423996 578102379 577949409 577787476 577240257 576534882 576302147 575902519 575777740
2730.2 575777740 575352135 574717598 574840240 575186501 575265884 574831390 574573364 574015961 573399696 573259964
2739.8 573259964 572927055 572470055 572178917 572525749 572603226 572190247 571910324 572092018 572139091 571381912
2749.4E71381912m10423m46625n54886l09982n0659K76108j22376l75709k03820J47171
2759.1E69330711m57115p27768k58407l23029l76854n26466l08037j76697K79427Q9187
2768.7E66544952o31523j38092j80855o81762o79627n7831l31993j023292n19562J0071
2778.4E62310486J19247l74489o81877p70988n15137m27704n98907j89285m51737m91867
2788E57927742k51045k50168l12195o09474p87087n08232l97224j153793o47660j16119
2797.7E52894745n13115r27696j074601q9988k08588o20308m93507n49507n68466r20830
2807.3E46928139r05533p58057n09300q99887j033707m56695m55895n41687p41005
2816E40626373o68335n95207o27746j104699j272659n68924p10831j005516j072769
$$ plain form
2749.4 571381912 570971489 570524864 569969978 569659996 569609337 569885445 569763069 569387360 569183540 569330711
2759.1 569330711 568873596 568145828 567887421 567564392 567187538 566661072 566353035 566176338 566455765 566544952
2768.7 566544952 565913429 565775337 565594482 564912720 564233093 564175262 563843269 562819977 562300415 562310486
2778.4 562310486 562429733 562055244 561373367 560602379 560087242 559659538 559060631 558871346 558419609 557927742
2788 557927742 557676697 557426529 557114334 556504860 555717773 555209541 554812317 553658524 553010864 552894745
2797.7 552894745 552381630 551453934 550379333 550289345 550080757 549460449 548966942 548417435 547848969 546928139
2807.3 546928139 546022606 545264549 544755249 543855362 542821655 542364960 541909065 541367378 540626373
2816 540626373 539958038 539362831 538735085 537630386 536357727 535788803 535077972 534072456 532999687
2824.7E32999687p95898k30179k93083r00231j177978j161843j157913q32672r87739
2833.3E25462151q85697r28268j121598r45854j277504j384964j513862j340256j901512
2842E14162636k521706k039795j674804j277008j851883k166176j934471j738129j972694
2850.7D96985970k250519j346894r56573l66058l32222k25869J38894k72217J79481
2859.4D91553993j51596k31170k35825o83746p02706p54509l81393r95178j337891
2868.1D86079979r12972o99615o99577n57213l31307o74629l28026o79283j219139
2876.7D79978218q82721l95317L2044p95327j262016r98383q04176q12721j106529
2885.4D72953072r30863q04252j221314j122780n08652r40895j166687r94491j067543
$$ plain form
2824.7 532999687 532203789 531973610 531680527 530780296 529602318 528440475 527282562 526449890 525462151
2833.3 525462151 524576454 523648186 522526588 521580734 520303230 518918266 517404404 516064148 514162636
2842 514162636 511640930 509601135 507926331 506649323 504797440 502631264 500696793 498958664 496985970
2850.7 496985970 494735451 493388557 492431984 492065926 491733704 491507835 491646729 491374512 491553993
2859.4 491553993 491402397 491171227 490935402 490251656 489548950 488794441 488413048 487417870 486079979
2868.1 486079979 485167007 484467392 483767815 483210602 482879295 482204666 481876640 481197357 479978218
2876.7 479978218 479095497 478700180 478732224 477936897 476674881 475676498 474872322 474059601 472953072
2885.4 472953072 472022209 471217957 469996643 468873863 468365211 467424316 466257629 465263138 464195595
2894.1D64195595p96852n35660o43044j198730q80318q40225r44786o34041m08630
2902.8D57313309J39198j030960j594391q46786p11251p62443r36051q97979j208039
2911.4D49464607q80775j092148j478500j072197j391526j259803j417962j522102
2919.2D39349594j200905j122932r24492r18160p26776m43382j44195J76391M96483
2927.8D34541626J24283p210n6076l38440L47710L90320N32875O75849M12026M51508
2937.5D37074471N15785P84378O85539J005287P41806M60930P20673M10690L49350
2946.2D42748909J24054M71725O59676N42068Q09975O79741L22762L43437Q54912L48663
2955.8D47905922K11754L83339L86390O15731k05498K15454J404457J136627M76342
$$ plain form
2894.1 464195595 463398743 462863083 462220039 461021309 460140991 459300766 458355980 457721939 457313309
2902.8 457313309 457452507 456421547 454827156 453980370 453269119 452506676 451570625 450672646 449464607
2911.4 449464607 448583832 447491684 446013184 444940987 443549461 442289658 440871696 439349594
2919.2 439349594 438148689 437025757 436101265 435183105 434456329 434012947 433868752 434045143 434541626
2927.8 434541626 434665909 434658699 434602623 434264183 434611893 435002213 435535088 436210937 436622963 437074471
2937.5 437074471 437590256 438374634 439060173 440065460 440807266 441268196 441988869 442399559 442748909
2946.2 442748909 442872963 443344688 444004364 444546432 445356407 446036148 446358910 446702347 447557259 447905922
2955.8 447905922 448117676 448501015 448887405 449503136 449297638 449513092 450917549 452054176 452530518
2964.5D52530518N61294O06079P06139R41696M73251N69535N95665O23970O24580P48901
2974.1D58981628J156922N71976N02128K30522O7025K59132K61459N44014K5788q0147
2983.8D62520447J11809N18798O30646R003r4147J869L02429N7908j42365j32637l52173
2994.4D63431587m02336l58925J51901K22893l06129p25517o47698m58527n11474r09920
3004D59485855q54530k43988o08025o79169l50380M6845M1008n05104q86383j461830
3013.7D53984299p66373n22995o13785l72085q47397o68030n46265m12864l74565j86959
3023.3D48672981o12373j360664p91741r91478j039467o11992m64515m25606o01692
3032D41773453p18041j020698r88045q83484n21889p16171r35402q06160r43374m84887
$$ plain form
2964.5 452530518 453091812 453697891 454404030 455345726 455818977 456388512 456984177 457608147 458232727 458981628
2974.1 458981628 460138550 460710526 461212654 461443176 461510201 461769333 462030792 462574806 462600594 462520447
2983.8 462520447 462632256 463151054 463781700 463790703 463696556 463698425 464000854 464058762 463916397 463783760 463431587
2994.4 463431587 463029251 462670326 462822227 463045120 462738991 462013474 461365776 460907249 460395775 459485855
3004 459485855 458631325 458387337 457779312 457100143 456749763 456796608 456837616 456332512 455446129 453984299
3013.7 453984299 453217926 452694931 452081146 451709061 450861664 450193634 449647369 449234505 448859940 448672981
3023.3 448672981 448060608 446699944 445908203 444916725 443877258 443265266 442800751 442375145 441773453
3032 441773453 441055412 440034714 439046669 438163185 437641296 436925125 435989723 435183563 434240189 433755302
3041.6D33755302o22558q57735r15642o34460p88841j255188o34728p93800m79927
3050.3D26772423n56221j271820o55937l05481p55005j184159q38661r62715q73489
3059D19368935o71769j012611p72819o32439n85938r64279o33507j71356m65965j015205
3068.6D12443047j367951n31044q26874j122665m83589l98255p29217q13141j27487
3077.3D06042824m37546n64194p54890j198998p57866p38639n79224n95703p20558
3086C99695206q87032p29751o50902q69103l54385n46494o90994o71883o89125q18748
3095.6C92786789j120949m80690m83284o01578l30658l48472q02498j097946q27790
3104.3C86692924r48333o08826o49071j083984q30383p65076o05011k99950l64151
$$ plain form
3041.6 433755302 433132744 432275009 431359367 430724907 429936066 428680878 428046150 427252350 426772423
3050.3 426772423 426216202 424944382 424288445 423982964 423227959 422043800 421205139 420242424 419368935
3059 419368935 418697166 417684555 416911736 416279297 415693359 414729080 414095573 413924217 413458252 412443047
3068.6 412443047 411075096 410544052 409717178 408594513 408110924 407712669 406983452 406170311 406042824
3077.3 406042824 405605278 405041084 404286194 403087196 402329330 401590691 401011467 400415764 399695206
3086 399695206 398808174 398078423 397427521 396558418 396204033 395657539 394966545 394294662 393605537 392786789
3095.6 392786789 391665840 391185150 390701866 390100288 389769630 389421158 388618660 387520714 386692924
3104.3 386692924 385744591 385135765 384486694 383402710 382572327 381807251 381202240 380902290 380538139
3113C80538139p11822p41959r21554j106453o89469o03370r13277r03969p08732n51186
3122.6C72686348l86314n60456n90019r42726j067581l53203p37457j202584r64279
3131.3C65881729o10504p23000j034050p43637q07190m73518j88408n39398r75189
3140C59786835j167641r48944r97009p08886o76574o14281l32718n79986o07644o77642
3149.6C52475510p62711r19304q25538q53844j215592r42001n31311m38385r34105
3158.3C45052719j044121k21481J58234p85828j578522r69772m76723o49109j204910
3167C38280487j370506p27806m0169j59416q20389p61261n40772o59103j287155j188469
3176.6C30725441k86675m80690q73146j006088n82428p6103l98865p58362q60061q80165
$$ plain form
3113 380538139 379826317 379084358 378162804 377056351 376366882 375763512 374850235 373946266 373237534 372686348
3122.6 372686348 372300034 371739578 371149559 370206833 369139252 368786049 368048592 366846008 365881729
3131.3 365881729 365271225 364548225 363514175 362770538 361963348 361489830 361301422 360762024 359786835
3140 359786835 358619194 357670250 356673241 355964355 355287781 354673500 354340782 353760796 353153152 352475510
3149.6 352475510 351712799 350793495 349967957 349114113 347898521 346956520 346425209 345986824 345052719
3158.3 345052719 344008598 343787117 343945351 343159523 341581001 340611229 340134506 339485397 338280487
3167 338280487 336909981 336182175 336142006 335982590 335162201 334400940 333860168 333201065 331913910 330725441
3176.6 330725441 330438766 329958076 329084930 328078842 327496414 327420311 327021446 326263084 325403023 324522858
3186.3C24522858r66797n40428n06935q59223o44264n58090m93470n65643p63969o86245
3195.9C17937794n98202j103783j135235o81037p16324j66455k37789r16805o95572
3204.6C11686592l88775o02035p77436o69479q79822o93283p70321r92832l21236m27646
3214.3C05163727n76496n9777n10921j099472n84068l67623m68387l93410r73492j054478
3223.9B99075603l49693j20811q02975j093750m47216k38380l74756m03309m82311
3232.6B94762402p25975n70908n11169q28209p85771o41804k55870l35541n02110l63788
3242.2B89241257m00811l32393q15201o19316J72481j47514p09858o66332q16879p91130
3251.9B84114304j8883k26536o32858m14925n17921m71459n61905p10201m91466k77291
$$ plain form
3186.3 324522858 323556061 323015633 322508698 321649475 321005211 320447121 319953651 319388008 318624039 317937794
3195.9 317937794 317339592 316235809 315100574 314419537 313703213 313536758 313298969 312382164 311686592
3204.6 311686592 311297817 310695782 309918346 309248867 308369045 307675762 306905441 305912609 305591373 305163727
3214.3 305163727 304587231 304527454 304016533 302917061 302332993 301965370 301496983 301103573 300130081 299075603
3223.9 299075603 298725910 298605099 297802124 296708374 296261158 296022778 295648022 295244713 294762402
3232.6 294762402 294036427 293465519 292954350 292126141 291340370 290698566 290442696 290107155 289605045 289241257
3242.2 289241257 288840446 288508053 287692852 287073536 287246017 287098503 286388645 285722313 284905434 284114304
3251.9 284114304 284095421 283868885 283236027 282821102 282303181 281831722 281269817 280559616 280068150 279790859
3261.5B79790859k96516r9697k29683o97975l93620k77500o09856n54676j00441k58064
3271.2B76272831n85098n5352m43439p72991L8605k23465n20287k30446n19581m02393
3280.8B72558384m78058l56750o8074p23552j01624J53465m25911m84809o41137J69888
3290.4B69601822L1071o64292p83405n18665k9583m92707K3918l6106o94255k36760
3300.1B66201038k66437j93138l64628n76821m00142j36566k10801n38768k82688m51527
3309.7B62779522m09031k04048m02622l38612l82404n79300o82926m72699l77140k62737
3319.4B58668003m96788o82583J22223q8501o92501m64191p61814r18408n36308m14696
3329B53734436m78401n43995l95947k01568n46513r30137n08786m69951r23538n74284
$$ plain form
3261.5 279790859 279494343 279394646 279164963 278466988 278073368 277795868 277186012 276631336 276530895 276272831
3271.2 276272831 275687733 275632381 275188942 274415951 274454556 274231091 273710804 273480358 272960777 272558384
3280.8 272558384 272080326 271723576 271655502 270931950 270830326 270983791 270557880 270073071 269431934 269601822
3290.4 269601822 269632893 268968601 268185196 267666531 267636948 267144241 267168159 267132053 266437798 266201038
3300.1 266201038 265934601 265741463 265376835 264800014 264399872 264263306 264052505 263513737 263231049 262779522
3309.7 262779522 262370491 262166443 261763821 261425209 261042805 260463505 259780579 259307880 258930740 258668003
3319.4 258668003 258171215 257488632 257610855 257522354 256829853 256365662 255603848 254685440 254149132 253734436
3329 253734436 253256035 252712040 252316093 252114525 251568012 250637875 250129089 249659138 248735600 248161316
3338.7B48161316o42986m56734j44711p77130j48563J84612n22480o84032m25644k2946
3348.3B44520702m15935l60165l6297k55680n58910m65603K53639r6225n16110n06496
3357.9B41562920m67034j36490j15471k97279p16667l10497k33212l75461L97281l872
3367.6B39304218o58683k99321P1602j87511l40996k1572O2809l83949o37246l07731
3377.2B36601620J7490L88336l11317l75881M48398j31340j18103j62773m67129j42402
3386.9B35746899J0223r0504l69835K47841L75634k19479j42231K422l7403J26610
3396.5B35650177M9267l11928j66721k65198O8798K68345R5539K4433o09913k4891
3406.2B34777908K44732J76544L94593j91307o3973J40305P9097j98326L17917Q69236
$$ plain form
3338.7 248161316 247518330 247061596 246916885 246139755 245991192 246175804 245653324 244969292 244543648 244520702
3348.3 244520702 244104767 243744602 243708305 243452625 242893715 242428112 242681751 242585526 242069416 241562920
3357.9 241562920 241095886 240959396 240843925 240546646 239829979 239519482 239286270 238910809 239308090 239304218
3367.6 239304218 238645535 238346214 238417816 238230305 237889309 237867737 237930546 237546597 236909351 236601620
3377.2 236601620 236619110 237007446 236696129 236320248 236768646 236637306 236519203 236356430 235889301 235746899
3386.9 235746899 235757122 235666618 235296783 235544624 235920258 235700779 235558548 235560970 235523567 235650177
3396.5 235650177 235699444 235387516 235220795 234955597 235024395 235292740 235388279 235412712 234802799 234777908
3406.2 234777908 235022640 235199184 235593777 235402470 235338497 235478802 235557899 235359573 235677490 236546726
3415.8B36546726P5817j65119P8659N53532K56100j26687L41588R1667p5703L19710
3425.5B37896290N88779M94919L61290r6359j18618J34620K94972O67400J00003r3499
3435.1B40229797K84348P62691N02606q2627M84505N19982P04402N17312n207j26210
3444.7B43791599M57478J522140J83678j11256M81511M87403R17702L69358L49579
3453.4B48449192M81358M37793O22292Q13751N43156L72639J027565O98413N11017
3462.1B53957176L32031K61136P07054O48307N38312L032M36268Q53043O13651P88021
3471.7B59138031J007080J388607Q62713J52283M02565O33297M03576P25441R68933
3480.4B65682526O24256P14874O81458J063861P48864N37586J460018J112270M17443
$$ plain form
3415.8 236546726 236622543 236457424 236536083 237089615 237345715 237219028 237560616 237652283 237576580 237896290
3425.5 237896290 238485069 238979988 239341278 239244919 239126301 239260921 239555893 240223293 240323296 240229797
3435.1 240229797 240514145 241276836 241779442 241696815 242181320 242701302 243405704 243923016 243917809 243791599
3444.7 243791599 244249077 245771217 245954895 245843639 246325150 246812553 247730255 248099613 248449192
3453.4 248449192 248930550 249368343 249990635 250804386 251347542 251720181 252747746 253446159 253957176
3462.1 253957176 254289207 254550343 255257397 255905704 256444016 256447048 256883316 257736359 258350010 259138031
3471.7 259138031 260145111 261533718 262396431 262548714 262951279 263584576 263988152 264713593 265682526
3480.4 265682526 266306782 267021656 267703114 268766975 269515839 270053425 271513443 272625713 273043156
3489.1B73043156O99653P86915L13416P42664O60133M27380J481361J048584K87819
3497.8B79491081M38214Q44345R17988J480464J874371L64819M25090P72496P48729
3506.5B87357597J017838J358108J125985L9081J056328J017570O44589J043739R59130
3515.1B95619965J192340Q59242J251221J293182Q76827R66988J233444J384392Q13904
3523.8C05491505J028461J002312Q13522Q35667J308441R27086P19204J373005R03873
3532.5C14403076J594200J318589J073379J154900K77862J412277J849900J885109
3540.2C24969292J202392R78394J323738K036285K399826M66805J309891M15306Q42285
3548.9C35944214J965103J652222K571144O5040J165276K178459J548424J860657N59692
$$ plain form
3489.1 273043156 273742809 274529724 274843140 275585804 276245937 276673317 278154678 279203262 279491081
3497.8 279491081 279929295 280773640 281691628 283172092 285046463 285411282 285836372 286608868 287357597
3506.5 287357597 288375435 289733543 290859528 290898609 291954937 292972507 293617096 294660835 295619965
3515.1 295619965 296812305 297671547 298922768 300215950 301092777 302059765 303293209 304677601 305491505
3523.8 305491505 306519966 307522278 308335800 309171467 310479908 311406994 312126198 313499203 314403076
3532.5 314403076 315997276 317315865 318389244 319544144 319822006 321234283 323084183 324969292
3540.2 324969292 326171684 327150078 328473816 330510101 332909927 333376732 334686623 335101929 335944214
3548.9 335944214 337909317 339561539 342132683 342197723 343362999 345541458 347089882 348950539 349510231
3557.6C49510231J745186J971512J883735J122971J967545K349510P28111M199638
3565.3C65478439K589493Q78716J221695j241990K638550J959572J405563J792565
3573C76722603J602020J937065K214661K759704J450310K235642K125435J092033J053009
3581.7C93192482J823883K549324J484299M609909L913383K6474J242791q68721K866401
3590.4D10840225L621826L692513K737694J048774L521538o86264J827927M628868
3598.1D31233101J357651K973289J369782J361847L323898K211227K453003L300743
3605.8D49584541L501778M92783L298034P19338p09839Q006782L254204j674385M651756
3614.5D71124992q9264L621941O217308K566528J833497j135254J165504L983040L705521
$$ plain form
3557.6 349510231 351255417 353226929 355110664 356233635 358201180 360550690 361278801 365478439
3565.3 365478439 368067932 368946648 370168343 368926353 371564903 373524475 374930038 376722603
3573 376722603 378324623 380261688 382476349 385236053 386686363 388922005 391047440 392139473 393192482
3581.7 393192482 395016365 397565689 399049988 403659897 407573280 407599754 408842545 407973824 410840225
3590.4 410840225 414462051 418154564 420892258 421941032 425462570 424776306 426604233 431233101
3598.1 431233101 432590752 435564041 436933823 438295670 441619568 443830795 446283798 449584541
3605.8 449584541 453086319 453579102 456877136 457596474 456886635 464893417 468147621 466473236 471124992
3614.5 471124992 471035728 474657669 480874977 483441505 485275002 484139748 485305252 489288292 492993813
3623.1D92993813K900199L620873L897629L550567Q288346L596916j0464859K457924
3630.9E10841408M017982N983658L545418p89490K804184M540558M083862J252251
3638.6E36279831J781197L367767L021622K304534J820717L160973M378891P716675
3646.3E63832207K978248k409897P047806K666626m010849l801002M824371N411491
3654E76539001M969025P610741p237625L37982O268082K520408K743416M62990K179489
3662.7E96393509J857986J727982K662506J500664N349922M130592K133866K439613
3670.4F18196640q160667N47866Q786316J2159081M749908k0370712j329613P280731
3678.1F21859550N788537j432419l31726K522125K216759K055435R24873O17905M504394
$$ plain form
3623.1 492993813 495894012 499514885 503412514 506963081 515251427 518848343 508383484 510841408
3630.9 510841408 514859390 520843048 524388466 523598976 526403160 530943718 535027580 536279831
3638.6 536279831 538061028 541428795 544450417 546754951 548575668 551736641 556115532 563832207
3646.3 563832207 566810455 564400558 571448364 574114990 570104141 566303139 571127510 576539001
3654 576539001 581508026 589118767 581881142 582219124 588487206 591007614 593751030 594214020 596393509
3662.7 596393509 598251495 599979477 602641983 604142647 609492569 613623161 615757027 618196640
3670.4 618196640 610035973 610583839 619370155 631529236 636279144 615908432 614578819 621859550
3678.1 621859550 627648087 626215668 625883942 628406067 630622826 632678261 633603134 634221039 638725433
3686.8F38725433Q959580p599716n700989J0508804m860458k950745M966660J089325
3694.5F43137894K021560Q33741L25851J019592m40826K599716M725113l104095m430619
3703.2F46687927L529358K541962J211777O10275K335129N945968o336365K860947
3710.9F59386978P237320j5172806J384735L964539L40958P51037K513809K671967
3718.6F63078537l103790N5847O074829j860580n235825M920654K256775l39813k240143
3727.3F63606491m57611L630447Q74100O536942j062851j0376282R307709L553161
3735F75612106r797210j196595J975937l76510J378021L758163m010391K279282J4699859
3743.7F84322662k936782k3707963P901841O292419O772232j811676j2151108J2988510
$$ plain form
3686.8 638725433 647685013 640085297 634384308 644893112 640032654 637081909 642048569 643137894
3694.5 643137894 645159454 645993195 646319046 647338638 646897812 649497528 654222641 651118546 646687927
3703.2 646687927 650217285 652759247 653971024 654581299 656916428 662862396 656526031 659386978
3710.9 659386978 666624298 651451492 652836227 656800766 657141724 657892761 660406570 663078537
3718.6 663078537 659974747 660030594 666105423 664244843 659009018 663929672 666186447 665846634 663606491
3727.3 663606491 663148880 666779327 667653427 674190369 673127518 662751236 672058945 675612106
3735 675612106 665814896 664618301 666594238 666217728 667595749 671353912 667343521 669622803 684322662
3743.7 684322662 681385880 657677917 665579758 671872177 678644409 676832733 664681625 677670135
3751.4F77670135k894134j2017365N366974M654694M589691n727081N41687P614059
3759.1F79798660o920929l402939L775788J612243N88913M003525j857605o249389
3766.8F71348267K827606N983734J692734j0252457K02866L671188M29077J294098
3774.5F77197113l44086P14569N71442L006668J327820r045029J174393K730103J765060
3783.2F79098053L591461l028030k616501Q32291Q48083P55081J3199J4420n74189
3791.9F78933868m6997m10995K120056N666885k650146o115112J257934N203171Q952484
3800.6F92911148m260788j3960419K464295J944122M449768P587433q605499o971283
3808.3F75558777L998031J825638j62048k68707Q0795K453079P580948J057129j7345886
$$ plain form
3751.4 677670135 674776001 662758636 668125610 672780304 677369995 671642914 672184601 679798660
3759.1 679798660 672877731 669474792 673250580 674862823 675451736 679455261 677597656 671348267
3766.8 671348267 674175873 680159607 681852341 671599884 671802750 675473938 675903015 677197113
3774.5 677197113 676853027 677567596 678139038 681145706 682473526 673428497 674602890 677332993 679098053
3783.2 679098053 682689514 679661484 677044983 677877274 678725357 679480438 679493637 679508057 678933868
3791.9 678933868 678886871 678475876 680595932 686262817 683612671 677497559 678755493 683958664 692911148
3800.6 692911148 688650360 674689941 677154236 679098358 683548126 691135559 682530060 675558777
3808.3 675558777 679556808 681382446 681220398 680951691 681032486 683485565 691066513 692123642 674777756
3817F74777756L056335P389221O824189N352707j8774491l177872M512787K079010
3824.7F82039642L232422Q53043m587860q13065J571045L994827L788529q436966R90295
3833.4F82631912P853012o350708j553192J1325379o716080q452988Q512268n130920
3841.1F82118683k394409P741241j656494n509644J659775J764984J144944K313156
3848.8F87182236r78699J683273O708451j382904N144653k0068512m673691J1314163
3856.5F84928970J99509l134918J092148K818451M339447n358963r30024Q627777m643096
3865.2F87939301q639985L340073N732727P858353n484391j3051071J806870O970825
3872.9F86472702O569977r613724k246551L257598j65786K935104O460800l940506
$$ plain form
3817 674777756 677834091 685223312 692047501 697400208 678625717 675447845 679960632 682039642
3824.7 682039642 685272064 686125107 681537247 680724182 682295227 686290054 690078583 681641617 682631912
3833.4 682631912 690484924 684134216 682581024 693906403 687190323 678737335 687249603 682118683
3841.1 682118683 679724274 687465515 685809021 680299377 681959152 683724136 684869080 687182236
3848.8 687182236 686203537 687886810 694595261 693212357 698357010 678288498 673614807 684928970
3856.5 684928970 685128479 681993561 683085709 685904160 690243607 684884644 683954620 692582397 687939301
3865.2 687939301 679299316 682639389 688372116 696230469 690746078 677695007 679501877 686472702
3872.9 686472702 693042679 683428955 681182404 684440002 684274216 687209320 693670120 689729614
3880.6F89729614j0707855M905777K187729J696014O508408j3789902j066208L945465
3888.3F83409042N89295N356369J333999p957229j87683L118286j765137n6152J413650
3897F85254440M079895L245774j1637802M765472M640961n776062L954239l538971
3904.7F84987946k119751J42593l52631J829224k85187M06647J7929l64914L2730n5923
3914.4F84238663J468811K952652j807480m492035L290100q3542m679489K298279K865066
3923.1F86051025J759720j969986l927841J566238K007065Q45032j578751j149368
3930.8F83603134L005371j635895k563018J306610k43454L36456P42111m68826m09393
3939.5F83673096n11551J900329K114487l806763j851272Q05282J243973K316590j812821
$$ plain form
3880.6 689729614 679021759 683927536 686115265 687811279 694319687 680529785 679463577 683409042
3888.3 683409042 683998337 689354706 690688705 682731476 682543793 685662079 683896942 683840790 685254440
3897 685254440 689334335 692580109 680942307 685707779 690348740 684572678 688526917 684987946
3904.7 684987946 682868195 683010788 682658157 684487381 684202194 684608841 684626770 684261856 684294586 684238663
3914.4 684238663 685707474 688660126 686852646 682360611 685650711 685567169 680887680 683185959 686051025
3923.1 686051025 687810745 685840759 681912918 683479156 685486221 686331253 684752502 683603134
3930.8 683603134 686608505 684972610 682409592 683716202 683472748 683809204 684551315 684082489 683673096
3939.5 683673096 683161545 685061874 687176361 683369598 681518326 682323608 683567581 685884171 684071350
3948.1F84071350o2637P17926k396851J248398K85263l05405P05185p2097Q6822p83081
3957.8F83494873K2812r9869R41620P25708k052002m12674O44684j64490n41076M99801
3967.4F83059387Q48465l22952n77927K35672O09513p04804p38449J00250N41687P6065
3977.1F83126907k42614K17514l21045L6697N05982K97546k39029k20108J59378L12881
3986.7F83634109L46985m59060N32913K31094j016693k35901K87476P20596k56882
3995.4F83784637m6920O70852k15835l2654L70407
4000.2F84530487
$$ plain form
3948.1 684071350 684008713 684726639 682329788 683578186 683863449 683558044 684263229 684191132 684277954 683494873
3957.8 683494873 683517685 683417816 684359436 685085144 683033142 682620468 683265152 683100662 682559586 683059387
3967.4 683059387 683907852 683584900 683006973 683242645 683852158 683147354 682408905 682509155 683050842 683126907
3977.1 683126907 682884293 683101807 682780762 682817459 683323441 683620987 683381958 683161850 683321228 683634109
3986.7 683634109 683981094 683522034 684054947 684286041 683269348 683033447 683320923 684041519 683784637
3995.4 683784637 683737717 684408569 684192734 684160080 684530487
4000.2 684530487
##END=$$ End of the data block
