##TITLE=$$ Begin of the data block
##JCAMP-DX=5.00 $$ ACD/SpecManager v 10.08
##SPECTROMETER/DATA SYSTEM=Varian
##DATE=14 Jan 2013 10:21:46
##DATA TYPE=INFRARED SPECTRUM
##DATA CLASS=XYDATA
##ORIGIN=
##OWNER=
##NPOINTS=3735
##FIRSTX=399.26403809
##LASTX=4000.35498047
##MAXX=4000.35498047
##MINX=399.26403809
##MAXY=72.21314240
##MINY=19.16264725
##XFACTOR=1.0000000000
##YFACTOR=0.000000100000000
##FIRSTY=41.38425064
##DELTAX=0.96440572
##XUNITS=1/CM
##YUNITS=TRANSMITTANCE
##XYDATA=(X++(Y..Y))
$$ plain form
399.3 413842506 404077301 393730125 388864212 383584251 389811859 397027397 399740410 401238098
407 401238098 399864845 394002686 389823532 396140671 403486824 406150894 398647690 390772552 396577454
415.7 396577454 402120171 401524391 410212975 415418167 399249802 394562874 391958771 389824677
423.4 389824677 393447952 396486740 399525185 398263969 394482002 394542198 396959076 395631599 390403976
432.1 390403976 387194633 387338409 391474838 396583138 397963600 393365211 391132698 391904907 392581100
440.7 392581100 395883904 396043205 397203751 396912575 396673470 399785080 395493240 391751060 388479195
449.4 388479195 386331482 387150764 385164833 386495018 390278206 392006912 391223106 389498329 389945564
458.1 389945564 388514557 387809601 387864952 384834251 383909569 385855331 385665207 386579933 386171074
$$ packed form
399.3D13842506r765205j0347176m865913n279961O227608P215538K713013J497688
407D01238098j373253n862159m179154O317139P346153K664070p503204p875138N804902
415.7C96577454N542717n95780Q688584N205192j6168365m686928k604103k134094
423.4C89824677L623275L038788L038445j261216l781967O0196K416878j327477n227623
432.1C90403976l209343J43776M136429N108300J380462m598389k232513P72209O76193
440.7C92581100L302804J59301J160546k91176k39105L111610m291840l742180l271865
449.4C88479195k147713Q19282j985931J330185L783188J728706p83806j724777M47235
458.1C89945564j431007p04956N5351l030701r24682J945762j90124R14726m08859
$$ plain form
466.8 386171074 383637810 380979347 382485390 389077682 387191544 383343048 386997147 383022461
474.5 383022461 377776566 380535240 382555771 376505203 375528069 378289299 378331604 378155861 376087189
483.2 376087189 377699242 380403023 378194237 372086067 367503204 368814507 371290512 372573929
490.9 372573929 374519730 375910988 374071655 372853661 374656906 374532318 373175812 370962982 369215050
499.6 369215050 368411560 368720245 372920914 372380714 369344749 369233093 368819923 367092094 366486931
508.2 366486931 368719482 369150848 366156769 365770531 367328682 367426643 365797310 365219917 365439186
516.9 365439186 365439796 364339447 361269073 361119576 360525551 358188629 357853584 358204803 359994431 360542908
526.6 360542908 358980484 357587433 357474480 358272896 357287903 357050018 357912407 357737122 357418633
$$ packed form
466.8C86171074k533264k658463J506043O592292j886138l848496L654099l974686
474.5C83022461n245895K758674K020531o050568r77134K761230M2305j75743k068672
483.2C76087189J612053K703781k208786o108170m582863J311303K476005J283417
490.9C72573929J945801J391258j839333j217994J803245j24588j356506k212830j747932
499.6C69215050q03490L08685M200669n40200l035965j11656m13170j727829o05163
508.2C66486931K232551M31366k994079l86238J558151R7961j629333n77393K19269
516.9C65439186O10j100349l070374j49497n94025k336922l35045L51219J789628N48477
526.6C60542908j562424j393051j12953P98416r84993k37885Q62389j75285l18489
$$ plain form
535.2 357418633 356597557 354493980 353752632 355356216 356458015 355576477 353617210 353560715 353863564
543.9 353863564 353490181 353406334 351886826 350816154 349829559 348413239 347482605 347910385 348582420
552.6 348582420 347431679 346993217 345955467 344794540 344154472 342775993 342864914 343490944 343757324
561.3 343757324 344384003 345770607 346018524 346083717 346140442 344959488 346570244 347999077 345813828
570 345813828 343586998 343405113 344182739 344245605 344020538 343563881 344085236 344375114 343911972 344026375
579.6 344026375 343178139 341936073 341930237 342849617 343231468 342909966 343113136 343430328 343931351 345054626
589.3 345054626 345217209 344476357 344847832 346132240 346962242 345957642 345292435 346418724 347422791
597.9 347422791 347756615 347053680 346466217 345780296 344754333 343975334 344034958 345672112 345779114 344419136
$$ packed form
535.2C57418633q21076k103577p41348J603584J101799q81538j959267n6495L02849
543.9C53863564l73383q3847j519508j070672r86595j416320r30634M27780O72035
552.6C48582420j150741m38462j037750j160927o40068j378479Q8921O26030K66380
561.3C43757324O26679J386604K47917O5193N6725j180954J610756J428833k185249
570C45813828k226830j81885P77626O2866k25067m56657N21355K89878m63142J14403
579.6C44026375q48236j242066n836R19380L81851l21502K03170L17192N01023J123275
589.3C45054626J62583p40852L71475J284408Q30002j004600o65207J126289J004067
597.9C47422791L33824p02935n87463o85921j025963p78999N9624J637154J07002j359978
$$ plain form
607.6 344419136 343280716 342409172 342012978 341570511 340794373 339658356 340071487 339928513 338261719
616.3 338261719 337825623 337541313 337594261 338563499 339424019 339150887 339104881 340004692 341024246 342084236
625.9 342084236 342949028 344317741 345532913 346810150 348668442 350014801 350529823 351139183 352953987
634.6 352953987 355887680 357621002 356917763 357669106 359905167 360515137 360867348 361927490 363344078
643.3 363344078 364617043 365594177 366202049 367388382 369197235 369901772 370504990 371379890 371017303
651.9 371017303 370052376 370164642 371652145 373541641 374331703 374196434 374175339 373740158 373169403 372622948
661.6 372622948 371956863 371963120 372098083 372183113 373122406 372766151 367323227 370147324 372677765 374327240
671.2 374327240 375544662 375777092 375941887 375942078 377480659 380158272 381011276 381480942 383302193 385247993
$$ packed form
607.6C44419136j138420q71544l96194m42467p76138j136017M13131j42974j666794
616.3C38261719m36096k84310N2948R69238Q60520k73132m6006Q99811J019554J059990
625.9C42084236Q64792J368713J215172J277237J858292J346359N15022O09360J814804
634.6C52953987K933693J733322p03239P51343K236061O09970L52211J060142J416588
643.3C63344078J272965R77134O07872J186333J808853P04537O03218Q74900l62587
651.9C71017303r64927J12266J487503J889496P90062j35269k1095m35181n70755n46455
661.6C72622948o66085O257J34963Q5030R39293l56255n442924K824097K530441J649475
671.2C74327240J217422K32430J64795J91J538581K677613Q53004M69666J821251J945800
$$ plain form
680.9 385247993 385797119 386193237 387495346 388644791 389731140 391019897 391471367 391863708 393191223
689.6 393191223 394339714 395892258 397032738 397018471 397360001 398444939 400232315 400566063 399378204
698.2 399378204 399870491 401901131 403213959 403545265 404240227 405109215 405262337 405202675 406349945
706.9 406349945 407959633 408300438 408930435 410773582 411763344 411765366 412507133 413824005 414523239 414402428
716.6 414402428 414769211 415466995 415692291 416505470 417551422 418196182 418610191 419466667 420905914
725.2 420905914 421665421 421910362 422733231 424322128 425354691 426394997 428005714 428670998 429045143
733.9 429045143 429375267 429224663 429245529 429646912 429784355 429997940 430951118 431850204 432369461 432802429
743.6 432802429 433954086 435810928 436557121 435717087 435444069 436564903 437496414 438080292 438925667
$$ packed form
680.9C85247993N49126L96118J302109J149445J086349J288757M51470L92341J327515
689.6C93191223J148491J552544J140480j4267L41530J084938J787376L33748j187859
698.2C99378204M92287K030640J312828L31306O94962Q68988J53122n9662J147270
706.9D06349945J609688L40805O29997J843147R89762K022P41767J316872O99234j20811
716.6D14402428L66783O97784K25296Q13179J045952O44760M14009Q56476J439247
725.2D20905914P59507K44941Q22869J588897J032563J040306J610717O65284L74145
733.9D29045143L30124j50604K0866M01383J37443K13585R53178Q99086N19257M32968
743.6D32802429J151657J856842P46193q40034k73018J120834R31511N83878Q45375
$$ plain form
752.2 438925667 439923782 440985756 442060471 442203140 442345047 443406868 444124756 445793991 447944603
760.9 447944603 449681664 451501045 452330093 452784958 453782310 455280342 455389900 454211884 454023933
769.6 454023933 455000114 455749054 455567589 455405884 454847107 454986229 456047935 456464767 456283188 455548706
779.2 455548706 455617981 456622658 457303925 457253456 457609177 458528671 459360809 460105743 459874611 460401688
788.9 460401688 461709328 461910400 461745262 462245750 463131294 463771744 463808594 462762146 461883049 460840759
798.5 460840759 460167961 459888191 458639870 457895241 457027206 455768623 453837280 451465454 450256119
807.2 450256119 449464569 447664108 445832291 444973412 443013191 440865364 439851608 439756813 439321175
815.9 439321175 437926712 437328072 436854134 436837616 436862259 437359390 438641663 439349213 440729294 442662468
$$ packed form
752.2D38925667R98115J061974J074715J42669J41907J061821P17888J669235K150612
760.9D47944603J737061J819381Q29048M54865R97352J498032J09558j178016j87951
769.6D54023933R76181P48940j81465j61705n58777J39122J061706M16832j81579p34482
779.2D55548706O9275J004677O81267n0469L55721R19494Q32138P44934k31132N27077
788.9D60401688J307640K01072j65138N00488Q85544O40450L6850j046448q79097j042290
798.5D60840759o72798k79770j248321p44629q68035j258583j931343k371826j209335
807.2D50256119p91550j800461j831817q58879j960221k147827j013756r4795m35638
815.9D39321175j394463n98640m73938j6518K4643M97131J282273P07550J380081J933174
$$ plain form
825.5 442662468 445755234 448279953 450169830 453066902 455355873 458970909 463280029 466267776
833.3 466267776 468250389 471222115 474002113 475297012 478205223 480847244 483011665 484285202
841 484285202 484811325 486257858 487799339 489937096 492270622 494470978 495155182 496585236 498474960
849.6 498474960 499481850 500699730 500679626 502019234 503618965 505507393 508511391 511198502 513679008
858.3 513679008 514708824 515065765 514826660 515730133 516364136 516023407 516161995 516761742 518288345
867 518288345 518213844 517686386 516897469 516349907 515568924 512874413 510207939 509047050 509368172 507752991
876.7 507752991 506643410 506802063 506587219 506495438 505336571 504367409 502347946 500497246 499504166
885.3 499504166 499070206 498755836 498413162 499350243 498869324 498641777 498770332 498586349 498404503 498349915
$$ packed form
825.5D42662468L092766K524719J889877K897072K288971L615036M309120K987747
833.3D66267776J982613K971726K779998J294899K908211K642021K164421J273537
841D84285202N26123J446533J541481K137757K333526K200356O84204J430054J889724
849.6D98474960J006890J217880k0104J339608J599731J888428L003998K687111K480506
858.3E13679008J029816L56941k39105R03473O34003l40729J38588N99747J526603
867E18288345p4501n27458p88917n47562p80983k694511k666474j160889L21122j615181
876.7E07752991j109581J58653k14844r1781j158867r69162k019463j850700r93080
885.3D99504166m33960l14370l42674R37081m80919k27547J28555j83983j81846n4588
$$ plain form
895 498349915 499331894 499096985 499755249 500579147 500444298 499753952 498688850 498697014 498638268 499790993
904.6 499790993 501451912 503343811 505470695 507746506 509927635 510923195 511971588 511725731 511565056
913.3 511565056 510612946 509197044 508913536 507812080 506222076 503598022 501614456 499179573 495718765
922 495718765 492389946 489466057 486996918 483127060 479415779 476263275 474155731 471801643 468861885
930.7 468861885 466654167 463741379 461798668 460256805 458650818 457007790 455249786 454116783
938.4 454116783 452949791 452481422 451442223 449971237 448330002 446638985 446011543 445488892 444726944
947.1 444726944 443889656 443920250 443470764 442668915 442972679 442806129 442084236 441054306 439693108 438139305
956.7 438139305 436395836 434001808 431803017 429882126 427484016 425351944 423089714 421286926
$$ packed form
895D98349915R81979k34909O58264Q23898j34849o90346j065102Q164n8746J152725
904.6D99790993J660919J891899K126884K275811K181129R95560J048393k45857j60675
913.3E11565056r52110j415902k83508j101456j590004k624054j983566k434883l460808
922D95718765l328819k923889k469139l869858l711281l152504k107544k354088k939758
930.7D68861885k207718k912788j942711j541863j605987j643028j758004j133003
938.4D54116783j166992m68369j039199j470986j641235j691017o27442n22651p61948
947.1D44726944q37288L0594m49486q01849L03764j66550p21893j029930j361198j553803
956.7D38139305j743469k394028k198791j920891k398110k132072k262230j802788
$$ plain form
964.4 421286926 419352074 416699944 414610100 412835464 410682297 408726349 407156868 404169998
972.1 404169998 400755386 398439636 396154709 392230797 387113838 383420715 379872131 374940147
979.8 374940147 369701538 364930573 360443382 355487595 349966888 344917030 340769844 336128922
987.6 336128922 331237373 327279472 323458557 319569092 315461769 311266670 308514462 305656300
995.3 305656300 302467117 299828320 296674728 293442364 290278873 287709351 285210857 282547264
1003 282547264 279338074 276178951 274713612 273429565 272073803 270046120 268192177 266649780 265212498
1011.7 265212498 264216404 261948395 259753876 257740555 256407261 254493599 251652756 249551105
1019.4 249551105 247042713 244928799 242952957 241879196 239898930 237546959 236083145 233796730
$$ packed form
964.4D21286926j934852k652130k089844j774636k153167j955948j569481k986870
972.1D04169998l414612k315750k284927l923912n116959l693123l548584m931984
979.8C74940147n238609m770965m487191m955787n520707n049858m147186m640922
987.6C36128922m891549l957901l820915l889465m107323m195099k752208k858162
995.3C05656300l189183k638797l153592l232364l163491k569522k498494k663593
1003B82547264l209190l159123j465339j284047j355762k027683j853943j542397j437282
1011.7B65212498r96094k268009k194519k013321j333294j913662k840843k101651
1019.4B49551105k508392k113914j975842j073761j980266k351971j463814k286415
$$ plain form
1027.1 233796730 232567253 230970135 229908619 229102936 228354740 227760601 226732750 227043629 226599712
1035.8 226599712 226999626 228347054 230638943 232774334 233675404 235035439 235525665 236296406 236726227
1044.5 236726227 237853870 238217735 236927223 236114140 235133095 235113716 233954697 232775631 231838474
1053.1 231838474 231315231 230700970 228804188 228695908 227680492 227615910 229159355 230540695 231902428
1061.8 231902428 233263416 235032368 235936737 238230915 240047283 241840096 243618851 244120731 245160198
1070.5 245160198 246038532 247469769 247622261 247373352 247687569 248858700 250174675 250399780 251213245
1079.2 251213245 250800838 251257763 252642841 254016094 255198135 255731220 257275352 258742580 260648136
1087.9 260648136 261652451 262642517 264141865 265545845 267168846 268530197 270877705 272407570
$$ packed form
1027.1B33796730j229477j597118j061516q05683p48196n94139j027851L10879m43917
1035.8B26599712L99914J347428K291889K135391R01070J360035M90226P70741M29821
1044.5B36726227J127643L63865j290512q13083r81045j9379j159019j179066r37157
1053.1B31838474n23243o14261j896782j08280j015416o4582J543445J381340J361733
1061.8B31902428J360988J768952R04369K294178J816368J792813J778755N01880J039467
1070.5B45160198Q78334J431237J52492k48909L14217J171131J315975K25105Q13465
1079.2B51213245m12407M56925J385078J373253J182041N33085J544132J467228J905556
1087.9B60648136J004315R90066J499348J403980J623001J361351K347508J529865
$$ plain form
1095.6 272407570 273907146 274645615 275281143 277544422 279377556 281001797 281752949 282774029 283833694
1104.2 283833694 285459881 287327766 288284817 289772720 290391445 290893555 291137886 291350937 292135563
1112.9 292135563 293100262 294318066 295021896 295912800 296093559 296028633 296106148 296914158 297068176 295536404
1122.6 295536404 295665321 296203251 297438850 299211159 300377388 301852226 303571930 305305138 306269779
1131.2 306269779 308097057 310217953 312401142 314941864 317260628 319967976 322133484 323966560
1139 323966560 325659561 327159462 328394623 329640350 330409660 330459061 331424484 332587166 333172035
1147.6 333172035 333542557 334147339 334535942 334656181 334794807 334153633 333607521 333272934 333335228 333968430
1157.3 333968430 334064445 333338699 332273216 331444016 330556755 330342293 330868492 332145424 334122734
$$ packed form
1095.6B72407570J499576P38469O35528K263279J833134J624241P51152J021080J059665
1104.2B83833694J626187J867885R57051J487903O18725N02110K44331K13051P84626
1112.9B92135563R64699J217804P03830Q90904J80759o4926P7515Q08010J54018j531772
1122.6B95536404J28917N37930J235599J772309J166229J474838J719704J733208R64641
1131.2C06269779J827278K120896K183189K540722K318764K707348K165508J833076
1139C23966560J693001J499901J235161J245727P69310M9401R65423J162682N84869
1147.6C33172035L70522O04782L88603J20239J38626o41174n46112l34587O2294O33202
1157.3C33968430R6015p25746j065483q29200q87261k14462N26199J276932J977310
$$ plain form
1166 334122734 336016235 338113823 340551376 343977432 347320480 350543098 353896866 356745644 359273262
1174.6 359273262 361831551 364871368 367804184 370924797 373848190 376029472 378280716 380974236
1182.4 380974236 383131142 384776497 386241798 387104874 388394928 389410248 389864349 390476799 390909767
1191 390909767 390964851 390763741 390506821 389633026 388327255 386995964 385695229 384348946 382847214
1199.7 382847214 381579475 380757980 379563637 377843132 376731949 375866356 374723434 373634567 372590866
1208.4 372590866 371986084 371737556 371229095 370986824 371215286 370762863 370275803 370245094 369295654 368282776
1218 368282776 367852516 367639732 367645721 367562790 367385941 366485481 365476913 364977837 364201584 363158913
1227.7 363158913 362164726 361142578 359977341 359455719 359274254 358791656 358376770 357660370 357121696
$$ packed form
1166C34122734J893501K097588K437553L426056L343048L222618L353768K848778K527618
1174.6C59273262K558289L039817K932816L120613K923393K181282K251244K693520
1182.4C80974236K156906J645355J465301Q63076J290054J015320M54101O12450M32968
1191C90909767N5084k01110k56920q73795j305771j331291j300735j346283j501732
1199.7C82847214j267739q21495j194343j720505j111183q65593j142922j088867j043701
1208.4C72590866o04782k48528n08461k42271K28462m52423m87060l0709r49440j012878
1218C68282776m30260k12784N989q2931j76849r00460j008568m99076p76253j042671
1227.7C63158913r94187j022148j165237n21622j81465m82598m14886p16400n38674
$$ plain form
1236.4 357121696 356828308 356422920 355755615 355057182 354872894 354446526 354091606 354092026 354041100 353596916
1246 353596916 352967491 352368050 351478271 351387291 351316147 350725288 350308685 349814339 349830856 350153427
1255.7 350153427 350212059 349663582 349451637 349594460 349110222 348928223 349278183 349671478 349760056 350363045
1265.3 350363045 351329727 351949272 352534103 353054085 353780556 354633255 355583572 356129913 356792107 358124008
1274.9 358124008 359584961 361105995 362171440 362846375 363650246 364869652 366249275 367652283 369075317
1283.6 369075317 370837479 372979813 374888992 376446342 377336617 378410645 379826431 381452293
1291.3 381452293 382822151 383411369 383884850 384383736 385647392 387345352 388445244 388840408 389210930
1300 389210930 389716454 390174179 390482635 390231934 390419006 390707436 390850487 390775414 390318184 389879761
$$ packed form
1236.4C57121696k93388m05388o67305o98433j84288m26368l54920M20n0926m44184
1246C53596916o29425n99441q89779r0980p1144n90859m16603m94346J6517L22571
1255.7C50153427N8632n48477k11945J42823m84238j81999L49960L93295Q8578O02989
1265.3C50363045R66682O19545N84831N19982P26471Q52699R50317N46341O62194J331901
1274.9C58124008J460953J521034J065445O74935Q03871J219406J379623J403008J423034
1283.6C69075317J762162K142334J909179J557350Q90275J074028J415786J625862
1291.3C81452293J369858N89218M73481M98886J263656J697960J099892L95164L70522
1300C89210930N05524M57725L08456k50701J87072K88430J43051p5073m57230m38423
$$ plain form
1309.7 389879761 389055557 388529778 387995453 387468376 387078629 386618881 386653404 386873322 387343559 387974205
1319.3 387974205 389082527 390202179 390846176 391340561 391875534 392881889 393559723 393988953 394241219
1328 394241219 394159622 393759270 393350220 393041115 392205086 391516037 391276855 391349068 391164017 391212730
1337.6 391212730 391553421 391071167 391164474 391900482 392826347 393392677 394055748 394939804 395304680 396317139
1347.3 396317139 396903610 397017250 397186813 397142029 396574898 395855408 395577202 395049477 395058937 394936523
1356.9 394936523 394651909 394248352 393894501 393699722 392835655 392138062 390845947 390981865 391139183
1365.6 391139183 390422325 390083847 389264374 388775444 388249893 387809906 387389030 386916618 386530876 385846062
1375.2 385846062 386181679 386378784 386483917 386051331 385736122 385409355 384182358 382845078 380867157
$$ packed form
1309.7C89879761q24204n25779n34325n27077l89747m59748L4523K19918M70237O30646
1319.3C87974205J108322J119652O43997M94385N34973J006355O77834M29230K52266
1328C94241219q1597m00352m09050l09105q36029o89049k39182P2213j85051M8713
1337.6C91212730L40691m82254R3307P36008R25865N66330O63071Q84056L64876J012459
1347.3C96317139N86471J13640J69563m4784n67131p19490k78206n27725R460j22414
1356.9C94936523k84614m03557l53851j94779q64067o97593j292115J35918J57318
1365.6C91139183p16858l38478q19473m88930n25551m39987m20876m72412l85742o84814
1375.2C85846062L35617J97105J05133m32586l15209l26767j226997j337280j977921
$$ plain form
1383.9 380867157 379358864 378096504 376727791 374848976 373713722 373439026 371973915 369985046
1391.6 369985046 368166351 366991196 364161606 360076599 358390236 356820450 355507965 352486534
1399.3 352486534 350479813 349549408 347553902 345554428 343138847 340492058 338501358 336979141
1407.1 336979141 335164680 333145409 331847420 330611115 329694328 328423958 327132988 325999641
1414.8 325999641 324401245 323182640 322306633 322526093 320896187 320735779 322189293 322589302 323167725
1423.4 323167725 322723694 323393517 324266510 324706917 325950966 326386070 327168846 328063812 330362206
1432.1 330362206 332482605 334089928 336433487 337546616 338739510 339918709 342369804 344319077
1439.8 344319077 345981483 348518219 350503120 352653313 353981285 355530968 356894379 358478470
$$ packed form
1383.9C80867157j508293j262360j368713j878815j135254k74696j465111j988869
1391.6C69985046j818695j175155k829590m085007j686363j569786j312485l021431
1399.3C52486534k006721r30405j995506j999474k415581k646789j990700j522217
1407.1C36979141j814461k019271j297989j236305r16787j270370j290970j133347
1414.8C25999641j598396j218605q76007K19460j629906j60408J453514M00009N78423
1423.4C23167725m44031O69823Q72993M40407J244049M35104P82776Q94966K298394
1432.1C30362206K120399J607323K343559J113129J192894J179199K451095J949273
1439.8C44319077J662406K536736J984901K150193J327972J549683J363411J584091
$$ plain form
1447.6 358478470 359619446 360823402 363107224 364206085 365711746 367101097 369046326 370573044
1455.3 370573044 370831375 370706253 371067924 375764351 377971344 380192223 381676483 383684044 386628418
1464 386628418 387309113 389990921 392052727 394707985 397261543 399764404 402919731 405079842 407683945
1472.6 407683945 410433464 415405846 418686142 421344872 424521828 426918983 429064980 430697937
1480.3 430697937 432809944 434520798 436497307 438743935 440120125 441353035 441963234 442689819 443694420
1489 443694420 442643318 441821976 442779617 443650055 443198624 442266006 441109276 436807480 436755867 435099258
1498.7 435099258 432409134 432185211 430799294 428960457 427261696 427170067 426206779 421572189 418553886
1507.3 418553886 420455666 422459373 421520844 422097855 421026955 419402657 419264412 418077431 417593040
$$ packed form
1447.6C58478470J140976J203956K283822J098861J505661J389351J945229J526718
1455.3C70573044K58331j25122L61671M696427K206993K220879J484260K007561K944374
1464C86628418O80695K681808K061806K655258K553558K502861L155327K160111K604103
1472.6D07683945K749519M972382L280296K658730L176956K397155K145997J632957
1480.3D30697937K112007J710854J976509K246628J376190J232910O10199P26585J004601
1489D43694420j051102q21342R57641Q70438m51431r32618j156730m301796n1613j656609
1498.7D35099258k690124k23923j385917j838837j698761r1629r63288m634590l018303
1507.3D18553886J901780K003707r38529N77011j070900j624298j38245j186981m84391
$$ plain form
1516 417593040 415584297 414016151 415086212 415904388 413796654 412624741 413419533 414081573 415706367
1524.7 415706367 414837799 415914726 417184868 416890984 417452736 417928238 418537750 419110146 419361649
1533.4 419361649 417845650 419339333 420378685 420571251 421345520 416719894 414395294 416572723 418387833
1542.1 418387833 419580002 421576385 422729301 420874519 422343941 422758980 422933922 422539635 421999130
1550.7 421999130 422807198 422804375 423389740 420847473 421151009 422205086 422481117 422264404 412006226
1559.4 412006226 411688881 413412514 415097237 413861275 412234917 409251175 406631355 405703125 403177605
1568.1 403177605 401489372 393461075 391971397 390134697 386458130 383364754 379672470 378163719
1575.8 378163719 367006493 365793533 362906570 358502846 354682274 349235802 345624046 340038147
$$ packed form
1516D17593040k008743j568146J070061Q18176k107734j171913P94792O62040J624794
1524.7D15706367q68568J076927J270142k93884N61752M75502O09512N72396K51503
1533.4D19361649j515999J493683J039352J92566P74269m625626k324600K177429J815110
1542.1D18387833J192169J996383J152916j854782J469422M15039J74942l94287n40505
1550.7D21999130Q08068k823N85365k542267L03536J054077K76031k16713j0258178
1559.4D12006226l17345J723633J684723j235962j626358k983742k619820r28230k525520
1568.1D03177605j688233q028297j489678j836700l676567l093376l692284j508751
1575.8C78163719j1157226j212960k886963m403724l820572n446472l611756n585899
$$ plain form
1583.5 340038147 336595230 331438103 327110672 322918091 317797737 314732246 309256725 306339836
1591.2 306339836 300990887 297687645 293744164 289006233 286652966 281748276 279612541 275158367
1599 275158367 273055840 269714184 266315842 264334755 260221233 258971310 255637131 254826756 251422482
1607.6 251422482 249748287 248787651 245852127 245894947 243155022 243419857 241377792 241348438 241628494
1616.3 241628494 236422653 238004494 236928082 238499470 237504578 238735104 238680153 236542816 237943420
1625 237943420 237117653 238700294 237311516 239192486 239759293 240437679 241762199 241813240 244356918
1633.7 244356918 243720417 244895115 244521236 247626572 249718781 251264687 254253407 254661217 257472668
1642.4 257472668 257908058 260181923 262250862 261897869 264248371 263793983 268051319 269135094 272193699
$$ packed form
1583.5C40038147l442917n157127m327431m192581n120354l065491n475521k916889
1591.2C06339836n348949l303242l943481m737931k353267m904690k135735m454174
1599B75158367k102527l341656l398342j981087m113522j249923l334179q10375l404274
1607.6B51422482j674195r60636k935524M2820k739925K64835k042065k9354K80056
1616.3B41628494n205841J581841j076412J571388r94892J230526n4951k137337J400604
1625B37943420q25767J582641j388778J880970N66807O78386J324520N1041K543678
1633.7B44356918o36501J174698l73879L105336K092209J545906K988720M07810K811451
1642.4B57472668M35390K273865K068939l52993K350502m54388M257336J083775L058605
$$ plain form
1651 272193699 274107208 271482773 272353477 273183765 278039780 279583797 282317219 283576069 285677090
1659.7 285677090 288276634 290335445 293784370 294500217 298514729 300908298 304080658 306662521
1667.4 306662521 308790092 313314819 315584431 320610390 323221359 327995148 331463356 333938332
1675.1 333938332 338751411 342364693 347507401 350844765 355359421 359072876 364100723 369257736
1682.9 369257736 370145149 376308365 379969788 386316109 390778809 395449791 400582771 405081673
1690.6 405081673 410718994 415723801 421185074 425848618 430523643 432320709 438071594 444726906
1698.3 444726906 450224113 455032005 456412010 463783989 469436607 474110832 477977066 481581154
1706 481581154 484611092 488050995 492590561 495211945 497968979 501281700 504333382 507719536 508441963
$$ packed form
1651B72193699J913509k624435Q70704Q30288M856015J544017K733422J258850K101021
1659.7B85677090K599544K058811L448925P15847M014512K393569L172360K581863
1667.4C06662521K127571M524727K269612N025959K610969M773789L468208K474976
1675.1C33938332M813079L613282N142708L337364M514656L713455N027847N157013
1682.9C69257736Q87413O163216L661423O346321M462700M670982N132980M498902
1690.6D05081673N637321N004807N461273M663544M675025J797066N750885O655312
1698.3D44726906N497207M807892J380005P371979N652618M674225L866234L604088
1706D81581154L029938L439903M539566K621384K757034L312721L051682L386154P22427
$$ plain form
1714.7 508441963 509191055 513052826 515691605 513108788 516413498 520098763 522497406 524492493
1722.4 524492493 526095352 527934799 529875488 531547623 532897987 534536018 536549721 536567307 537295876
1731.1 537295876 540887871 544160118 543148117 541820068 546491127 550226250 552341309 555293770
1738.8 555293770 555892258 555641022 560174370 563637390 565837708 568799095 572787704 576480789 579393921
1747.5 579393921 582545166 584486580 589112511 591975517 594044037 599556427 603585167 607503853
1755.2 607503853 611238670 612398949 615162659 619013443 621904831 624553909 624166985 625741425
1762.9 625741425 630106392 632818375 634873695 637066078 639225693 638316040 640608139 644380722
1770.6 644380722 644555588 643604355 642633743 647393951 650251694 650510025 653470917 654780350 656348724
$$ packed form
1714.7E08441963P49092L861771K638779k582817L304710L685265K398643J995087
1722.4E24492493J602859J839447J940689J672135J350364J638031K013703J7586P28569
1731.1E37295876L591995L272247j012001j328049M671059L735123K115059K952461
1738.8E55293770N98488k51236M533348L463020K200318K961387L988609L693085K913132
1747.5E79393921L151245J941414M625931K863006K068520N512390M028740L918686
1755.2F07503853L734817J160279K763710L850784K891388K649078l86924J574440
1762.9F25741425M364967K711983K055320K192383K159615r09653K292099L772583
1770.6F44380722J74866r51233r70612M760208K857743K58331K960892J309433J568374
$$ plain form
1779.3 656348724 656353607 655506897 656903305 659091110 661196213 660978012 662130737 664515305 666232834
1788 666232834 666693268 667784958 668461685 668459625 667528610 667567444 671497116 672848587 673132935 675005646
1797.6 675005646 676586151 676991730 676124344 677919235 677928543 678974686 680745239 681505814 683089447
1806.3 683089447 683873444 684790497 685495682 686245956 685438690 685992279 687552261 688130569 689506683
1815 689506683 690100861 691549377 692027588 692779465 694005051 693771210 694431992 693789597 694550629 695552826
1824.6 695552826 693837204 694880905 697252045 699201050 699174881 696733475 697689133 699926529 699640808
1833.3 699640808 699681778 700446625 700965424 701647034 701761475 703417892 704108276 704468842 704296646 705062485
1842.9 705062485 705738449 700727081 703061218 705747910 706732712 707219543 707780991 708872910 708692856
$$ packed form
1779.3F56348724M883q46710J396408K187805K105103k18201J152725K384568J717529
1788F66232834M60434J091690O76727k060r31015L8834L929672J351471K84348J872711
1797.6F75005646J580505M05579q67386J794891R308J046143J770553P60575J583633
1806.3F83089447P83997R17053P05185P50274q07266N53589J559982N78308J376114
1815F89506683N94178J448516M78211P51877J225586k33841O60782o42395P61032J002197
1824.6F95552826j715622J043701K371140J949005k6169k441406R55658K237396k85721
1833.3F99640808M0970P64847N18799O81610J14441J656417O90384L60566j72196P65839
1842.9G05062485O75964n011368K334137K686692R84802M86831N61448J091919j80054
$$ plain form
1851.6 708692856 708978653 708516998 708805923 709293823 709347382 709986420 710214386 711105118 711433868 712148819
1861.3 712148819 711971817 711716614 711958008 711850815 712385941 712016144 712840652 712110596 711498795 713213730
1870.9 713213730 714235611 714432755 713930283 714552460 714611588 714877090 715030289 715135651 715971146 716387024
1880.6 716387024 717205124 716819458 717144547 717438965 717025604 716713333 716227646 717255936 716942749
1889.2 716942749 716062012 717003555 718351135 718679810 718798523 718749542 717705154 718266678 718319016 718708344
1898.9 718708344 719242020 719640350 720194016 719913330 720547791 720199280 720077896 720080719 719949951 720110931
1908.5 720110931 719662552 719881363 719904022 720780258 721034164 721508102 721736450 721273117 721929321 719767990
1918.2 719767990 719294739 720646667 721412888 721726379 721060791 721286850 721517258 721471710 721163025 721612396
$$ packed form
1851.6G08692856K85797m61655K88925M87900N3559O39038K27966Q90732L28750P14951
1861.3G12148819j77002k55203K41394j07193N35126l69797Q24508p30056o11801J714935
1870.9G13213730J021881J97144n02472O22177N9128K65502J53199J05362Q35495M15878
1880.6G16387024Q18100l85666L25089K94418m13361l12271m85687J028290l13187
1889.2G16942749q80737R41543J347580L28675J18713m8981j044388N61524N2338L89328
1898.9G18708344N33676L98330N53666k80686O34461l48511j21384K823j30768J60980
1908.5G20110931m48379K18811K2659Q76236K53906M73938K28348m63333O56204k161331
1918.2G19767990m73251J351928P66221L13491o65588K26059K30408m5548l08685M49371
$$ plain form
1927.8 721612396 721534576 721386108 721672821 721454163 721885223 721691360 722131424 722092667 721813660 721917953
1937.5 721917953 721501236 721619949 721219940 721964569 721529541 720410690 721616135 722024307 721668777
1946.1 721668777 721234741 721575546 721341171 721150360 721280518 721377258 721597672 721273499 721583481 721507492
1955.8 721507492 721420746 720938644 720601349 720965576 720971298 721186600 721075058 721510239 721229706 720667267
1965.4 720667267 720296326 719551697 719636154 719763107 720362625 720453262 720900879 721149521 720601578 720321274
1975.1 720321274 719764633 719728241 719460754 719926605 720095215 719741058 719832382 719685135 720102768 719850311
1984.7 719850311 719796600 719571381 719098511 718719940 718469772 719321136 719186249 718475266 718149796 718645020
1994.3 718645020 719034348 718869629 718973389 718374329 717870941 717335663 717211304 717195206 717467957 717879868
$$ packed form
1927.8G21612396p7820j48468K86713k18658M31060j93863M40064l8757k79007J04293
1937.5G21917953m16717J18713m00009P44629m35028j118851J205445M08172l55530
1946.1G21668777m34036L40805k34375j90811J30158R6740K20414l24173L09982p5989
1955.8G21507492q6746m82102l37295L64227N722K15302j11542M35181k80533n62439
1965.4G20667267l70941p44629Q4457J26953N99518R0637M47617K48642n47943k80304
1975.1G20321274n56641l6392k67487M65851J68610l54157R1324j47247M17633k52457
1984.7G19850311n3711k25219m72870l78571k50168Q51364j34887p10983l25470M95224
1994.3G18645020L89328j64719J03760n99060n03388n35278j24359j6098K72751M11911
$$ plain form
2004 717879868 717642288 717665100 717212448 717018280 716648560 716410751 716184387 715810089 716006317 715665970
2013.6 715665970 715938416 715959549 715906601 715735703 715389328 715395508 714804764 714730606 714308777 714320297 714423447
2024.2 714423447 714597397 715065460 714414444 714202881 713820267 713388138 712813492 712612610 712533340 711957245
2033.9 711957245 712232971 712304611 712511597 712338409 712388535 712503967 712105179 711723862 710897598 710771942
2043.5 710771942 710274200 710443115 710709686 710520554 710648422 710263977 710446091 709825439 709510880 709404526
2053.2 709404526 709126663 709316788 709053879 709365921 709159470 709019852 708811035 708645401 708850327 708807678
2062.8 708807678 708944626 708357620 708282852 708296738 708484726 708528976 708292618 708490601 708102951 708252029
2072.5 708252029 707928543 707496109 707306213 707249832 707398529 707055817 707371826 707322998 707243958 706718903
$$ packed form
2004G17879868k37580K2812m52652j94168l69720k37809k26364l74298J96228l40347
2013.6G15665970K72446K1133n2948j70898l46375O180n90744p4158m21829J1520J03150
2024.2G14423447J73950M68063o51016k11563l82614m32129n74646k00882p9270n76095
2033.9G11957245K75726P1640K06986j73188N0126J15432l98788l81317q26264j25656
2043.5G10771942m97742J68915K66571j89132J27868l84445J82114o20652l14559j06354
2053.2G09404526k77863J90125k62909L12042k06451j39618k08817j65634K04926m2649
2062.8G08807678J36948n87006p4768J3886J87988M4250k36358J97983l87650J49078
2072.5G08252029l23486m32434j89896n6381J48697l42712L16009m8828p9040n25055
$$ plain form
2082.1 706718903 706227341 706269608 706032181 706382675 706282349 706322784 706154480 706115952 706124115 705358963
2091.7 705358963 705027161 704813919 704942169 704922714 705101624 704770966 704457169 704608383 703989792 704079514
2101.4 704079514 704172897 704155884 703652344 703407211 703533859 703071747 703254547 703072205 703002014 702549896
2111 702549896 702206116 702210846 701965332 702396774 702281265 702053299 701452560 701384506 701624146 701307144
2120.7 701307144 701200256 700910339 701079712 700707855 700509186 700321579 700234299 700628510 700651779 701278915
2130.3 701278915 701000900 700542450 700111008 699708252 700056610 700249481 700313721 699757767 699824600 700191116
2140 700191116 700428925 700284348 700143585 700481796 700080490 700061264 699833603 699764099 699984131 700146179
2149.6 700146179 700233536 699938049 700213699 699923172 699953232 700062027 700049286 700162277 699873428 700003815
$$ packed form
2082.1G06718903m91562M2267k37427L50494j00326M0435j68304l8528Q163p65152
2091.7G05358963l31802k13242J28250j9455J78910l30658l13797J51214o18591Q9722
2101.4G04079514R3383j7013n03540k45133J26648m62112J82800j82342p0191m52118
2111G02549896l43780M730k45514M31442j15509k27966o00739o8054K39640l17002
2120.7G01307144j06888k89917J69373l71857j98669j87607q7280L94211K3269O27136
2130.3G01278915k78015m58450m31442m02756L48358J92871O4240n55954O6833L66516
2140G00191116K37809j44577j40763L38211m01306j9226k27661o9504K20032J62048
2149.6G00146179Q7357k95487K75650k90527L0060J08795j2741J12991k88849J30387
$$ plain form
2159.3 700003815 700124512 700822983 700680542 700440674 700526276 700145493 700253601 699855804 699956284 700034866
2168.9 700034866 700601730 701247787 700782013 700631180 700494156 700537720 700235443 700320969 700410767 700511398
2178.5 700511398 700852280 700658188 700860825 700555573 700784760 701042480 701111603 701480865 701291199 701345139
2188.2 701345139 701110611 701208344 701168137 701179123 701224213 701159134 701678391 701696396 701756744 701611557 701872482
2198.8 701872482 701898270 701586304 701564636 701409836 701897354 701650085 701765060 701919479 701781464 702010117
2208.4 702010117 701936646 702242661 702018051 701951904 701681671 701865997 702346802 702186127 702722244 702808151
2218.1 702808151 702886047 702686615 702693634 702826614 702457886 702272720 701798553 702157211 702479630 702567291
2227.7 702567291 702422714 702571716 702966766 702481461 702457733 702346573 702440948 702245712 702036362 701798477
$$ packed form
2159.3G00003815J20697O98471j42441k39868Q5602l80783J08108l97797J00480P8582
2168.9G00034866N66864O46057m65774j50833j37024M3564l02277Q5526Q9798J00631
2178.5G00511398L40882j94092K02637l05252K29187K57720O9123L69262j89666N3940
2188.2G01345139k34528R7733m0207J0986M5090o5079N19257J8005O0348j45187K60925
2198.8G01872482K5788l11966k1668j54800M87518k47269J14975J54419j38015K28653
2208.4G02010117p3471L06015k24610o6147k70233J84326M80805j60675N36117Q5907
2218.1G02808151P7896j99432P019J32980l68728j85166m74167L58658L22419Q7661
2227.7G02567291j44577J49002L95050m85305k3728j11160R4375j95236k09350k37885
$$ plain form
2237.4 701798477 701424637 702160797 702347107 702598114 702285843 701673584 701480331 701320419 701607895 701446762
2247 701446762 701974640 702235413 702220306 702280960 702099838 701785812 701171265 701466751 701463776 701764679 701674423
2257.6 701674423 701363602 701944427 701933365 701873474 701585846 701883163 701840439 701602554 701475830 700782013
2267.3 700782013 700809097 700727310 700999680 701048050 701260681 701391525 700972977 701057358 700749283 700725250
2276.9 700725250 700258713 700385208 700735321 700343399 700418930 700413818 700660019 700363388 700227051 699974518
2286.5 699974518 699581451 699257889 698522110 698510590 698397675 698918152 698902359 698719101 698958893 698356552
2296.2 698356552 697884750 697220917 697214890 696817932 696508636 696465683 696464005 696850739 695958557 695409241
2305.8 695409241 694568710 694362793 694131393 693250809 693391571 692422333 691706390 691343231 691657257 691427917
$$ packed form
2237.4G01798477l73840P36160J86310K51007l12271o12259j93253j59912K87476j61133
2247G01446762N27878K60773j5107O0654j81122l14026o14547K95486k975L00903r0256
2257.6G01674423l10821N80825j1062n9891k87628K97317m2724k37885j26724o93817
2267.3G00782013K7084q1787K72370M8370K12631J30844m18548Q4381l08075k4033
2276.9G00725250m66537J26495L50113l91922P5531n112K46201k96631j36337k52533
2286.5F99974518l93067l23562p35779j1520j12915N20477j5793j83258K39792o02341
2296.2F98356552m71802o63833o027l96958l09296m2953j678L86734q92182n49316
2305.8F95409241q40531k05917k31400q80584J40762r69238p15943l63159L14026k29340
$$ plain form
2315.5 691427917 690961380 691380844 690567245 689770966 688273697 688014069 688058090 687695007 687311859 686236343
2325.1 686236343 687121429 686672974 686085205 685250854 684149628 683768005 682864380 683313446 682864151
2333.8 682864151 682790298 682113419 681268692 681604919 681780624 681520920 680621643 681375351 680947571 679583206
2343.4 679583206 678469925 679166031 680647430 681680145 684421539 685820847 685142975 682831497 681180191
2352.1 681180191 680043488 678593674 677121353 674336548 674632187 675113983 675172806 674678574 673788528
2360.8 673788528 673937454 672974319 674024429 674177628 675052338 675022125 674170837 675556946 677079391
2369.5 677079391 678539810 678458557 679780426 680917740 680803757 681154175 681424026 681644974 681705551
2378.2 681705551 682620468 683483353 684544220 685234375 685333405 685569611 685535736 685521240 684913025 684769135
$$ packed form
2315.5F91427917m66537M19464q13599p96279j497269k59628M4021l63083l83148j075516
2325.1F86236343Q85086m48455n87769q34351j101226l81623r03625M49066m49295
2333.8F82864151p3853o76879q44727L36227J75705k59704q99277P53708m27780j364365
2343.4F79583206j113281O96106J481399J032715K741394J399308o77872k311478j651306
2352.1F81180191j136703j449814j472321k784805K95639M81796N8823m94232q90046
2360.8F73788528J48926r63135J050110J53199Q74710l0213q51288J386109J522445
2369.5F77079391J460419q1253J321869J137314j13983L50418K69851K20948O0577
2378.2F81705551R14917Q62885J060867O90155R9030K36206l3875j4496o08215j43890
$$ plain form
2387.8 684769135 684359818 683773270 684145126 684330139 684276123 683781662 683810043 683693008 683237305 682654419
2397.4 682654419 682097626 682117386 681546478 681624680 681456528 681045837 681114960 680665054 680257111 679814606
2407.1 679814606 679866943 679496841 678915100 678483582 678073120 678132629 677960968 677919998 677590332 677513275
2416.7 677513275 677205429 676527481 676223145 675540619 674919357 674321823 674429321 674684448 674326630 673834457
2426.4 673834457 673548431 673396835 672807770 672390289 671698914 671068268 670610580 670369186 670380859 670318756
2436 670318756 670528259 669924545 669432983 668841476 668309479 668245468 667535782 667211075 666823349 666653366
2445.7 666653366 666616592 666270218 665812302 665447769 665285034 664353485 663955002 663789139 663174438 662508698
2455.3 662508698 662100830 662041092 661632614 661513596 661191864 660781250 660285492 659899673 659580841 658674316
$$ packed form
2387.8F84769135m09317n86548L71856J85013n4016m94461K8381j17035m55703n82886
2397.4F82654419n56793J9760n70908P8202j68152m10691O9123m49906m07943m42505
2407.1F79814606N2337l70102n81741m31518m10462N9509j71661m0970l29666p7057
2416.7F77513275l07846o77948l04336o82526o21262n97534J07498K55127l57818m92173
2426.4F73834457k86026j51596n89065m17481o91375o30646m57688k41394J1673o2103
2436F70318756K09503o03714m91562n91507n31997o4011p09686l24707l87726j69983
2445.7F66653366l6774l46374m57916l64533j62735r31549l98483j65863o14701o65740
2455.3F62508698m07868n9738m08478j19018l21732m10614m95758l85819l18832r06525
$$ plain form
2465 658674316 658383484 658236008 658120422 657849884 657480011 657109985 656309357 655569305 654747314 654273148
2474.6 654273148 653727646 653587952 653628540 653364868 653088531 652229538 651795731 651385880 650743179 649894409
2484.2 649894409 649295578 649058914 648623428 648497467 647999039 647738724 647147446 646293259 645718765 645290146
2493.9 645290146 645292587 644447937 643850250 643464508 643174591 642557373 641639328 641916428 641696243 641112442
2503.5 641112442 640239792 639596596 639251709 638275146 637606277 637212334 637118645 636653786 636430550 636319199
2513.2 636319199 635861893 635273247 634475670 634203911 633457794 633149986 633043480 632631340 632367210 631514664
2522.8 631514664 630925827 630281754 629834557 629510803 629051895 628520241 628037949 627967606 627718430 627623634
2532.5 627623634 627066422 626418686 625652046 624986610 624674530 623992004 624091301 623929291 623558311 623217430
$$ packed form
2465F58674316k90832j47476j15586k70538l69873l70026q00628p40052q21991m74166
2474.6F54273148n45502j39694M0588k63672k76337q58993m33807m09851o42701q48770
2484.2F49894409n98831k36664m35486j25961m98428k60315n91278q54187n74494m28619
2493.9F45290146K441q44650n97687l85742k89917o17218r18045K77100k20185n83801
2503.5F41112442q72650o43196l44887r76563o68869l93943r3689m64859k23236j11351
2513.2F36319199m57306n88646p97577k71759p46117l07808j06506m12140k64130q52546
2522.8F31514664n88837o44073m47197l23754m58908n31654m82292p0343k49176r4796
2532.5F27623634n57212o47736p66640o65436l12080o82526R9297j62010l70980l40881
$$ plain form
2542.1 623217430 622733078 622166672 621115341 620887833 620625725 620193596 619823799 619607773 619372711
2550.8 619372711 618629913 618139839 617641220 617505875 616939125 616344528 615985641 615359573 614966583 614270439
2560.4 614270439 614170647 614078102 614025421 613754082 612737579 611971626 611225929 611364670 611410370 610745773
2570.1 610745773 610020905 609638748 609594116 609003906 608412132 607846222 607456627 607012711 606597748 606137733
2579.7 606137733 605719070 605784607 605245018 604668350 604316444 604257584 603955154 603223572 602511177 601456337
2589.4 601456337 601272964 601436539 601365547 600985985 600469666 599909515 599066238 598466415 597522888 597107544
2599 597107544 596678429 595995369 595645142 595050850 594644356 593940239 593725395 593645592 592949142 592271729
2608.6 592271729 591808205 591337433 590510292 589860954 588917046 588475113 588379631 588052902 587888451 587376976
$$ packed form
2542.1F23217430m84352n66406j051331k27508k62108m32129l69797k16026k35062
2550.8F19372711p42798m90074m98619j35345n66750n94597l58887o26068l92990o96144
2560.4F14270439r9792r2545n2681k71339j016503p65953p45697J38741M5700o64597
2570.1F10745773p24868l82157m4632n90210n91774n65910l89595m43916m14963m60015
2579.7F06137733m18663O5537n39589n76668l51906n8860l02430p31582p12395j054840
2589.4F01456337j83373J63575p0992l79562n16319n60151q43277n99823r43527m15344
2599E97107544m29115o83060l50227n94292m06494p04117k14844p9803o96450o77413
2608.6E92271729m63524m70772q27141o49338r43908m41933r5482l26729j64451n11475
$$ plain form
2618.3 587376976 586871033 586056824 585505371 584717293 583935471 583564339 582743263 582675743 582420006 581761131
2627.9 581761131 581217575 580625420 579824944 578947334 578696938 578114967 577602501 577111778 576628113 576273499
2637.6 576273499 575749092 575385590 574648895 574126968 573551216 572847443 572206955 571638565 571352463 570847397
2647.2 570847397 570217323 569517365 569405861 568958282 568295822 567995834 567208405 566695328 566311798 565878143
2656.9 565878143 565174179 564843674 564701920 563929596 563599167 563383026 562910881 562200851 561724625 561274605
2666.5 561274605 561018028 561154442 560866508 560584373 559945602 559539871 559280128 558720703 557979240 557237167
2676.1 557237167 557225876 556770935 556509209 556486130 556064911 555519295 554591103 554081879 553870697 553811302
2685.8 553811302 553415718 552550812 551747246 551547966 551394310 550539970 550224342 550150337 550087509 549811821
$$ packed form
2618.3E87376976n05943q14209n51453p88078p81822l71132q21076o7520k55737o58875
2627.9E81761131n43556n92155q00476q77610k50396n81971n12466m90723m83665l54614
2637.6E76273499n24407l63502p36695n21927n75752p03773o40488n68390k86102n05066
2647.2E70847397o30074o99958j11504m47579o62460k99988p87429n13077l83530m33655
2656.9E65878143p03964l30505j41754p72324l30429k16141m72145p10030m76226m50020
2666.5E61274605k56577J36414k87934k82135o38771m05731k59743n59425p41463p42073
2676.1E57237167j1291m54941k61726k3079m21219n45616r28192n09224k11182n9395
2685.8E53811302l95584q64906q03566j99280j53656q54340l15628p4005o2828k75688
$$ plain form
2695.4 549811821 549736214 549543419 548542023 548220596 547556992 547042007 547050629 546782265 546473732 545778122
2705.1 545778122 545327301 544864960 544809914 544704170 544027443 543508453 543184624 543087540 542647514 542216263
2714.7 542216263 541725540 541533356 541379433 540867577 540700951 540458107 540268898 539572792 538834267 538538284
2724.4 538538284 538634567 538692017 537859917 537585297 537536049 537236099 536690598 536062622 536113510 536048508
2734 536048508 535724411 535283127 534892159 534687958 534740028 534291153 533612251 533656883 533523750 533182487
2743.7 533182487 532825775 532846870 532717857 532367973 532282944 531985092 531890259 531291046 530598373 530438347
2753.3 530438347 530407524 530173721 529998589 530157509 529534645 529057617 528712273 528266335 528138199 527861938
2762.9 527861938 527658272 527043228 526523705 526087112 525834236 525852852 525595322 525335045 524731674 524224281
$$ packed form
2695.4E49811821p5607j92795j001396l21427o63604n14985Q622k68364l08533o95610
2705.1E45778122m50821m62341n5046j05744o76727n18990l23829r7084m40026m31251
2714.7E42216263m90723j92184j53923n11856j66626k42844j89209o96106p38525k95983
2724.4E38538284R6283N7450q32100k74620m9248k99950n45501o27976N0888o5002
2734E36048508l24097m41284l90968k04201N2070m48875o78902M4632j33133l41263
2743.7E33182487l56712K1095j29013l49884q5029k97852r4833n99213o92673j60026
2753.3E30438347l0823k33803j75132J58920o22864m77028l45344m45938j28136k76261
2762.9E27861938k03666o15044n19523m36593k52876J8616k57530k60277o03371n07393
$$ plain form
2772.6 524224281 523937111 523750496 523308792 522662430 522240562 521810226 521409912 520761986 520393295 520017433
2782.2 520017433 519585114 519047775 518287964 518236084 518243752 517911530 517107506 516458397 515911522 515117645
2791.9 515117645 514561501 513925400 513567543 513045006 512473488 511941872 511295013 510343285 509270668
2800.5 509270668 508929520 508284111 507788963 506962128 505839348 505285912 504533882 504282265 504030724
2809.2 504030724 503544960 502295723 500922546 500410995 499761353 499275780 498333092 497336082 496594963
2817.9 496594963 495966072 495541496 494499931 493348236 492313156 491466904 490575600 489627571 488753929
2826.6 488753929 488074303 487433167 486449547 485724030 484834175 483880348 482563972 480995178 479853821
2835.3 479853821 478731155 477738991 476518440 475662155 474692535 472828026 470785789 468947678 466986313
$$ packed form
2772.6E24224281k87170j86615m41704o46362m21868m30336m00314o47926l68691l75862
2782.2E20017433m32319n37339p59811n1880P668l32222q04024o49109n46875p93877
2791.9E15117645n56144o36101l57857n22537n71518n31616o46859r51728j072617
2800.5E09270668l41148o45409m95148q26835j122780n53436p52030k51617k51541
2809.2E04030724m85764j249237j373177n11551o49642m85573r42688r97010p41119
2817.9D96594963o28891m24576j041565j151695j035080q46252q91304r48029q73642
2826.6D88753929o79626o41136r83620p25517q89855r53827j316376j568794j141357
2835.3D79853821j122666r92164j220551q56285r69620j864509k042237j838111j961365
$$ plain form
2843.9 466986313 464470596 462371559 460242081 457903290 455518837 453436508 452008667 450039215
2851.7 450039215 448666992 447857666 447055054 446607933 446374588 446503258 446502533 446626472 446481972 446202965
2861.3 446202965 445697594 444992943 444455566 443395805 442773170 442236061 441407623 440624123 439514160
2870 439514160 438519287 437783890 437256355 436371727 435338974 434755592 434307594 433525734 432557564 431947060
2879.6 431947060 431444130 430635834 429612083 429008942 428365517 427187881 426114197 425297050 424528427
2888.3 424528427 423584747 422419128 421241913 420439949 419331284 418167953 417589722 416737747 415807953
2897 415807953 414898567 414044991 413298645 412410126 411285553 410437889 410059128 409175873 408397408 407739983
2906.6 407739983 407044640 406378212 405231476 403823395 402236290 401173058 399903374 398272705 396805611
$$ packed form
2843.9D66986313k515717k099037k129478k338791k384453k082329j427841j969452
2851.7D50039215j372223q09326q02612m47121k33345J28670p25J23939j44500k79007
2861.3D46202965n05371p04651n37377j059761o22635n37109q28438p83500j109963
2870D39514160r94873p35397n27535q84628j032753n83382m47998p81860r68170o10504
2879.6D31947060n02930q08296j023751o03141o43425j177636j073684q17147p68623
2888.3D24528427r43680j165619j177215q01964j108665j163331n78231q51975r29794
2897D15807953r09386q53576p46346q88519j124573q47664l78761q83255p78465o57425
2906.6D07739983o95343o66428j146736j408081j587105j063232j269684j630669j467094
$$ plain form
2915.3 396805611 395068474 393366623 391773567 390543861 389069710 387615051 386817093 386254082 385407333
2924 385407333 384820480 385252953 385054703 384869919 385264473 385312843 385064125 385268936 386168938 385980949
2933.6 385980949 386127739 386971283 387477188 388206062 388778610 389619179 390402908 391278572 392057152 392617111
2943.3 392617111 393010292 393370743 394625969 395288582 395553398 396061630 396745453 397697067 398306618
2952 398306618 398757439 398649635 398669853 399095879 400041313 401219254 401555481 401821175 402450752 403264809
2961.6 403264809 403880424 404512329 405006752 405533981 406455574 407281227 407938004 408289070 409243660 410166130
2971.2 410166130 410886726 411781082 412151184 412950821 413657875 414045753 414514732 415126572 415681305 415829659
2980.9 415829659 416492767 417117233 417366409 417358627 417352448 417912598 418207550 418152161 418441086 418739777
$$ packed form
2915.3C96805611j737137j701851j593056j229706j474151j454659p97958n63011q46749
2924C85407333n86853M32473j98250j84784L94554M8370k48718K04811R00002j87989
2933.6C85980949J46790Q43544N05905P28874N72548Q40569P83729Q75664P78580N59959
2943.3C92617111L93181L60451J255226O62613K64816N08232O83823R51614O09551
2952C98306618M50821j07804K0218M26026R45434J177941L36227K65694O29577Q14057
2961.6D03264809O15615O31905M94423N27229R21593Q25653O56777L51066R54590R22470
2971.2D10166130P20596Q94356L70102P99637P07054L87878M68979O11840N54733J48354
2980.9D15829659O63108O24466K49176p782o179N60150K94952n5389K88925K98691
$$ plain form
2990.5 418739777 418628731 418531570 418315773 418156509 418056221 417849731 417755585 417320137 416948662 416451378
3000.2 416451378 415959015 415602798 414887238 414569511 414491425 414008331 413023186 412309494 411955147 411434288
3009.8 411434288 411094551 410765190 410076981 409000130 408018608 407288933 407098389 406723824 405913544
3018.5 405913544 405737457 405238991 404364548 403488274 402530289 401703110 400722275 399919815 399361305 398735046
3028.1 398735046 397634964 396752777 396250114 395422897 394839363 394150810 392905312 391755219 390807343
3036.8 390807343 389985466 389642715 388994484 387964020 387165451 386478767 385789185 384535370 383754120
3045.5 383754120 383119698 381980324 381164513 380314865 379517975 378365517 377579956 377134819 376398697
3054.2 376398697 375511055 373992462 373114166 372437782 371677208 370897331 369731560 369213753 368892975
$$ packed form
2990.5D18739777j11046r7161k15797j59264j00288k06490r4146m35448l71475m97284
3000.2D16451378m92363l56217p15560l17727p8086m83094r85145p13692l54347n20859
3009.8D11434288l39737l29361o88209j076851r81522p29675j90544l74565q10280
3018.5D05913544j76087m98466q74443q76274r57985q27179r80835q02460n58510o26259
3028.1C98735046j100082q82187n02663q27217n83534o88553j245498j150093r47876
3036.8C90807343q21877l42751o48231j030464p98569o86684o89582j253815p81250
3045.5C83754120o34422j139374q15811q49648p96890j152458p85561m45137p36122
3054.2C76398697q87642j518593q78296o76384p60574p79877j165771n17807l20778
$$ plain form
3062.9 368892975 368270683 367245140 366551971 365806999 364764137 364100609 362916985 362023582 361645050
3071.5 361645050 361094551 360385628 359712524 358882179 358070793 358017654 357361908 356492538 355944214 355106926
3081.2 355106926 354282570 353366470 352919960 352143021 351040192 350304451 349449501 349090729 349010353 348469353
3090.8 348469353 347410774 346329193 345603409 344860764 344174881 343459854 342750778 342637100 342264442
3099.5 342264442 341252441 340396347 339505692 338774033 338075562 337537460 337236710 336272697 335203171
3108.2 335203171 334593964 333946838 332963104 332182541 331444588 330670662 330162048 329259491 328530312 328101921
3117.8 328101921 327630463 326592064 325256577 324858093 324236679 322951736 321998062 321740074 321384315
3126.5 321384315 320468445 319697094 319119186 318612919 317696037 316751251 315669422 314803753 314347363
$$ packed form
3062.9C68892975o22292j025543o93169p44972j042862o63528j183624q93403l78532
3071.5C61645050n50499p08923o73104q30345q11386n3139o55746q69370n48324q37288
3081.2C55106926q24356r16100m46510p76939j102829p35741q54950l58772q0376n41000
3090.8C48469353j058579j081581p25784p42645o85883p15027p09076j13678l72658
3099.5C42264442j012001q56094q90655p31659o98471n38102l00750r64013j069526
3108.2C35203171o09207o47126r83734p80563p37953p73926n08614r02557p29179m28391
3117.8C28101921m71458j038399j335487l98484o21414j284943r53674k57988l55759
3126.5C21384315r15870p71351n77908n06267r16882r44786j081829q65669m56390
$$ plain form
3135.2 314347363 313168144 312549629 312460175 312035942 311166897 309826717 308857365 308181629 307552185
3143.9 307552185 306631584 305702343 304931622 304345131 303976669 303549194 302989521 302035522 301334381 300136585
3153.5 300136585 298653927 298075600 297618179 296816978 295684013 295126610 294709682 293999138 293198013
3162.2 293198013 292235527 291817245 291101398 290017109 289144859 288590240 288027763 287145691 286457195
3170.9 286457195 285520763 284761086 284198647 283229008 282452869 282066135 281621513 280915775 280244961 279414253
3180.5 279414253 278553963 278018284 277511234 276614494 275447311 274427299 274052010 273854027 272604694
3189.2 272604694 271571331 271205750 270900879 270434589 269208031 268514709 268099327 267249603 266495838
3197.9 266495838 265826645 265297985 264818783 264574089 264214611 263386631 262255993 261737347 261351681
$$ packed form
3135.2C14347363j179219o18515q9454m24233q69045j340180r69352o75736o29444
3143.9C07552185r20601r29241p70721n86491l68462m27475n59673r53999p01141j197796
3153.5C00136585j482658n78327m57421q01201j132965n57403m16928p10544q01125
3162.2B93198013r62486m18282p15847j084289q72250n54619n62477q82072o88496
3170.9B86457195r36432p59677n62439r69639p76139l86734m44622p05738o70814q30708
3180.5B79414253q60290n35679n07050q96740j167183j020012l75289j97983j249333
3189.2B72604694j033363l65581l04871m66290j226558o93322m15382q49724p53765
3197.9B66495838o69193n28660m79202k44694l59478q27980j130638n18646l85666
$$ plain form
3206.5 261351681 260427361 259975090 259158764 258470516 258532639 258263054 257530174 256496735 255876637 255617943
3216.2 255617943 255255737 254425220 253623829 253192215 252682686 252297249 251767921 251184502 250587559 250163040
3225.8 250163040 249481602 248326149 247842865 247334499 246646862 246465950 246225243 245604591 244940548
3234.5 244940548 244177265 243555145 243358536 242832909 242178841 241469116 241134624 241301765 241042576 240621490
3244.2 240621490 239879456 239365368 239119015 238574810 237994995 237144642 236625004 236260033 235793896 235663128
3253.8 235663128 235465698 235024300 234334393 233847618 233665314 233225021 232909870 232597771 231770153 231203651
3263.4 231203651 230901775 230551777 230265846 229855003 229599743 229425278 229176807 228478889 227894497 228048534
3273.1 228048534 227883778 227489071 226910057 226107140 225861797 225871830 225549412 225258026 225052071 224407959
$$ packed form
3206.5B61351681r24320m52271q16326o88248O2123k69585p32880j033439o20098k58694
3216.2B55617943l62206q30517q01391m31614n09529l85437n29328n83419n96943m24519
3225.8B50163040o81438j155453m83284n08366o87637j80912k40707o20652o64043
3234.5B44940548p63283o22120j96609n25627o54068p09725l34492J67141k59189m21086
3244.2B40621490p42034n14088k46353n44205n79815q50353n19638l64971m66137j30768
3253.8B35663128j97430m41398o89907m86775j82304m40293l15151l12099q27618n66502
3263.4B31203651l01876l49998k85931m10843k55260j74465k48471o97918n84392J54037
3273.1B28048534j64756l94707n79014q02917k45343J0033l22418k91386k05955o44112
$$ plain form
3282.7 224407959 223980007 223866196 223620586 223090649 222555809 222471199 222215691 221777935 221401405 221374474
3292.4 221374474 221211357 220532284 220096169 219947262 219962978 219068356 218064709 218423367 218778858 218355103
3302 218355103 217776814 217692146 217500801 216872845 216469193 216456127 216219292 215664787 215270920 214615688
3311.7 214615688 214365044 214597778 214455395 213889713 213305645 213124256 212671375 212245846 212000160 211830997
3321.3 211830997 211840248 211423054 210900421 210659103 210321217 209213333 208392715 208196449 207767296 207300167
3330.9 207300167 206522312 205907993 205501957 205336342 205175800 204563961 204274693 204076023 203732548 202804260
3340.6 202804260 201789246 201285782 201078587 201216488 201040878 200896397 200425491 199775333 199673729
3349.3 199673729 199584122 199493122 199040375 198458729 198195953 198273087 197942162 197194366 197170353 197174072 197020912
$$ packed form
3282.7B24407959m27952j13811k45610n29937n34840q4610k55508m37756l76530k6931
3292.4B21374474j63117o79073m36115j48907J5716q94622j003647L58658L55491m23755
3302B18355103n78289q4668j91345o27956m03652j3066k36835n54505l93867o55232
3311.7B14615688k50644K32734j42383n65682n84068j81389m52881m25529k45686j69163
3321.3B11830997R251m17194n22633k41318l37886j107884q20618j96266m29153m67129
3330.9B07300167p77855o14319m06036j65615j60542o11839k89268j98670l43475r28288
3340.6B02804260j015014n03464k07195J37901j75610j44481m70906o50158j01604
3349.3A99673729q9607r1000m52747n81646k62776P7134l30925p47796k4013L719j53160
$$ plain form
3359.9 197020912 196865520 196514816 196292191 196116962 195857525 195740070 195739994 195510941 195456448 195271358
3369.5 195271358 194848824 194629078 194539700 194393883 193897896 193926163 194119816 193784695 193527641 193533840
3379.2 193533840 193675823 193414516 193369465 193705845 193753986 193305702 192786560 193127003 193518467 193378181
3388.8 193378181 192866917 192709236 193325043 193293247 192973461 193289890 193355160 193127556 193052273 192722645
3398.4 192722645 192371902 192286701 192203808 192183208 191911659 191626472 191707363 192000942 192467384 192931499
3408.1 192931499 193186817 193019981 193000164 193088436 193150845 193589287 193485985 193073883 193479195 193902454
3417.7 193902454 193783073 194026642 194530449 194884281 195345211 195439529 195430889 195747299 196028061 196150532
3427.4 196150532 196071949 196016178 196206665 196521530 197008076 197612839 198046665 198313217 198464870 198786602
$$ packed form
3359.9A97020912j55392l50704k22625j75229k59437j17455p6k29053n4493j85090
3369.5A95271358m22534k19746q9378j45817m95987K8267J93653l35121k57054O199
3379.2A93533840J41983k61307m5051L36380M8141m48284n19142L40443L91464j40286
3388.8A93378181n11264j57681O15807l1796l19786L16429O5270k27604p5283l29628
3398.4A92722645l50743q5201q2893k0600k71549k85187Q0891K93579M66442M64115
3408.1A92931499K55318j66836j9817Q8272O2409M38442j03302m12102M05312M23259
3417.7A93902454j19381K43569N03807L53832M60930R4318q640L16410K80762J22471
3427.4A96150532p8583n5771J90487L14865M86546O04763M33826K66552J51653L21732
$$ plain form
3437 198786602 199534798 200090408 199787884 199412899 199891033 200516129 200976906 201411400 202112350 202836571
3446.7 202836571 202745914 203188934 203880501 204298630 204761028 205031719 205671444 206166229 206836834 207588634
3456.3 207588634 207672882 207914829 208335972 209199772 210134811 210538006 210786400 211343536 212196922 212885189
3466 212885189 213544025 213931332 214602070 215652809 216309967 216633015 216738338 217452106 218473549 218905945
3475.6 218905945 219190922 219990444 221018944 221737556 222773094 223804703 224178905 224585419 225538673
3484.3 225538673 226322327 226720200 227724152 228739357 229388275 230345135 231045971 231479263 232184906
3493 232184906 232861042 233500652 234158192 235042706 236288052 237243710 238152637 239068413 240198021 241101856
3502.6 241101856 241184788 242038994 242840881 243347473 244383411 245599079 246120834 246068516 247513943
$$ packed form
3437A98786602P48196N55610l02524l74985M78134O25096M60777M34494P00950P24221
3446.7B02836571r0657M43020O91567M18129M62398K70691O39725M94785O70605P51800
3456.3B07588634Q4248K41947M21143Q63800R35039M03195K48394N57136Q53386O88267
3466B12885189O58836L87307O70738J050739O57158L23048J05323P13768J021443M32396
3475.6B18905945K84977P99522J028500P18612J035538J031609L74202M06514R53254
3484.3B25538673P83654L97873J003952J015205O48918R56860P00836M33292P05643
3493B32184906O76136O39610O57540Q84514J245346R55658R08927R15776J129608R03835
3502.6B41101856Q2932Q54206Q01887N06592J035938J215668N21755n2318J445427
$$ plain form
3511.3 247513943 249422302 250520458 250969219 251944523 253500099 253911552 254485435 255766239 257052364
3520 257052364 257972431 259119854 260489159 260390797 261036797 262868099 264746037 266146164 266788883
3528.6 266788883 267247124 268038998 269518414 270919838 272731915 274089699 274798164 275527592 276222401
3537.3 276222401 277904205 279323578 280629101 281810570 283033905 284745998 286050453 286910591
3545 286910591 287316952 288858986 290159607 291427383 292778740 294070187 296110573 296694145 298220692
3553.7 298220692 300374699 302487221 304335270 304965420 306511250 308208237 309980640 310729904 312515488
3562.4 312515488 314773960 315865231 319176178 320628738 321479683 322348328 323397865 326801376 328474998
3571.1 328474998 330128632 331978874 334230194 336001587 337354774 339663849 340674667 342744751
$$ packed form
3511.3B47513943J908359J098156M48761R75304J555576M11453N73883J280804J286125
3520B57052364R20067J147423J369305r8362O46000J831302J877938J400127O42719
3528.6B66788883M58241P91874J479416J401424J812077J357784P08465P29428O94809
3537.3B76222401J681804J419373J305523J181469J223335J712093J304455Q60138
3545B86910591M06361J542034J300621J267776J351357J291447K040386N83572J526547
3553.7B98220692K154007K112522J848049O30150J545830J696987J772403P49264J785584
3562.4C12515488K258472J091271L310947J452560Q50945Q68645J049537L403511J673622
3571.1C28474998J653634J850242K251320J771393J353187K309075J010818K070084
$$ plain form
3578.8 342744751 345046005 347127151 349224434 351125488 353214111 354555855 358251419 360550117
3586.5 360550117 360006065 362183151 363609047 366468773 369404449 372036972 373651161 375118408
3594.2 375118408 378440285 379635925 381890678 384989777 386795502 389833755 391872635 393274536
3601.9 393274536 395611877 397923279 400373154 403501282 406626091 407669373 410786705 412115479
3609.6 412115479 413092613 419558983 422264442 421609459 424795227 426046562 430115433 433544960 434549713
3618.3 434549713 437782784 439791107 442237854 445736618 448990364 451441917 454508209 457645721
3626 457645721 460881271 467456741 468745842 462410202 466839943 472340622 477869034 480370483 481293564
3634.7 481293564 485468750 489656219 492553329 494483910 497011147 500305595 503691673 506356850
$$ packed form
3578.8C42744751K301254K081146K097283J901054K088623J341744L695564K298698
3586.5C60550117n44052K177086J425896K859726K935676K632523J614189J467247
3594.2C75118408L321877J195640K254753L099099J805725L038253K038880J401901
3601.9C93274536K337341K311402K449875L128128L124809J043282L117332J328774
3609.6D12115479R77134O466370K705459o54983L185768J251335M068871L429527J004753
3618.3D34549713L233071K008323K446747L498764L253746K451553L066292L137512
3626D57645721L235550O575470J289101o335640M429741N500679N528412K501449R23081
3634.7D81293564M175186M187469K897110J930581K527237L294448L386078K665177
$$ plain form
3642.4 506356850 508649979 511698914 515685158 521480827 521811562 520973282 528241844 529929123 527910118
3651.1 527910118 528326302 533767776 538907051 543545876 549221802 544132118 546521149 552881851
3658.8 552881851 555516243 558146019 559466324 562022629 564172707 566527252 569246750 570560608
3666.5 570560608 575085526 577659302 577493591 579295578 575441017 578556900 586359711 593648109
3674.3 593648109 592694588 580494576 583638535 591652756 596703529 594995346 595792160 599292984
3682 599292984 601810455 603359337 604036179 604846268 608783913 615507469 609309959 606280899 613325462
3690.6 613325462 608250122 608798676 614695854 615898743 617092857 616863594 616919861 618616905 619258080
3699.3 619258080 622208481 624713326 620097389 619065895 623679924 625784912 626271286 626635017 629398575
$$ packed form
3642.4E06356850K293129L048935L986244N795669L30735q38280P268562J687279k019005
3651.1E27910118M16184N441474N139275M638825N675926n089684K389031O360702
3658.8E52881851K634392K629776J320305K556305K150078K354545K719498J313858
3666.5E70560608M524918K573776j65711J801987l854561L115883P802811P288398
3674.3E93648109r53521j2200012L143959Q014221N050773j708183P96814L500824
3682E99292984K517471J548882O76842Q10089L937645O723556o197510l029060P044563
3690.6F13325462n075340N48554N897178J202889J194114k29263N6267J697044O41175
3699.3F19258080K950401K504845m615937j031494M614029K104988M86374L63731K763558
$$ plain form
3708 629398575 633637161 627224846 630584183 635542030 623438263 627727432 632590370 632611351 632817039
3716.7 632817039 635122452 637285309 634133453 634458847 639388504 636644936 633092842 637744789
3724.4 637744789 639313240 638806992 636544914 636465187 639687805 640673523 645784912 643601761 636633072
3733.1 636633072 644450760 643964691 636435890 638236237 640017853 640516586 643244781 646707687 643814316
3741.8 643814316 646363220 656291809 647368164 634397202 642786331 647908936 654234848 651735687
3749.5 651735687 640142288 649404373 646482239 640235062 646042099 650848999 653608704 648398819
3757.2 648398819 650682068 656062241 649365540 648053665 651955566 653781891 654419174 657072067
3764.9 657072067 654781418 651165466 653848724 657393723 656745300 648847580 651152954 654706955
$$ packed form
3708F29398575M238586o412315L359337M957847j2103767M289169M862938K0981K05688
3716.7F32817039K305413K162857l151856L25394M929657k743568l552094M651947
3724.4F37744789J568451n06248k262078p9727L222618R85718N111389k183151o968689
3733.1F36633072P817688m86069p528801J800347J781616M98733K728195L462906k893371
3741.8F43814316K548904R928589q923645j2970962Q389129N122605O325912k499161
3749.5F51735687j1593399R262085k922134o247177N807037M806900K759705n209885
3757.2F48398819K283249N380173o696701j311875L901901J826325O37283K652893
3764.9F57072067k290649l615952K683258L544999o48423p897720K305374L554001
$$ plain form
3772.6 654706955 655478516 656438065 655733414 656685715 657700729 660197983 658704758 651006088 653952103
3781.3 653952103 657065048 659040146 660801163 657927246 657346649 658456421 658913651 659324036 659129944
3790 659129944 659389954 659496078 659672012 659953461 661170807 663469772 660172729 656632385 659114075
3798.7 659114075 662708359 666845016 661045609 652571564 656156616 658751755 663327179 668775253
3806.4 668775253 659759293 655456161 660188141 662179031 662060165 662092972 662189026 663549576 668044891
3815.1 668044891 665831223 653608017 658585892 664288025 667581100 667218170 651612244 654877319
3822.8 654877319 660806732 662964401 665844269 665460129 661199036 661651611 663754730 666393127 667249908
3831.4 667249908 660225830 662903671 669432220 663457642 662586441 670208359 663472824 658633270
$$ packed form
3772.6F54706955P71561R59549p04651R52301J015014K497254j493225p698670K946015
3781.3F53952103L112945J975098J761017k873917n80597J109772M57230M10385j94092
3790F59129944K60010J06124J75934K81449J217346K298965l297043l540344K481690
3798.7F59114075L594284M136657n799407q474045L585052K595139M575424N448074
3806.4F68775253r015960m303132M731980J990890j18866L2807R6054J360550M495315
3815.1F68044891k213668j2223206M977875N702133L293075l62930j5605926L265075
3822.8F54877319N929413K157669K879868l84140m261093M52575K103119K638397Q56781
3831.4F67249908p024078K677841O528549n974578q71201P621918o735535m839554
$$ plain form
3839.2 658633270 664948730 661495514 661007614 666396484 663437576 660594330 663661118 664927750
3846.9 664927750 665360031 666546478 665467300 667605286 671655197 664727478 665172729 654574814
3854.6 654574814 656088486 665101166 663997116 662734451 664523239 665693893 667468872 663158875
3862.3 663158875 663810196 669839935 665038376 659974976 663476181 668423233 673769073 665743790
3870 665743790 656805573 661285095 667464523 670566101 662074356 662231369 665661316 665938263 668144226
3878.7 668144226 670750732 665230942 659746933 664963379 665735550 666394348 670262070 659572754
3886.4 659572754 661618652 665396194 665975494 670170593 668978958 661696701 662376022 665125351 664111023
3895.1 664111023 665094910 665835190 667105789 668351288 660649490 665897980 667267914 661576462 666149063
$$ packed form
3839.2F58633270O315460l453216m87900N388870k958908k843246L066788J266632
3846.9F64927750M32281J186447j079178K137986M049911o927719M45251j0597915
3854.6F54574814J513672R012680j104050j262665J788788J170654J774979m309997
3862.3F63158875O51321O029739m801559n063400L501205M947052N345840q025283
3870F65743790q938217M479522O179428L101578q491745J57013L429947K76947K205963
3878.7F68144226K606506n519790n484009N216446P72171O58798L867722j0689316
3886.4F59572754K045898L777542N79300M195099j191635p282257O79321K749329j014328
3895.1F64111023R83887P40280J270599J245499p701798N248490J369934n691452M572601
$$ plain form
3903.8 666149063 663635406 662053223 662555313 664193268 666684113 666545181 666652527 665986404 666433563
3912.5 666433563 666742935 665904694 666266327 667515869 664449081 661066742 665478210 665809402 662730408
3921.1 662730408 665371475 667104492 667672119 665763474 663155289 663877487 665133057 666277466 665158081
3929.8 665158081 664590225 666537018 665014877 663323288 663817444 663461990 664326935 665419693 665005264
3938.5 665005264 664684372 664610443 665772171 666148071 662547455 662157059 663739319 664523239 665603790
3947.2 665603790 663958282 664390411 665410538 663736191 664865112 664956741 664458008 664491196 663909302
3955.8 663909302 663964157 663822556 664511490 664376144 664990845 665524139 664137497 664207916 664368515 664812393
3965.5 664812393 664583588 664023743 664305954 664047089 664063263 664232788 664642410 664160156 663498611 663821564
$$ packed form
3903.8F66149063k513657j582183N02090J637955K490845j38932J07346o66123M47159
3912.5F66433563L09372q38241L61633J249542l066788l382339M411468L31192l078994
3921.1F62730408K641067J733017N67627j908645k608185P22198J255570J144409j119385
3929.8F65158081n67856J946793j522141j691589M94156l55454Q64945J092758m14429
3938.5F65005264l20892p3929J161728L75900l600616l90396J582260P83920J080551
3947.2F65603790j645508M32129J020127j674347J128921R1629m98733L3188n81894
3955.8F63909302N4855j41601O88934j35346O14701N33294j386642P0419J60599M43878
3965.5F64812393k28805n59845K82211k58865J6174J69525M09622m82254o61545L22953
$$ plain form
3975.1 663821564 663568268 663196869 663843842 665048370 664926071 664405746 664485550 664270554 663974075 663545380
3984.8 663545380 663592072 664336472 664224014 663494339 664119339 664739685 664027176 663226471 663649445 665126953
3994.4 665126953 665162735 664318161 664243011 664319458 663792191 663512802
4000.2 663512802
$$ packed form
3975.1F63821564k53296l71399O46973J204528j22299n20325P9804k14996k96479m28695
3984.8F63545380M6692P44400j12458p29675O25000O20346p12509q00705M22974J477508
3994.4F65126953L5782q44574p5150P6447n27267k79389
4000.2F63512802
##END=$$ End of the data block
