##TITLE=$$ Begin of the data block
##JCAMP-DX=5.00 $$ ACD/SpecManager v 10.08
##SPECTROMETER/DATA SYSTEM=Varian
##DATE=14 Jan 2013 10:21:42
##DATA TYPE=INFRARED SPECTRUM
##DATA CLASS=XYDATA
##ORIGIN=
##OWNER=
##NPOINTS=3735
##FIRSTX=399.26403809
##LASTX=4000.35498047
##MAXX=4000.35498047
##MINX=399.26403809
##MAXY=72.30548859
##MINY=19.25686836
##XFACTOR=1.0000000000
##YFACTOR=0.000000100000000
##FIRSTY=39.68716431
##DELTAX=0.96440572
##XUNITS=1/CM
##YUNITS=TRANSMITTANCE
##XYDATA=(X++(Y..Y))
399.3C96871643p111244K993622j808815R7198Q765602J545716K127685K12517r669151
407.9C94024773n765343M526749Q545684O470566J006584o507110m544068M90609J769447
416.6D00017891K54440l219299N9242n229492j325798O83479L852616J981277l856201
425.3C93218155l543739j998864K304726j245193l632660j058617j845551M330292
433C86528549L242989J207313K370987J33286J997528k939606k632103L128853n618629
441.7C87419167l936959J0681229J390037o701202j833076J501922L247109J263733
449.4C93031960P02514r16786m903259J42021J035843k756577j056099J879044j513176
458.1C85645485k291756J820030J08948p10029P72361j468696k416802J023484M797821
$$ plain form
399.3 396871643 389760399 392754021 390945206 391042404 399808006 401353722 403481407 403693924 394024773
407.9 394024773 388259430 392786179 401331863 407802429 408809013 402301903 397757835 398248444 400017891
416.6 400017891 400272331 397053032 397112274 391882782 390556984 391240463 395093079 397074356 393218155
425.3 393218155 389674416 387675552 389980278 388735085 385102425 384043808 382198257 386528549
433 386528549 389771538 390978851 393349838 393483124 395480652 392541046 389908943 393037796 387419167
441.7 387419167 383482208 394163437 395553474 388852272 387019196 388521118 391768227 393031960
449.4 393031960 393734474 392817688 387914429 388056450 389092293 386335716 385279617 387158661 385645485
458.1 385645485 383353729 385173759 385282707 384572678 385345039 383876343 381459541 382483025 387280846
466.8C87280846J670417k546844l833008m523086l885231J871719Q960380j396446
474.5C83598747k816200J993446j918907j259613l882065j391067K036056j27563K832260
483.2C79065094n022964n10331N628701k183724m164657l277855M460601K158661m606857
491.8C71546669J555786M021340q0300l667412j243057j290130k215195k052612J7662
500.5C66592751K932205N21888J613083J238137j3810j479568k087021j013641l975716
509.2C64328308r58252P83806p40280J403541L522759L96500m345246r52339N80559
517.9C64019356j956406k157898j315918o13022P54166J351013j722946j691589j117363
526.6C55549393Q23364K375832N99060l85514j800232j294250m09241J290970J111488
$$ plain form
466.8 387280846 388951263 386404419 382571411 378048325 374163094 376034813 384995193 383598747
474.5 383598747 380782547 382775993 380857086 379597473 375715408 374324341 376360397 376232834 379065094
483.2 379065094 374042130 373531799 379160500 376976776 372812119 369534264 373994865 376153526 371546669
491.8 371546669 373102455 377123795 377043495 373376083 372133026 370842896 368627701 366575089 366592751
500.5 366592751 369524956 370046844 371659927 372898064 372884254 371404686 369317665 368304024 364328308
509.2 364328308 363370056 364153862 363413582 364817123 368339882 368736382 364391136 363438797 364019356
517.9 364019356 362062950 359905052 358589134 357976112 358730278 360081291 358358345 356666756 355549393
526.6 355549393 356372757 358748589 359347649 358962135 357161903 355867653 355458412 356749382 357860870
535.2C57860870p21016o9580j313133j458053j472016k27775P89756q19778p36427
543.9C51832848l98522l72925j066246P15485N01251j580238j506653j222229J014671
552.6C47917442k42576j550598L45039N17120j574249k081680N82924l99781j474762
561.3C42038879l7498J696243J270371l53241J266441Q19626r40399o24428l76587
570C44759407j55220l58467l01056k4490o3591N91354J085548p33108q06732o43692
579.6C43349953o27480N64270l98979o08215j061058Q60824K753220P8468j014175
588.3C43896828l01743Q52432k57454k13432J733933q7586n23605L66592R39255Q22449
597.9C47227669K82287K65198q23555q90274r37576p63359J3504m082J42822q5525
$$ plain form
535.2 357860870 357139854 357070274 355757141 354299088 352827072 352599297 353389053 352569275 351832848
543.9 351832848 351434326 351061401 349995155 350710640 351211891 349631653 348125000 346902771 347917442
552.6 347917442 347674866 346124268 346469307 346986427 345412178 343330498 343913422 343513641 342038879
561.3 342038879 342001381 343697624 344967995 344614754 345881195 346700821 345760422 345135994 344759407
570 344759407 344604187 344245720 343944664 343920174 343856583 344447937 345533485 344800377 343993645 343349953
579.6 343349953 342722473 343286743 342887764 342279549 341218491 342079315 344832535 344911003 343896828
588.3 343896828 343595085 344447517 344190063 343976631 345710564 345622978 345099373 345465965 346405220 347227669
597.9 347227669 347509956 347775154 346951599 346061325 345123749 344360390 344373894 344369812 344512634 344427109
607.6C44427109m61312j000518j300354p76215o72493p52678R0981J14631j252861
616.3C38416290o59523J347962R64431o81228p75528O41365J247063L58047L05901
624.9C41164780j2284O10276K285881J102295J084137K263336K037849J006165l80249
633.6C51162186P00454J935158J772270J752739J581536J214294J76239M44946J522370
642.3C62262192R18274J767502K299499N89790K25411J51291K93236J100769J266212
651C70874176O44913N65643M28467J15700O97326l46298l26652J85241M63143O04629
660.6C73906288j679382j131211j69219J19819J020622k47383k086258l939209M010430
669.3C69804497K766266J250305J694832J770782L99017q29467N46188J380539J171036
$$ plain form
607.6 344427109 343965797 342965279 341664925 340888710 340216217 339463539 339554520 339669151 338416290
616.3 338416290 337756767 339104729 340069160 339387932 338612404 339253769 340500832 340858879 341164780
624.9 341164780 341152496 341762772 344048653 345150948 346235085 348498421 350536270 351542435 351162186
633.6 351162186 351862640 353797798 355570068 357322807 358904343 360118637 360294876 360739822 362262192
642.3 362262192 363180466 364947968 367247467 367837257 368062668 368213959 368507195 369607964 370874176
651 370874176 371519089 372084732 372513199 372628899 373326225 372979927 372653275 372838516 373301659 373906288
660.6 373906288 372226906 371095695 370926476 371046295 372066917 371819534 369733276 365794067 369804497
669.3 369804497 372570763 373821068 375515900 377286682 377685699 376856232 377402420 378782959 379953995
678C79953995J405182J655922J914062M60091J265144J835556L89633M67224O76308
686.7C90023117J540337J388054P03315R03282J202126J078529j13868J79329J313591
695.3C98217812R85298J96113O07872J081124N68428J104393J550369R71451R03168
704D06186028J09787m58527O82526J038093R89151P87239J080055J721268o1798l50533
713.7D11723289Q53615O02455J057930J032448K63481M21868J038475J184082Q67882
722.3D19045525N24101k8801K28042J837388J924552L49236R7656J136170J845054
731D26958923N12848n6000J068688Q60290J42785j62240O75278P73812O43577O33164
740.7D32051125p06635j373O90307P10106J566201J321334M36020p2555P13958J022416
$$ plain form
678 379953995 381359177 383015099 384929161 385389252 386654396 388489952 388879585 389346809 390023117
686.7 390023117 391563454 392951508 393654823 394558105 395760231 396838760 396724892 396904221 398217812
695.3 398217812 399203110 399399223 400007095 401088219 401656647 402761040 404311409 405282860 406186028
704 406186028 406295815 405837288 406519814 407557907 408547058 409334297 410414352 412135620 412073822 411723289
713.7 411723289 412576904 413179359 414237289 415269737 415533218 415955086 416993561 418177643 419045525
722.3 419045525 419569626 419540825 419768867 421606255 423530807 423880043 423977699 425113869 426958923
731 426958923 427471771 427415771 428484459 429344749 429487534 429325294 430000572 430774384 431417961 432051125
740.7 432051125 431344490 431343117 432033424 432743530 434309731 435631065 436067085 435994530 436708488 437730904
750.3D37730904N40161Q27904J110839J033364J003112M71116k24305J195183K237969
759D45926247P18765N08041J688767J271858J132774J604653J266784R78508M61731
767.7D55558128N04876k49100p29332K58827L73802M72450J65635j7166J85585P37724
777.3D57261429M78096n91240n71900m42771P99255O12068J25809J179581R28077N05295
787D60283699J64795O96945Q60062Q9416n01442r0484N98869L35655K34146m27284
796.6D62244377K2392n18608r15489n66177j815987o01044m55627j149979o12449j499253
806.2D54132156k630272k270545j829224k329369j056976p97043j849251j745376o73218
814.9D38950882r8915o78978m49638j191445p20825N86739J19590P10373J814079J767731
$$ plain form
750.3 437730904 438271065 439098969 440209808 441243172 442246284 442717400 442493095 443688278 445926247
759 445926247 446645012 447153053 448841820 450113678 451246452 452851105 454117889 455096397 455558128
767.7 455558128 456063004 455813904 455084572 455343399 455717201 456189651 456355286 456338120 456523705 457261429
777.3 457261429 457739525 457148285 456576385 456133614 456932869 457544937 457670746 458850327 459778404 460283699
787 460283699 460448494 461145439 462005501 462094917 461593475 461502991 462101860 462437515 462671661 462244377
796.6 462244377 462266769 461748161 460832672 460266495 458450508 457849464 457393837 456243858 455631409 454132156
806.2 454132156 451501884 449231339 447402115 445072746 444015770 443218727 441369476 439624100 438950882
814.9 438950882 438851967 438172989 437723351 436531906 435811081 436397820 436517410 437227783 439041862 440809593
824.6D40809593J638756K888412L000222L029098L068581K402725L185806K587510
832.3D62610703K503967K049026K979126M750252K512589J833381K105904J756401
840D83101349J339989J904335J206779N81589K103157J131058J911926J961594J225891
848.7D96467667J811332J025200O13938O06117J229706J335830K799263K284470J661911
857.4E09835434K790680J536217J098747N26695P63817m20876m13284P71713N31350
866E17020493J286392l69873l06816m78249l63770m88510k722702k430458j960182
874.7E09186325p07588j236191r14268L21617o1226k47688j865235j999664q64411
883.4E01611671k21710j596184q32634L86391l9520O08025j158143p67173j83220J37291
$$ plain form
824.6 440809593 442448349 445336761 448336983 451366081 454434662 456837387 460023193 462610703
832.3 462610703 465114670 467163696 470142822 474893074 477405663 479239044 481344948 483101349
840 483101349 484441338 486345673 487552452 488134041 490237198 491368256 493280182 495241776 496467667
848.7 496467667 498278999 499304199 499918137 500524254 501753960 503089790 505889053 508173523 509835434
857.4 509835434 512626114 514162331 515261078 515787773 516551590 516130714 515717430 516489143 517020493
866 517020493 518306885 517937012 517630196 517151947 516788177 516299667 513576965 511146507 509186325
874.7 509186325 508478737 507242546 506328278 506649895 506588669 506340981 504475746 502476082 501611671
883.4 501611671 501389961 499793777 498961143 499347534 499308014 499916039 498757896 497990723 497807503 497944794
893D97944794L18412n52864N68581J31683J071511R86747j79824p91130j069146J05477
902.7D98534241k29607Q67233J659661K415428K414741J774559K374764J623917R87815
911.4E12422752k89840J79252o19011j687965j337700j743469r78432j909027j980019
920E02056541k331924k508469k862701l901138l248787l982010l721771l533287k667847
928.7D73298607k528801l120995j515426j498490j463585k089653k491607j977997
936.4D56612053j351509q38890j640625j081772j021767j060257j124611j166153r32464
945.1D46394005j696320q70514j7166N15404o7558p62329J29318l3226q93822j651688
954.8D41046104j429939j471557j944886k458229k358475k025451k313690j556511
$$ plain form
893 497944794 498263206 497710342 498278923 498410606 499482117 500468864 500289040 499497910 498428764 498534241
902.7 498534241 498304634 499171867 500831528 503246956 505661697 507436256 509811020 511434937 512422752
911.4 512422752 512132912 512312164 511693153 510005188 508667488 506924019 505945587 504036560 502056541
920 502056541 499724617 497216148 494353447 490452309 487203522 483221512 479499741 475966454 473298607
928.7 473298607 470769806 467648811 466133385 464634895 463171310 461081657 458590050 456612053
936.4 456612053 455260544 454421654 452781029 451699257 450677490 449617233 448492622 447326469 446394005
945.1 446394005 444697685 443827171 443810005 444325409 444257851 443495522 443624840 443591614 442697792 441046104
954.8 441046104 439616165 438144608 436199722 433741493 431383018 429357567 427043877 425487366
962.5D25487366j753159k571106k894401k220574j486015j955719j951332k467423
970.2D08187637k201690j884156k514457l078766l843918l654213l859863l651467
977.9C83499107l491706m804955n179749m734916m421425n115433n788994n115585
985.6C44846344m505386m087830m663582m254799l726387m913540m268112l396988
993.3C11029720k581501k938862l803138k936554k939911k906132k976303k523766
1001.1B87423553k252330k809315l164406k706699j749478k031402j252136j099854
1008.8B70357933j669559j949158j895104j442070j749324j656151k143669j747856
1016.5B56105042k466755k864151j729393j841889j636753k150822j723899k466393
$$ plain form
962.5 425487366 423734207 421163101 418268700 416048126 414562111 412606392 410655060 408187637
970.2 408187637 405985947 404101791 401587334 398508568 394664650 391010437 387150574 383499107
977.9 383499107 380007401 375202446 370022697 365287781 360866356 355750923 349961929 344846344
985.6 344846344 340340958 336253128 331589546 327334747 323608360 318694820 314426708 311029720
993.3 311029720 308448219 305509357 301706219 298769665 295829754 292923622 289947319 287423553
1001.1 287423553 285171223 282361908 279197502 276490803 274741325 272709923 271457787 270357933
1008.8 270357933 268688374 266739216 264844112 263402042 261652718 259996567 257852898 256105042
1016.5 256105042 253638287 250774136 249044743 247202854 245566101 243415279 241691380 239224987
1024.2B39224987k352982j421432j418190m90341j474915q34541j193771j163578p93362
1032.9B28081875j107407l6888m43859J032105Q16535J357327J737843J243534K263221
1041.6B34944286J193257J153431K35614L05157m03480q53176o73543j678524j30119
1050.2B34092903p90844q18767j278878j259098j031913o18859J145439j115741K13642
1058.9B28537884Q35552P62959J260547J212464K606487J561947K798633J920433R82113
1067.6B42479019Q72250J152115J564941k98862J002941K59018L00884M20971N02052
1076.3B48255329J065483l61252J258068J221867J264534N81684P63855J684456M13113
1085B56147137O54945J042442K248955J245728J962967K223014O47221J111183J258965
$$ plain form
1024.2 239224987 236872005 235450573 234032383 233542042 232067127 231232586 230038815 228875237 228081875
1032.9 228081875 226974468 226937580 226493721 227525826 228342361 229699688 231437531 232681065 234944286
1041.6 234944286 236137543 237290974 237526588 237831745 237428265 236575089 235901546 234223022 234092903
1050.2 234092903 233302059 232483292 231204414 229945316 228913403 228294544 229439983 228324242 228537884
1058.9 228537884 229373436 230136395 231396942 232609406 235215893 236777840 239576473 241496906 242479019
1067.6 242479019 243351269 244503384 246068325 245769463 246772404 247031422 247332306 247753277 248255329
1076.3 248255329 249320812 248959560 250217628 251439495 252704029 253285713 254049568 255734024 256147137
1085 256147137 256802082 257844524 260093479 261339207 263302174 265525188 266172409 267283592 268542557
1093.6B68542557K379246J121521J379051J456222J184941J972293O70529J409054
1101.4B80115414J126365J157112J262513J741085J914310Q96664J485195J86901J69792
1110B90055351N55706J378460J520748K88582J243572R58443O59275K2831J87931K66476
1119.7B97137375j56651k55642j045055N71327N70088P97214J165180Q27885K318802
1128.4C01930523K000256J529541J533470J930847K088165K005577J935101J796894
1136.1C16750374K590313K770633K239991J133651R70994J364860J244888J019135
1143.8C30084839Q85773N97686L5286J010933J384316Q50410K59934n15137n29518
1152.5C34064522n02510J18408l3760l36685j78337m60396l23372j67160j07842q42018
$$ plain form
1093.6 268542557 270921803 272043324 273422375 274878597 276063538 278035831 278706360 280115414
1101.4 280115414 281241779 282398891 283661404 285402489 287316799 288213463 289698658 289885559 290055351
1110 290055351 290611057 291989517 293510265 293798847 295042419 296000862 296660137 296682968 296870899 297137375
1119.7 297137375 296980724 296725082 295680027 296251354 296821442 297618656 298783836 299611721 301930523
1128.4 301930523 303930779 305460320 306993790 308924637 311012802 313018379 314953480 316750374
1136.1 316750374 319340687 322111320 324351311 325484962 326455956 327820816 329065704 330084839
1143.8 330084839 330970612 331568298 331603584 332614517 333998833 334849243 335109177 334594040 334064522
1152.5 334064522 333562012 333680420 333646660 333309975 333131638 332671242 332347870 332180710 332072868 331230850
1162.1C31230850m64973N60150Q24013J498031K387467K760124K325973K971726L081665
1170.8C47175026K925262L050690K828751K692146K768517L704566L115922K188301
1178.5C70449181K654609K858124K574425K529297K258300J928902J498337P65648
1186.2C87516823J060982R77478O20269Q18291M96750r308l90510r63364j140595j397819
1195.9C87588997j339951l51753j047172j479607r40399j297837j300811j469994j152153
1204.5C77209320p70988j378746j497765j025810o46057m45824k19078l97720j53695
1213.2C70673637O2523p57866m78553k59400o11381m12560l84445j94702l8796l07541
1222.9C67290916j028785o89926j47934q38547p51763q42819j390800j281014q80890
$$ plain form
1162.1 331230850 330765877 331326027 332150040 333648071 336035538 338795662 341121635 344093361 347175026
1170.8 347175026 350100288 353150978 355979729 358671875 361440392 365144958 368260880 370449181
1178.5 370449181 373103790 375961914 378536339 381065636 383323936 385252838 386751175 387516823
1186.2 387516823 388577805 389555283 390175552 390993843 391490593 391481285 391090775 390127411 388986816 387588997
1195.9 387588997 386249046 385897293 384850121 383370514 382430115 381132278 379831467 378361473 377209320
1204.5 377209320 376438332 375059586 373561821 372536011 371889954 371444130 371225052 370827332 370673637
1213.2 370673637 370736160 369978294 369499741 369240341 368628960 368216400 367831955 367637253 367598457 367290916
1222.9 367290916 366262131 365572205 365424271 364585724 363833961 362991142 361600342 360319328 359438438
1231.5C59438438m29191l55034l74069o20880o66352n90934n68047m80766m55017j01281
1241.2C54796867n4702k70234m26139k34032l47633m27247m15306q43010n43594p10792
1250.8C50524178m60396P477j984L88183j2474j01242n05600l19900L87726k9679o9084
1261.4C49807205k1286J28937K96059P08885N67436L92838O64062N11322R45015R20754
1271.1C54921227P32269N69343Q80967J224517J104699J526718J317215J150932R04465
1279.8C64332352P41615J084785J520043J960335J855735J697770J527023J560402
1287.5C76280060J452637J383552J277504J258469J168480Q98475J018105P90634J095161
1296.2C86623077J174241N12313O53000O47965P6256K97889L29895L1815K75802o5078
$$ plain form
1231.5 359438438 359009247 358654213 358280144 357659264 356992912 356401978 355833931 355353165 354898148 354796867
1241.2 354796867 354742165 354471931 354045792 353811760 353464127 353036880 352621574 351778564 351234970 350524178
1250.8 350524178 350063782 350071259 350069275 350457458 350444984 350343742 349838142 349518242 349905968 349876289 349807205
1261.4 349807205 349785919 349914856 350210915 350919800 351487236 351880074 352544136 353055458 354000473 354921227
1271.1 354921227 355653496 356222839 357103806 358328323 359433022 360959740 362276955 363427887 364332352
1279.8 364332352 365073967 366158752 367678795 369639130 371494865 373192635 374719658 376280060
1287.5 376280060 377732697 379116249 380393753 381652222 382820702 383719177 384737282 385527916 386623077
1296.2 386623077 387797318 388309631 388962631 389610596 389686852 389984741 390314636 390346451 390622253 390557175
1305.8C90557175k1286j04370k64855j91231n14793l33939o91185o92596m16527k85759
1315.4C87040634r1057L2616P46269N30167P55806J131592O97631O69213O99081R22966
1325.1C93134918P63130N37110J48124J1406k78892p23229m91409n20134n15098n22156
1334.7C91543770l68271l88222k60620J49155K10113O28586O74744O84852N23568Q25004
1344.4C94222679J039391P21969P40395K64549N26238J42326l57628o21223o09093
1353.1C96069603m7150n38597l73993l89518j37063j602j09405n75638j365624m39796
1362.7C92091217j223907k69204L17459p4157K8267j068535q39882m31671n69649n99823
1372.3C87360115l95813o57692o32057Q00781J17188k75879j46332J8311n08538j432762
$$ plain form
1305.8 390557175 390535889 390431519 390166664 389975433 389460640 389126701 388435516 387742920 387326393 387040634
1315.4 387040634 386949577 386982193 387728462 388258629 389014435 390146027 390843658 391512871 392211952 393134918
1325.1 393134918 393898048 394435158 394583282 394594688 394315796 393592567 393101158 392581024 392065926 391543770
1334.7 391543770 391175499 390787277 390526657 390675812 390885925 391514511 392189255 392874107 393397675 394222679
1344.4 394222679 395262070 395984039 396724434 396988983 397515221 397657547 397299919 396678696 396069603
1353.1 396069603 396022453 395483856 395109863 394720345 394583282 394581680 394472275 393896637 392531013 392091217
1362.7 392091217 390867310 390598106 390915565 390841408 390869675 389801140 388961258 388529587 387959938 387360115
1372.3 387360115 386964302 386306610 385674553 386475334 386592522 386316643 386170311 386188622 385680084 384247322
1382C84247322j470375j586647j280365j561546j253472j881065j251984m54521j681633
1390.7C71825714j545944j833344k080116l282432k852745q97255j857872j586915
1398.4C55889091k640457k006149j309280k156067j757546k184295l142586k730370
1406.1C37962341j490822j379356j631699j077728j328430j147842j536713j261635
1413.8C27108116q43391j460457r20220j094856m10690j174469K03857J482849L1167
1422.5C22921906J79939J07727J098213O72226k22130J090813N40848Q29506J414489
1431.2C28633537K085381J723747J609078K041626Q44116J148033J517906K802467
1438.9C42405891K254219J994248K324333J606598K280884J452598J499520J062164
$$ plain form
1382 384247322 382776947 381190300 379909935 378348389 377094917 375213852 373961868 373507347 371825714
1390.7 371825714 370279770 368446426 366366310 363083878 360231133 359333878 357476006 355889091
1398.4 355889091 353248634 351242485 349933205 347777138 346019592 343835297 340692711 337962341
1406.1 337962341 336471519 335092163 333460464 332382736 331054306 329906464 328369751 327108116
1413.8 327108116 326264725 324804268 323884048 322789192 322378502 321204033 321407890 322890739 322921906
1422.5 322921906 323101845 323209572 324307785 324980011 324757881 325848694 326389542 327219048 328633537
1431.2 328633537 330718918 332442665 334051743 336093369 336937485 338085518 339603424 342405891
1438.9 342405891 344660110 346654358 348978691 350585289 352866173 354318771 355818291 356880455
1446.6C56880455J179695J314659J565476K321129J007957J846046J369935J534500
1454.3C69019852J481552P72552J468239l26652L781395J897125K294121J985054J561775
1463C83935013K291870Q88176K847671K348824K838249K363014K371750K931481J748275
1471.7D04564323L896637K956162L847771L554306L033218K850342K287521K138138
1479.4D29128418J629410K081222K217179K167396J894722J135025J205292O35147
1487.1D42093811O95343J409531r04732q26912Q40912J64947o21757n33447m62456
1495.8D41855240l820458l14903j711807l437119n08995j327438j853790j602173O3858
1504.5D27342415q99239m459991k695999J063995J702347r55467O43653p88726j654053
$$ plain form
1446.6 356880455 358060150 359374809 360940285 363261414 364269371 366115417 367485352 369019852
1454.3 369019852 370501404 371273956 372742195 372415543 376196938 378094063 380388184 382373238 383935013
1463 383935013 386226883 387115059 389962730 392311554 395149803 397512817 399884567 402816048 404564323
1471.7 404564323 408460960 411417122 415264893 418819199 421852417 424702759 426990280 429128418
1479.4 429128418 430757828 432839050 435056229 437223625 439118347 440253372 441458664 442093811
1487.1 442093811 442789154 444198685 443293953 442467041 443307953 443472900 442851143 442317696 441855240
1495.8 441855240 438034782 437719879 436008072 432570953 432061958 430734520 428880730 427278557 427342415
1504.5 427342415 426443176 421983185 419287186 420351181 422053528 421098061 421741714 420952988 419298935
1513.1D19298935j07346p62787l70826j925240j278381P56607O86836k006607j448250
1521.8D12842941J207924O02760J304932r56039R20181J079559j61857R00879O05011
1530.5D18346291O41365O22520L53546j631622J266251J007652K29225J373482k868119
1539.2D19340591k815475J875992N65262O29844J881142O79321q88443J616898M25033
1547.9D23310165N22843j018295j154633J337585M21791N47486k813645M56238J469956
1556.5D23079491J565475J062546j1077042k60048O71082P37381j686134j476708k814865
1565.2D09801178k651978j040268k634658j371346p834701j847191j871796l777923
1572.9C86771317l086205l432312j541023j1277466j285057l048973m323159l741493
$$ plain form
1513.1 419298935 419191589 418428802 418057976 416132736 414854355 415610962 416297798 414291191 412842941
1521.8 412842941 414050865 414653625 415958557 415002518 415922699 417002258 416840401 417741280 418346291
1530.5 418346291 418987656 419610176 419963722 418332100 419598351 420606003 420835228 422208710 419340591
1539.2 419340591 416525116 418401108 418966370 419596214 421477356 422156677 421268234 422885132 423310165
1547.9 423310165 423833008 422814713 421660080 422997665 423419456 423966942 421153297 421609535 423079491
1556.5 423079491 424644966 425707512 414630470 414370422 415041504 415778885 414092751 412616043 409801178
1565.2 409801178 407149200 406108932 403474274 402102928 394268227 392421036 390549240 386771317
1572.9 386771317 383685112 380252800 378711777 367434311 366149254 363100281 358777122 355035629
1580.6C55035629n347519l495407n624237l347015m990463m341202m124985n149021
1588.4C18615780l487148n821114k895241n285587l333187l761730m517880k491760
1596.1B87022133m863529j831017m399147k649326l744793l192063k275390m295025
1603.8B59771843o38065l310833j162281l034211j542778j319141k600193N19581k660313
1612.5B44023609o6604k297612j4801K194n036679J729718j149712J320763j371193
1621.1B37139683J092930n78251j917935J933117n09949K094594j542283J781178Q47607
1629.8B40340691P45487J066894l67775K332726m80652K995853r52968K476158K085896
1638.5B50242310J088371K929287N96847K447052K79179K351360K023068K7065K078266
$$ plain form
1580.6 355035629 349688110 346192703 340568466 337221451 332230988 327889786 323764801 318615780
1588.4 318615780 315128632 309307518 306412277 301126690 297793503 294031773 289513893 287022133
1596.1 287022133 282158604 280327587 275928440 273279114 269534321 266342258 264066868 259771843
1603.8 259771843 259133778 255822945 254660664 251626453 250083675 248764534 246164341 246683922 244023609
1612.5 244023609 243957005 241659393 241644592 241646786 236610107 238339825 237190113 238510876 237139683
1621.1 237139683 238232613 237654362 235736427 237669544 237159595 239254189 237711906 239493084 240340691
1629.8 240340691 241086178 242153072 241785297 244118023 243637371 246633224 245680256 248156414 250242310
1638.5 250242310 251330681 254259968 254856815 257303867 257583046 259934406 261957474 261984539 264062805
1647.2B64062805j024437M563446J180287L284855K519359o11362M88949j52932M545803
1655.9B78856773J240311K748718J547222K049199K241611J876621L759861P30934
1663.6B95051250L803215K238846L343335L282527K660695M092521J536827M973412
1671.3C20982628K767296M679527L604317K555885M604568L683739M853974L053093
1679C50785027M649314L906556N008888M752998L8948O993332M022408O511078M449730
1687.7C91118279M387664M981728M718399N989876M978142N546684M812317M820823
1695.4D31353912K620697N409813O368676N022277M092102K278824P071762N785179
1703.1D70003242M844513L449822L280182L386383L618431M130745K557602K940407
$$ plain form
1647.2 264062805 263038368 267601814 268782101 272066956 274586315 273974953 274463902 274310970 278856773
1655.9 278856773 280097084 282845802 284393024 286442223 288683834 290560455 294320316 295051250
1663.6 295051250 298854465 301093311 304436646 307719173 310379868 314472389 316009216 320982628
1671.3 320982628 323749924 328429451 332033768 334589653 339194221 342877960 347731934 350785027
1679 350785027 355434341 359340897 364349785 369102783 369141731 376135063 380157471 386668549 391118279
1687.7 391118279 395505943 400487671 405206070 411195946 416174088 421720772 426533089 431353912
1695.4 431353912 433974609 439384422 445753098 450775375 454867477 457146301 464218063 470003242
1703.1 470003242 474847755 478297577 481577759 484964142 488582573 492713318 495270920 498211327
1710.8D98211327L321914L254509L392067P92122J093483M047051K399635l493157
1718.5E13018951L763886L800125K389793K381859J663170J518669J698036J481514
1726.3E31716003J322136J602059K273712N39474P78962L685989L484993j420021k205849
1734.9E41777458N043564M225731K287064K968521J315193n5161M113579L380585J718330
1743.6E66774864K537537M028320L411369K885323L424912K086219M374047K974205
1751.3E92496796K878875N332642L896828L851547L655701J318893K536278L802872
1759F19770432K799987K739487j17760J296501M367218K584916K139320K281876J804313
1767.7F39666290p65915K463684L626252m31595r01489J63269M720230K712936J46866
$$ plain form
1710.8 498211327 501533241 504787750 508179817 508971939 510065422 514112473 516512108 513018951
1718.5 513018951 516782837 520582962 522972755 525354614 527017784 528536453 530234489 531716003
1726.3 531716003 533038139 534640198 536913910 537453384 538232346 541918335 545403328 543983307 541777458
1734.9 541777458 546821022 551046753 553333817 556302338 557617531 557562370 561675949 565056534 566774864
1743.6 566774864 569312401 573340721 576752090 579637413 583062325 585148544 589522591 592496796
1751.3 592496796 595375671 600708313 604605141 608456688 612112389 613431282 615967560 619770432
1759 619770432 622570419 625309906 625192146 626488647 630855865 633440781 635580101 637861977 639666290
1767.7 639666290 638900375 641364059 644990311 644558716 643657227 643820496 648540726 651253662 651400528
1776.4F51400528K493286J069565J817627L05099n67855J662673K033768J913986O9962
1785.1F62198639Q96301J754685J443481P43485J544647P26623P6905n73578j54114
1793.8F68657074L946381J371231k08207J890793J908722l3798j057816K173691N0888
1802.4F78698959R41620J818314J135025J815567O86111P05719O38581R81674r21021
1811.1F86500549J76621J429519P27463J638108N46646J203842N50003Q02612R74121
1819.8F94549484j72348Q10700k86103J142655O81763j838685J078949K145996J675492
1828.5F99787903k30560k035523Q32367K092514k8686K90374Q31757M58526O07682
1837.2G02606354p4082J623917O48422M20914K54593Q24737N43595m726258K048722
$$ plain form
1776.4 651400528 653893814 654963379 656781006 657086105 656518250 658180923 660214691 662128677 662198639
1785.1 662198639 663094940 664849625 666293106 667036591 668581238 669307861 669384766 668811188 668657074
1793.8 668657074 672603455 673974686 673766479 675657272 677565994 677532196 676474380 678648071 678698959
1802.4 678698959 679640579 681458893 682593918 684409485 685095596 685801315 686439896 687421570 686500549
1811.1 686500549 686677170 688106689 688834152 690472260 691018906 692222748 692772751 693575363 694549484
1819.8 694549484 694377136 695187836 694901733 696044388 696726151 694887466 695966415 698112411 699787903
1828.5 699787903 699557343 697521820 698354187 700446701 700418015 700708389 701540146 701998672 702606354
1837.2 702606354 702532272 704156189 704804611 705225525 705480118 706304855 706848450 702122192 704170914
1845.8G04170914K140121Q75931P71179Q39157J259003k77405L44544k57264J21384
1854.5G09987564P0725q9188O24084J78299J097184N61294Q36792j54877k71453K3193
1864.2G12863617m26102M29688m61350J231842j72653p40738J556168J103058O66885
1872.8G16050415m40216O7368l38746K43912M11606J20163P48520N02014P94449k63977
1882.5G17895508M06341J6327n53360j20697k82898J018143j76010q00018M16030J059723
1892.1G18879089M91562M26560R8800j223144M98810j21003J68152M39911O27442R89151
1901.8G21275330l59879N41000m32052l76358J9531j46027M5929n22613L16925M10766
1911.4G20772552J138382J72272M10462K12020m35180P84378k312546n31311J246033
$$ plain form
1845.8 704170914 706311035 707186966 707958145 708797302 710056305 709778900 710123444 709866180 709987564
1854.5 709987564 710058289 709969101 710593185 710771484 711868668 712429962 713266754 713111877 712840424 712863617
1864.2 712863617 712437515 712867203 712405853 713637695 713465042 712724304 714280472 715383530 716050415
1872.8 716050415 715610199 715677567 715338821 715582733 715994339 716114502 716863022 717365036 718159485 717895508
1882.5 717895508 718301849 718318176 717764816 717644119 717361221 718379364 718203354 717403336 717819366 718879089
1892.1 718879089 719370651 719797211 719896011 718672867 719171677 719050674 719218826 719658737 720286179 721275330
1901.8 721275330 720915451 721456451 721024399 720648041 720667572 720521545 720567474 720044861 720361786 720772552
1911.4 720772552 721910934 722083206 722493668 722705688 722270508 723054886 720742340 720211029 721457062
1920.1G21457062P21740N29938p68738J99204L35998O1036l56522K98233q926j28556
1929.7G22340469L63007l16315K42615k56577M36478J95923k45590o6376n13763L67736
1939.4G22547607r7045N70831n39322r67178J245803K23847m65927l98484J78147r3765
1949G22204514N6686l1815j47400K08130k14309L71933j7319k53220n22995M2496L86505
1959.6G22083206k06528K29645k87933K75803j25199l27148j59455p05413J56707K27585
1969.3G21161270L93448j89819K85034K16598k65274j3733o72226J5641j57547J75628
1978.9G20949020m1046n21393q4533r8877N39856j22452J41830K4109m14581l57361
1988.6G20014572l57208N50766m5700n19257l11584N00869K91672j35040K17667m45481
$$ plain form
1920.1 721457062 722178802 722708740 721940002 722139206 722475204 722536240 722179718 722477951 722469025 722340469
1929.7 722340469 722703476 722387161 722629776 722373199 722809677 723005600 722760010 722693634 722179871 722547607
1939.4 722547607 722450562 723021393 722482071 721514893 722760696 722984543 722518616 722120132 722298279 722204514
1949 722204514 722261200 722229385 722081985 722290115 722075806 722447739 722430420 722177200 721654205 721696701 722083206
1959.6 722083206 721876678 722106323 721818390 722094193 721968994 721641846 721482391 720776978 720933685 721161270
1969.3 721161270 721554718 721364899 721649933 721866531 721601257 721587524 720915298 720930939 720773392 720949020
1978.9 720949020 720907974 720386581 720302048 720203171 720743027 720620575 720762405 720786514 720371933 720014572
1988.6 720014572 719657364 720208130 720162430 719643173 719331589 719832458 720124130 719989090 720206757 719761276
1998.2G19761276n85403q32291R1705J96076r5139J42289q0491K78550m94690l79563
2007.8G18002319l04947k14843k17896j32065K70005m62876K26822J4725k08664n09567
2017.5G16463013m61197Q0108n50155J12839j35499J74103N2567j60294K68173l25622
2027.1G15518036j03912q14438o12641n64346l52860O8665k03323K09503j63956L13263
2036.8G13293991j59378j28860M2724m86984l35846m44412L38287l02811Q9493Q8349
2046.4G11994553k97470K12402m27857K6093q70743n39398K19955o1569l586k40631
2056.1G10011749K77787l80402l8300O2409q7815P7820j51138J03607m73938K53220
2065.7G09654999J31454m0436p6522k31705K94418n13839k72828j51596m6539k33536
$$ plain form
1998.2 719761276 719175873 718343582 718435287 718631363 718536224 718678513 718598022 718876572 718381882 718002319
2007.8 718002319 717697372 717482529 717264633 717132568 717402573 716939697 717166519 717181244 716972580 716463013
2017.5 716463013 716001816 716081924 715531769 715644608 715509109 715683212 715735779 715575485 715843658 715518036
2027.1 715518036 715414124 714599686 713987045 713422699 713069839 713138504 712935181 713144684 712980728 713293991
2036.8 713293991 713134613 713005753 713048477 712561493 712225647 711781235 712119522 711816711 711906204 711994553
2046.4 711994553 711697083 711909485 711481628 711507721 710636978 710097580 710317535 710255966 710252380 710011749
2056.1 710011749 710289536 709909134 709870834 709933243 709845428 709923248 709772110 709875717 709401779 709654999
2065.7 709654999 709786453 709746017 709669495 709437790 709732208 709218369 708945541 708793945 708747406 708513870
2075.4G08513870k61917M0894j72806K88696l53775j16882o2103j54343j49689l49121
2085G07222824K42615m9896L36151L8070j5716n04761p99408N9815m23203N7449J7243
2095.6G06181183q8120m38842j75934J97677m59671L23944k16369j00556k21176m87900
2105.2G04514236K5177j52740J29471n36194j35193k67486l54386r7885k76566L23410
2114.9G03171844r6511o9275n41001n9967K22245k29798o2713l38898M37469j32522
2124.5G02300873l08533k77328k92969M8981N8288P53937l00140m04892m65470l14331
2134.2G00798416M78363Q6212J44577j02768L46604R1095j82419n63812l94440L71628
2143.8G01073456j70593M70352k1897j16806M9439j38245K38037k7466J30997l98636
$$ plain form
2075.4 708513870 708251953 708292847 708120041 708408737 708054962 707938080 707875977 707721634 707571945 707222824
2085 707222824 707465439 707415543 707751694 707789764 707774048 707269287 706469879 706529694 706106491 706163940 706181183
2095.6 706181183 706093063 705654221 705478287 705675964 705216293 705540237 705323868 705223312 705002136 704514236
2105.2 704514236 704539413 704386673 704516144 703979950 703844757 703577271 703222885 703125000 702848434 703171844
2114.9 703171844 703075333 703006058 702465057 702405090 702627335 702397537 702334824 701995926 702433395 702300873
2124.5 702300873 701992340 701715012 701422043 701471024 701529312 702283249 701983109 701578217 701112747 700798416
2134.2 700798416 701276779 701362991 701507568 701404800 701751404 701842499 701660080 701096268 700701828 701073456
2143.8 701073456 700902863 701373215 701351318 701234512 701283951 701145706 701383743 701356277 701487274 701088638
2153.5G01088638J79901r8495m9973M72107l04107J86996k98080O3247J53199K7923
2163.1G01421356J21918l71018L0594k05307L01819N9586L62243M91486l45840q5755
2172.8G01781082k46658J28631l46908k04544K26059M74548M25644m18472R4909o0730
2182.4G01853561L18528R7198m3716J11313l48511J75400m58756M3335M63257M99191
2192G02710800L29285l56903J93023p7362k80838l61709L87344L10440j86081J33667
2201.7G02801666j41144K45438k19803K65656L89404j92718Q8577k5711J08566l21274
2211.3G02998657j3733j4724K16293K97699j98746K18735J87073L82919k74506j76086
2221G03623581m1733k93503L7079k59094J98822K44141K62222j75934O9199L26233
$$ plain form
2153.5 701088638 701268539 701170044 701120071 701592178 701288071 701475067 701176987 701240234 701393433 701421356
2163.1 701421356 701543274 701172256 701202850 700997543 701299362 701358948 701721191 702212677 701866837 701781082
2172.8 701781082 701534424 701663055 701316147 701111603 701337662 701812210 702237854 701819382 701914291 701853561
2182.4 701853561 702172089 702269287 702225571 702336884 701988373 702163773 701705017 701748352 702211609 702710800
2192 702710800 703040085 702683182 702876205 702798843 702518005 702156296 702543640 702854080 702667999 702801666
2201.7 702801666 702660522 702905960 702686157 702951813 703341217 703148499 703237076 703211365 703319931 702998657
2211.3 702998657 702984924 702970200 703186493 703484192 703285446 703504181 703691254 704074173 703799667 703623581
2221 703623581 703581848 703288345 703325424 703066330 703265152 703509293 703771515 703595581 703664780 703991013
2230.6G03991013j16959L7231n00869k6856k86178M9514P7l00598O87561q6213J91880
2241.2G03639603j25504k68631m19311o19965K63367k3117O21643J5030J11465M28696
2250.9G03623276j85547j33515m08477J85547m49601k78625k29874j97525P19528N54810
2260.5G03199997L28979l62243J07422m01917n56259m94614m34875P03354j01929Q4457
2270.2G02072372r9029J00479L01666J0834J24359o84509N0278l45917J27487L33252
2279.8G01991272l88413K6322l09219J47094j92871K07596j43890o41327l60489o41861
2289.4F99694214K86331r4910M23890J25885m11225j18027m75692j85776q09403m8828
2299.1F98386459l61023n65643k22397j26419M34799o52542k70538p50732l53241k51770
$$ plain form
2230.6 703991013 703874054 703911285 703410416 703383560 703097382 703146896 703146973 702846375 703533936 703447723 703639603
2241.2 703639603 703514099 703245468 702826157 702206192 702469559 702446442 703068085 703083115 703194580 703623276
2250.9 703623276 703437729 703304214 702895737 703081284 702631683 702353058 702123184 701925659 702645187 703199997
2260.5 703199997 703528976 703166733 703274155 702872238 702315979 701821365 701386490 702089844 701987915 702072372
2270.2 702072372 701973343 702073822 702375488 702386322 702510681 701826172 701876450 701530533 701658020 701991272
2279.8 701991272 701602859 701629181 701319962 701467056 701274185 701481781 701337891 700696564 700336075 699694214
2289.4 699694214 699980545 699885635 700309525 700435410 700024185 699906158 699430466 699244690 698435287 698386459
2299.1 698386459 698025436 697459793 697237396 697110977 697545776 696893234 696622696 695871964 695518723 695266953
2308.7F95266953q56858j77154j038971j00403n28565o9809Q9341r72367j70593n21622
2318.4F90919952m43115j559372p84912j98440o6224L0747o44989M43191j567688k94952
2328F85834198K90222j158066p23800o30112J29471o46210R69849l0899j464386p59812
2337.7F81810455K42234L89099j751404k85492k16370l662m29840M43192K038116J362305
2347.3F83598633K325668J103897m60357k427521k450943j226959j449204o68106k476273
2356F75868835k353897l5019J776658p02973o23093J402970j97449Q35724j384964
2364.7F74586792O7749Q11157l20282N40695J047135J831436K25830J450501J022262
2373.3F81263275L70102N79453J01928M02756j71585R39484Q30841Q46328P87888J60294
$$ plain form
2308.7 695266953 694410095 694232941 693193970 693093567 692565002 692495193 692584534 691612167 691441574 690919952
2318.4 690919952 690476837 688917465 688132553 687934113 687867889 687898636 687253647 687696838 686129150 685834198
2328 685834198 686124420 684966354 684242554 683612442 683741913 683095703 684065552 684034653 682570267 681810455
2337.7 681810455 682052689 682441788 680690384 680404892 680188522 680184860 679755020 680198212 682236328 683598633
2347.3 683598633 685924301 687028198 686567841 684140320 681689377 680462418 679013214 678345108 675868835
2356 675868835 673514938 673479919 675256577 674553604 673930511 675333481 675136032 675971756 674586792
2364.7 674586792 674654541 675465698 675145416 675686111 676733246 678564682 678790512 680241013 681263275
2373.3 681263275 681633377 682212830 682314758 682717514 682545929 683485413 684316254 685162582 685950470 686110764
2383F86110764M56848j78833p3471n46723k09732M4708n07507K78320P2480l31269
2392.6F85115585l20663K79312J22070m52804p57523q24890q6060k86331J07880L9444
2402.3F82936020m27933l81622l07312j78070p50199m50668n21469m15726r2239j97449
2411.9F79213333m6539j94626j31454l23029m2648m76151p44781m07563o58340m88968
2421.6F75699234n17502J30692J79062k12937k13699k91672m52804p38144m37394n10025
2431.2F72634811j36489l89252m10614j56784n07584O9199l05405k38495m44641p13501
2440.8F69401245m28314o15540k05078k23465J9226k68249k09274m32053p82623k37885
2450.5F66017990p30896l16467l54843m07257n52750p12967N5389j43356k4948n64804
$$ plain form
2383 686110764 686567612 686388779 686315308 685768585 685558853 685603561 685096054 685374374 685446854 685115585
2392.6 685115585 684794922 685074234 685196304 684743500 683985977 683161087 683075027 682788696 682896576 682936020
2402.3 682936020 682508087 682126465 681819153 681641083 680890884 680440216 679918747 679503021 679410782 679213333
2411.9 679213333 679166794 678972168 678840714 678517685 678475037 677998886 677254105 676846542 676188202 675699234
2421.6 675699234 675181732 675312424 675491486 675278549 675064850 674773178 674320374 673582230 673144836 672634811
2431.2 672634811 672498322 672109070 671698456 671541672 671034088 671103287 670797882 670559387 670114746 669401245
2440.8 669401245 668972931 668357391 668152313 667928848 667948074 667679825 667470551 667038498 666255875 666017990
2450.5 666017990 665287094 664970627 664615784 664208527 663655777 662942810 662998199 662854843 662829895 662265091
2460.1F62265091o28891n30853l93753k2049p81098o12564l98559K8228l54004n83572
2469.8F57987976l14026o61011k07977n68924l74145m60892p51572k04620k13089n11398
2479.4F53720322o78711j87531q40072q69141j62506p8049k66876p05185o72607p91932
2489.1F48467712N6305l92761r43756n46188p75223j64414l28674k09961n07126p94601
2498.7F43861313m40903n78613k69241m10080m71268r07898m39987k06833o47507l25432
2508.3F39163551n23224k66914n36461m01878n04189o38694l23449o49681j93672n19600
2518F34605789l17421l57513n76477l54958q61473n25207m72260j34315n01137q19588
2527.6F29685440m01268k89001K5673l44811k79274p07474p27348n25131l48664J37978
$$ plain form
2460.1 662265091 661636200 661105347 660711594 660689545 659908447 659295883 658897324 658925552 658571548 657987976
2469.8 657987976 657673950 657012939 656804962 656236038 655861893 655401001 654649429 654444809 654231720 653720322
2479.4 653720322 653041611 652854080 652014008 651144867 650982361 650904312 650637436 649932251 649259644 648467712
2489.1 648467712 648524017 648131256 647187500 646641312 645866089 645701675 645373001 645163040 644655914 643861313
2498.7 643861313 643420410 642841797 642572556 642162476 641691208 640783310 640343323 640136490 639488983 639163551
2508.3 639163551 638640327 638373413 637836952 637435074 636930885 636292191 635968742 635319061 635125389 634605789
2518 634605789 634288368 633930855 633354378 632999420 632137947 631612740 631140480 631006165 630505028 629685440
2527.6 629685440 629284172 628995171 629020844 628676033 628396759 627689285 626961937 626436806 626088142 626226120
2537.3F26226120l89061k70805o56357m78630l22190o69250n99518q96759j58462k63749
2546.9F21521339l55682k03400n88379n09719j99280l51334r49211k54898n19676q10013
2556.6F16779747l69263j34887k1134o65741j16005m30717n90592o6146n03006n12238
2566.2F13370018n93681n98641r01031n38864o6834k0065k78969n83115l17688q13255
2575.9F08657875n53436k76642O5994q1596j050644n23110k64167l06321l44276k25716
2585.5F05097961l44619n22690n54123o13365j30005o85158q38318p49550k78930k7275
2595.1F00353928o61850m24385o07758k35825n46074q98780n29518l59536l5667o33583
2604.8E95420952j71471o69861j238670l97911l16963k31133n18875q32939j042786
$$ plain form
2537.3 626226120 625837059 625566254 624909897 624431267 624109077 623439827 622840309 621943550 621785088 621521339
2546.9 621521339 621165657 620962257 620373878 619864159 619664879 619313545 618364334 618109436 617589760 616779747
2556.6 616779747 616410484 616275597 616254463 615588722 615472717 615042000 614451408 614385262 613882256 613370018
2566.2 613370018 612776337 612177696 611276665 610737801 610670967 610650902 610371933 609788818 609471130 608657875
2575.9 608657875 608104439 607827797 607893791 607812195 606761551 606238441 605974274 605667953 605323677 605097961
2585.5 605097961 604753342 604230652 603676529 603063164 602933159 602248001 601409683 600660133 600381203 600353928
2595.1 600353928 599692078 599267693 598659935 598424110 597878036 596979256 596449738 596090202 596054535 595420952
2604.8 595420952 595249481 594579620 593340950 592943039 592626076 592394943 591876068 591043129 590000343
2613.5E90000343j78566n7220n93720n75790r59473j68190k77862o06041n80368p55463
2623.1E85247650o36864n35965j27525o72111o27098n81665m77028l80898q69865n98946
2632.8E79739685r06181o82678n82200m79889k00233l84903k44636l76778l35655j007653
2642.4E74538879r44938m81720l24593k48031r70993p09610l98140j12839l70674n36843
2652E69440498m11567q12378m53301n18112l77006o56624o97480j65977l92456l75290
2661.7E64580307m91524l07312m18815l63465m84276p43446m41017m62379J7204r499
2671.3E60875778k52037n10330n84221m89960m82788m46434p35779q7890k62451l59269
2681E56664619m53071o50597j4419n81475m39605k20375j60256o59447r30137k38877
$$ plain form
2613.5 590000343 589821777 589764557 589170837 588595047 587635574 587467384 587189522 586583481 586003113 585247650
2623.1 585247650 584610786 584074821 583947296 583275185 582648087 582066422 581589394 581208496 580338631 579739685
2632.8 579739685 578833504 578150826 577568626 577088737 576888504 576503601 576258965 575882187 575546532 574538879
2642.4 574538879 573593941 573112221 572787628 572539597 571568604 570858994 570460854 570348015 569977341 569440498
2652 569440498 569028931 568216553 567763252 567245140 566868134 566211510 565514030 565348053 564955597 564580307
2661.7 564580307 564088783 563781471 563362656 562999191 562514915 561771469 561330452 560868073 560885277 560875778
2671.3 560875778 560623741 560113411 559529190 559039230 558556442 558110008 557374229 557286339 557023888 556664619
2681 556664619 556211548 555560951 555546532 554965057 554525452 554305077 554144821 553485374 552555237 552316360
2690.6E52316360p85903l99819q9493m1084l82233m53224P5264o65054n37758o79474
2700.3E48357582m68140k64244m42505k40821m97704j1024j99013j15357m65660r12666
2709.9E44740448m04320m12712n6496l69377m72145m95414j64528R6931o94809n62630
2719.5E41204948k11334l0594n00259m38042l9291r2621l21274q93173l66974j57509
2729.2E38153877j01280l28026l54652J99508k24227k85225l31078l73230l86162k35939
2738.8E35733566l32489n20897k26860l41186j95885m67873O4736M85420o2485m47082
2748.5E33688965p71103j78108m97704k99301R6359n39779o36559k40402K42615m34838
2758.1E30430145k84767l10211n85556K1591l65753m96521l99132k29378l25050l61443
$$ plain form
2690.6 552316360 551530457 551130638 551041145 551000061 550617828 550164604 550239868 549574814 549037056 548357582
2700.3 548357582 547889442 547625198 547182693 546941872 546444168 546433144 546234131 546118774 545653114 544740448
2709.9 544740448 544336128 543923416 543866920 543497543 543025398 542529984 542365456 542462387 541767578 541204948
2719.5 541204948 540993614 540963020 540462761 540024719 539985428 539892807 539571533 538678360 538311386 538153877
2729.2 538153877 538052597 537724571 537369919 537569427 537345200 537059975 536728897 536355667 535969505 535733566
2738.8 535733566 535401077 534880180 534653320 534312134 534116249 533648376 533713112 534198532 534136047 533688965
2748.5 533688965 532917862 532739754 532242050 531942749 532039108 531499329 530862770 530622368 530864983 530430145
2758.1 530430145 530145378 529835167 529249611 529271202 528905449 528408928 528009796 527780418 527455368 527093925
2767.8E27093925m34455m37928j28936o12183l65486j79444k03437n27726p64541m21143
2777.4E23018646o06804l56483m00810k09275n20820p28379k80876o38694l05863j72806
2787E18797836j54724n82123p93647n79300p21360k72216q30841q36297l98483o03103
2796.7E13025742n22957l39279l39928q84247r84154r13696n83382p22236p00417n63240
2806.3E06472206r69238l23792l96423n69534j016503j204414m49524p38716o83403
2815E00120659r18808r28536o07528p66068o64406p02781q63838j010972j031379j368408
2824.7D91257935q28591o04439p24868m48075j127777r95140j019478r16595q24394
2833.3D83768578j404877j389656j437264j065674j158180j043892j216392k025528
$$ plain form
2767.8 527093925 526659470 526221542 526092606 525480423 525114937 524935493 524732056 524204330 523439789 523018646
2777.4 523018646 522411842 522055359 521654549 521445274 520924454 520196075 519915199 519276505 518970642 518797836
2787 518797836 518643112 518060989 517267342 516688042 515966682 515694466 514863625 514027328 513628845 513025742
2796.7 513025742 512502785 512163506 511823578 510939331 509955177 509041481 508458099 507735863 507035446 506472206
2806.3 506472206 505502968 505179176 504782753 504213219 503196716 501992302 501542778 500804062 500120659
2815 500120659 499201851 498273315 497665787 496899719 496235313 495532532 494668694 493657722 492626343 491257935
2824.7 491257935 490429344 489824905 489100037 488651962 487524185 486529045 485509567 484592972 483768578
2833.3 483768578 482363701 480974045 479536781 478471107 477312927 476269035 475052643 473027115
2841.1D73027115j862793j811524j998062k391090k192383k058220k138710k184067
2848.8D56390266k398834j698227j358299r84192q13599q77761n18341m28544l41720
2857.4D46970749l61137O4163N0087n4741m7112n08995o02112o32133o24313j042901
2867.1D43211555r22241o08177j178436j145745p03964o18667p69005o82831n76096
2875.8D36006393q51974j012001p56416p30668n17768l22037r89571j100197r88197
2884.4D28737564r49402q88366q55828j005897j350365q03337j001167j174088q83789
2893.1D19825325q98056p12852p14684m42429j120643j231499p70035q74595o10314
2901.8D12450218q57811p48939p80411o40984p89032j172256p50809r25941r24111
$$ plain form
2841.1 473027115 471164322 469352798 467354736 464963646 462771263 460713043 458574333 456390266
2848.8 456390266 453991432 452293205 450934906 449950714 449137115 448259354 447741013 447312469 446970749
2857.4 446970749 446609612 446673775 446723862 446669121 446622009 446113014 445510902 444878769 444254456 443211555
2867.1 443211555 442289314 441681137 440502701 439356956 438652992 438034325 437265320 436582489 436006393
2875.8 436006393 435154419 434142418 433386002 432655334 432137566 431815529 430825958 429725761 428737564
2884.4 428737564 427788162 426899796 426043968 425038071 423687706 422884369 421883202 420709114 419825325
2893.1 419825325 418927269 418214417 417499733 417057304 415936661 414705162 413935127 413060532 412450218
2901.8 412450218 411592407 410843468 410063057 409422073 408633041 407460785 406709976 405784035 404859924
2910.5D04859924j377220j403236j220055j689262j634789j721573j441497j510354
2918.2C92861938j314468j260681j483765p96013q37364p35969n36156m48418k82669
2926.9C85166435R9221Q59489M44870l01247j53885M64859N63202M03176L19900N06668
2936.5C88372688P00913N77202Q91952O66351M32816P42569R31816N75180J91689Q50219
2946.2C94933395R81293N01251L73650Q66356J084099M19578J03035J67694L23792
2954.8C99754143M09813Q01277N90744K27814O00013O24543O50863O22521Q87832P62749
2964.5D05932312O57005R73511N16167M76951P86782J008110P52029M25339O20766
2973.2D12148972Q09707Q32176N51758O33965P66067O93817K31858K40020L77083r1743
$$ plain form
2910.5 404859924 403482704 402079468 400859413 399170151 397535362 395813789 394372292 392861938
2918.2 392861938 391547470 390286789 388803024 388007011 387169647 386433678 385897522 385449104 385166435
2926.9 385166435 385265656 386125145 386570015 386268768 386114883 386579742 387142944 387546120 387866020 388372688
2936.5 388372688 389073601 389650803 390542755 391209106 391641922 392384491 393316307 393891487 394083176 394933395
2946.2 394933395 395914688 396415939 396789589 397655945 398740044 399159622 399262657 399430351 399754143
2954.8 399754143 400163956 400965233 401555977 401783791 402383804 403008347 403659210 404281731 405169563 405932312
2964.5 405932312 406589317 407562828 408078995 408555946 409342728 410350838 411102867 411528206 412148972
2973.2 412148972 412958679 413790855 414342613 414976578 415742645 416436462 416668320 416908340 417285423 417193680
2982.8D17193680L93562J26534p9575O82449L50342P5836L38707K30484J35002L36838
2992.5D19783859p2784m07105l90968l25890k5291l4218k11181o48346l41607m234
3002.1D17322235n08079r23119q20122k47268n39742q33321p34520m60128l24478o11535
3011.7D11319923m86106p13883q20122q31985n83458n65529p51610k53334q28667j224632
3021.4D04260597q22906n37033m39606n45349q30116j263848p25059m99306r59435
3030.1C97637939j009063m66919m10233q77037q49914j093331p62787p29179j020088
3038.7C90419388p71828q19702p52831p34558o12945j011048r43069p33795j026459
3047.4C83013153p17049j015319j184693j300964j003151n52864m99840j87530q62084
$$ plain form
2982.8 417193680 417587242 417713776 417634201 418316650 418666992 418742828 419081535 419312019 419447021 419783859
2992.5 419783859 419711075 419303970 418913002 418587112 418561821 418527603 418316422 417668076 417326469 417322235
3002.1 417322235 416814156 415891037 415070915 414823647 414283905 413450584 412716064 412255936 411931458 411319923
3011.7 411319923 410833817 410119934 409299812 408467827 407884369 407318840 406567230 406313896 405485229 404260597
3021.4 404260597 403437691 402900658 402461052 401915703 401085587 399821739 399096680 398597374 397637939
3030.1 397637939 396628876 396161957 395751724 394874687 394024773 392931442 392168655 391439476 390419388
3038.7 390419388 389647560 388827858 388075027 387340469 386727524 385716476 384773407 384039612 383013153
3047.4 383013153 382296104 381280785 380096092 378795128 377791977 377239113 376739273 376551743 375689659
3056.1C75689659j190033j136780p55005m41551j106643r39064n54047p34558q30307
3064.8C68001671k94724o15425j411247j030159p17735q14629j011887o31713k27356
3073.5C61246796j49041n77201p33834l08990j073952j035309o83174r91402q24432
3082.1C54869461p58018o58913p69463n47180o07986q64983o73141p46766o92825q09097
3091.8C47741089r50356o72149l27225p55081r96933m78783o07719n72624l55416q31642
3101.4C41193161j140938o52618o29082j057091m43878Q1101o71273j040573o41784
3110.1C34997025q77381p33948p96814r82208m22592r56192r75838m12635o08254q90160
3119.8C27341003r19799o58570r40056j004943m57001l36952j129723j105308k91405
$$ plain form
3056.1 375689659 374499626 373362846 372607841 372166290 371059647 370120583 369566536 368831978 368001671
3064.8 368001671 367706947 367091522 365680275 364650116 363932381 363117752 362105865 361474152 361246796
3073.5 361246796 361097755 360520554 359786720 359477730 358403778 357368469 356685295 355693893 354869461
3082.1 354869461 354111443 353452530 352683067 352135887 351527901 350662918 349989777 349243011 348550186 347741089
3091.8 347741089 346790733 346118584 345791359 345036278 344039345 343560562 342952843 342380219 342024803 341193161
3101.4 341193161 340052223 339399605 338770523 337713432 337269554 337350655 336679382 335638809 334997025
3110.1 334997025 334119644 333385696 332588882 331606674 331184082 330227890 329252052 328839417 328231163 327341003
3119.8 327341003 326421204 325762634 324822578 323817635 323360634 323023682 321893959 320788651 320497246
3128.4C20497246m16641q39081j221142p28340o11840r02481p19184q12245o46477
3137.1C13599815o20784j10608p46021j702404r21936n32303n19275q39901p57065
3145.8C06849518n74970o61660o63356o57979l21159q69446j439094j702366j102791
3154.5B98856697k16026l17269m67186q51802n68219p25879r78928o31809o85730n20935
3164.1B92892914j225167j448707o31409m03461p95746r18636n00164n60475o84070
3172.8B85725079q56457r77802o45295l57475o22654o85844q16326j300621n85423
3181.5B78877182m65679p29675p48158j069527m69513m32396o57405m95720o28033
3190.1B73181076j070290j162509p78161n68313l69377p62883q00743n49183l02219
$$ plain form
3128.4 320497246 320080605 319241524 318020382 317292042 316680202 315777721 315058537 314246292 313599815
3137.1 313599815 312979031 312868423 312122402 310419998 309498062 308965759 308446484 307606583 306849518
3145.8 306849518 306274548 305612888 304949532 304291553 303970394 303100948 301661854 299959488 298856697
3154.5 298856697 298640671 298323402 297856216 297004414 296436195 295710316 294731388 294099579 293413849 292892914
3164.1 292892914 291667747 290219040 289587631 289184170 288388424 287469788 286969624 286409149 285725079
3172.8 285725079 284868622 283890820 283245525 282888050 282265396 281579552 280763226 279462605 278877182
3181.5 278877182 278411503 277681828 276933670 275864143 275394630 274962234 274304829 273809109 273181076
3190.1 273181076 272110786 270948277 270170116 269601803 269232426 268469543 267668800 267119617 266817398
3198.8B66817398k80380q43239m51603m88701j044540q47073l84426p08046q48846
3207.5B60920544j59932o45427n46017l12843j013661p92331k62967n73177j058426
3216.2B55555763m38022k69242m04434n29060q76789n85289p91207l81775J51978n67074
3225.8B50864849j031628m91504l43571q36563o49033m79374j42669m04759j062336
3234.5B45423412p68661m18911k18048l43075j82724n99728r96570m95816o02779k42367
3244.2B40554733l5114o44588p91379n72013n09644n66425l39222j93024k34508j49861
3253.8B36518955k15740o09589o04286p03010n38006m42620r82398j65062J82228m28677
3263.4B32011795n78232m77333k59018m28009j65558j12552l86048r00325o93303O5499
$$ plain form
3198.8 266817398 266537018 265693779 265242176 264753475 263708935 262861862 262477436 261769390 260920544
3207.5 260920544 260760612 260115185 259569168 259256325 258242664 257450333 257187366 256614189 255555763
3216.2 255555763 255117741 254848499 254444065 253915005 253038216 252452927 251661720 251279945 251431923 250864849
3225.8 250864849 249833221 249341717 248998146 248161583 247512550 247033176 246890507 246485748 245423412
3234.5 245423412 244654751 244235840 244017792 243674717 243491993 242892265 241895695 241399879 240797100 240554733
3244.2 240554733 240519619 239875031 239083652 238511639 238001995 237435570 237096348 236903324 236668816 236518955
3253.8 236518955 236303215 235693626 235089340 234386330 233848324 233405704 232423306 232258244 232440472 232011795
3263.4 232011795 231433563 230956230 230697212 230269203 230103645 229991093 229605045 228704720 228011417 228076916
3273.1B28076916l76072m7608q3103o20193n72415n78594l69682n28832l02448o7902
3282.7B24530067J39771l14789r11407l89538l25298O8416J36757k34776j62277k03953
3292.4B22332973k40020m35849k63805m93221p21398l84559k89593k21634k88277m45785
3302B18548832l14980J32847o4792m24862m70734n53970m49028l39585o3305L0823
3311.7B16031246M7779m65107j047668m44927Q6040k42977p73354p45925o19984k71015
3321.3B11554108R7789N1442j32409n03845m71191q46863r02061n15385l99532J07326
3330.9B08039379j77956n77774r38491r22146r9545l10173m37813j06067m12789o25763
3340.6B03430862m74968n28373m69551l64838m49314l89481l74851Q202L70311k02865
$$ plain form
3273.1 228076916 227700844 227653236 227570133 226949940 226377525 225798931 225429249 224900417 224597969 224530067
3282.7 224530067 224669838 224355049 223443642 223054104 222728806 222797222 222933979 222699203 222536926 222332973
3292.4 222332973 222092953 221657104 221393299 220900078 220178680 219794121 219504528 219282894 218994617 218548832
3302 218548832 218233852 218366699 218301907 217877045 217406311 216852341 216403313 216063728 216000423 216031246
3311.7 216031246 216079025 215613918 214566250 214121323 214207363 213964386 213191032 212445107 211825123 211554108
3321.3 211554108 211651897 211703339 211570930 211067085 210595894 209749031 208846970 208331585 207932053 208039379
3330.9 208039379 207861423 207283649 206345158 205423012 205323467 205013294 204575481 204469414 204056625 203430862
3340.6 203430862 202955894 202427521 201957970 201593132 201143818 200754337 200379486 200387688 200757999 200555134
3350.2B00555134r91097m96254K16980p9898m00200p64676n47904k25373p0381O4373
3359.9A97260704j97678j66053p36733m08172K75745k39353P953L24250n8213p66410
3369.5A95296040o06118M6940M0322j15033k31571J65978J09539j59855o4488k73800
3379.2A94207954l38897j94626l4886J46733K84710q9703j44863K2583j61705j33266
3388.8A93564034l63446o4430L57742n6343l95050j40457J93291J09997m0875j30444
3398.4A93034019J18332K747k56920j1215k33860q4419J67427j42823R7466L91979
3408.1A93082733k1076n7430L65123K03896J2074Q7566J18866k33650m06418P6656
3417.7A93228340L00160N03044Q11748L60165k74658k2660J82591L93219O65321K2888
$$ plain form
3350.2 200555134 199564037 199067783 199284763 199204865 198804665 198039989 197492085 197266712 197196331 197260704
3359.9 197260704 197063026 196896973 196160240 195752068 196027813 195788460 195796413 196120663 196062450 195296040
3369.5 195296040 194689922 194736862 194777184 194662151 194430580 194596558 194706097 194546242 194481754 194207954
3379.2 194207954 193869057 193674431 193639545 193786278 194070988 193981285 193836422 193859005 193697300 193564034
3388.8 193564034 193200588 193136158 193493900 193437557 193042507 192902050 193095341 193205338 193164463 193034019
3398.4 193034019 193152351 193155098 192898178 192886963 192653103 192568684 192736111 192593288 192690754 193082733
3408.1 193082733 193061657 193004227 193369350 193573246 193585320 193672886 193791752 193558102 193151684 193228340
3417.7 193228340 193528500 194031544 194843292 195203457 194928799 194906139 195088730 195481949 196147270 196170158
3427.4A96170158M8218M59728N26524L12920Q6612O50311L04680k16465J53446L78494
3437A98874626K49882Q1844J28479L95661P75547N84869K09541J16005R35841J050224
3446.7B03402519l25451M02642Q38356M53930M79297L96462N82313K82326M40788N09796
3456.3B07462978M17252P84588Q08315N64232J59779M68006N48324N72968P47165L87497
3466B12921104M38710P26700P94143L41015M87289O13995M64172J066914P90863M85973
3475.6B19130878O15807N22957R03091J121331N64804M36000P01142O96640J323337
3484.3B26015987P29027k7199P49283Q40988O80657J070480J486454P67861P2441O08482
3493.9B32994461J071186J025715N98526Q75778R77421N93872P66010J012593Q58574
$$ plain form
3427.4 196170158 196218376 196678104 197204628 197517548 197604160 198254471 198559151 198342686 198496132 198874626
3437 198874626 199124508 199206352 199334831 199730492 200506039 201090908 201300449 201416454 202352295 203402519
3446.7 203402519 203077068 203479710 204318066 204771996 205251293 205647755 206230068 206512394 206953182 207462978
3456.3 207462978 207880230 208664818 209473133 210037365 210197144 210665150 211213474 211786442 212533607 212921104
3466 212921104 213359814 214086514 214880657 215221672 215708961 216322956 216787128 217854042 218644905 219130878
3475.6 219130878 219746685 220269642 221172733 222294064 222858868 223294868 223996010 224692650 226015987
3484.3 226015987 226745014 226717815 227467098 228308086 228988743 230059223 231545677 232313538 232385979 232994461
3493.9 232994461 234065647 235091362 235689888 236565666 237543087 238136959 238902969 239915562 240774136
3502.6B40774136N51700P96566J009693P72877O02684J397934J167641M08096J257992
3511.3B48739319O83384N54485J170292J286449J471463J221065J217442N84564L71361
3520B57299824J046772J592293R18026R4509J200771J311474J466427J055450M67320
3528.6B66452866Q47072R23119J523456J553631J718521J371785J083488J028194M56753
3537.3B76958885J244374J494884J351051J078511J308117J352500J043187J143245
3545B86974754J162930J831283M07677J063728J969834J488800J940040J175824K200355
3553.7C00215225J972332J341801J552296J240654J904773J416798J397648Q03146
3561.4C11844673K070923K477894Q81214K561550J412335J304359O62079R42077L499070
$$ plain form
3502.6 240774136 241325836 242122402 243132095 243904972 244507656 245905590 247073231 247481327 248739319
3511.3 248739319 249422703 249977188 251147480 252433929 253905392 255126457 256343899 256928463 257299824
3520 257299824 258346596 259938889 260856915 260951424 262152195 263463669 264930096 265985546 266452866
3528.6 266452866 267299938 268223057 269746513 271300144 273018665 274390450 275473938 276502132 276958885
3537.3 276958885 278203259 279698143 281049194 282127705 283435822 284788322 285831509 286974754
3545 286974754 288137684 289968967 290376644 291440372 293410206 294899006 296839046 298014870 300215225
3553.7 300215225 302187557 303529358 305081654 306322308 308227081 309643879 311041527 311844673
3561.4 311844673 313915596 316393490 317274704 319836254 321248589 322552948 323215027 324157104 327656174
3570.1C27656174J902237J378212J634521K350502J904030J698112K478638J279297
3577.8C42281723K192307J871528J643982K342110K061844J681709J475563L784904
3585.5C59335670K131005J10435J875725N19676L074951L404694L085709K209243J586152
3594.2C77333260K979583N94178K360382L577919J522483K819901K111549J164475
3601.9C94463730K276382K508965K882004L711662L015137O79550L710747J345672
3609.6D14593849K06413N901680K740555J21422L404083J534920M479256M333000R65652
3618.3D38280830J798630J219978J994439L450203L606109L065834L169251K997703
3626D59582977L359032N929375K100258n325051L741074N535812N657463L094406J36414
$$ plain form
3570.1 327656174 329558411 330936623 332571144 334921646 336825676 338523788 341002426 342281723
3577.8 342281723 344474030 346345558 347989540 350331650 352393494 354075203 355550766 359335670
3585.5 359335670 361466675 361577110 363452835 363972511 367047462 370452156 373537865 375747108 377333260
3594.2 377333260 380312843 380907021 383267403 386845322 388367805 391187706 393299255 394463730
3601.9 394463730 396740112 399249077 402131081 405842743 408857880 409537430 413248177 414593849
3609.6 414593849 414800262 420701942 423442497 423563919 426968002 428502922 432982178 437315178 438280830
3618.3 438280830 440079460 441299438 443293877 446744080 450350189 453416023 456585274 459582977
3626 459582977 462942009 468871384 470971642 465646591 469387665 474923477 480580940 483675346 483811760
3634.7D83811760K951927M519310L308830J959191K774200L153725L254394K561722
3642.4E08295059J813469L086968M235534O066857J622238q89664N221596L09753j124687
3651.1E28637123J936379O362457M921417L688278N202294m129563K838784N584716
3658.8E55041885K178612K503090J214714L221321K538452K316780K382927J197625
3666.5E72595406M684829J828347j72348L262748l239898K670784P458496P546730
3674.3E96635094j177063j3637085M012756Q407860M771957j395797J033134L018112
3682F01668968K164002J323852P01523J123810M593315P608299p824669m518509P905808
3690.6F14746399m264183J58424N933571J312790J160317K52571j71433J581879J169624
$$ plain form
3634.7 483811760 486763687 491282997 494591827 496551018 499325218 502478943 505733337 508295059
3642.4 508295059 510108528 513195496 517431030 523497887 525120125 524230461 529452057 529761810 528637123
3651.1 528637123 530573502 536935959 541857376 545545654 550747948 546618385 549457169 555041885
3658.8 555041885 557220497 559723587 560938301 564159622 566698074 569014854 571397781 572595406
3666.5 572595406 577280235 579108582 578936234 582198982 578959084 581629868 589088364 596635094
3674.3 596635094 595458031 581820946 585833702 594241562 599013519 597617722 598650856 601668968
3682 601668968 603832970 605156822 605858345 606982155 611575470 619183769 611359100 606840591 614746399
3690.6 614746399 610482216 610640640 616574211 617887001 619047318 619299889 619128456 620710335 621879959
3699.3F21879959K548256K730789l436012j456642M039459J759186N30777J00212J924095
3708F30620079L668900o303482L443565N265236j0837479L586617M212722R28269R02710
3716.7F35487137J588173J117553k524910J345940M902458l092765l507309N193138
3724.4F40509415J601638r21173k492599n24902L448333J026306N012055j391297p606468
3733.1F38661308O850777m26636n383301K823105J430741m4785J954498L469391k317810
3741.8F47017288K437668R853973r224472j4414825Q415451O008759O604461k484741
3749.5F54213562j0318985R366455m352951p109833O101837M797898L174286m490967
3757.2F51381302J779022M282684p929687J97601N324402J405869O5231K345428k453231
$$ plain form
3699.3 621879959 624428215 627159004 623722992 622266350 626305809 628064995 628595772 628695984 630620079
3708 630620079 634288979 627985497 631429062 636694298 625856819 629443436 633656158 634584427 635487137
3716.7 635487137 637075310 638192863 635667953 637013893 641916351 638823586 635316277 640509415
3724.4 640509415 642111053 641189880 638697281 638172379 641620712 642647018 647659073 646267776 638661308
3733.1 638661308 645512085 645085449 639702148 642525253 643955994 643911209 645865707 649335098 647017288
3741.8 647017288 649454956 659308929 650084457 635669632 644085083 650093842 656698303 654213562
3749.5 654213562 643894577 653261032 648908081 641798248 647900085 652697983 655872269 651381302
3757.2 651381302 653160324 657443008 649513321 649710922 655035324 656441193 656506424 658851852 656398621
3765.9F56398621l546143K875137M448624M9286q618164K200851L811493J65634N39322
3774.5F58324661j11999J432342P00836J741410j179199o606904K872925K338333J077500
3783.2F60589905J741638k287674n44052J151199Q46787J53656m47617P15714L26385
3791.9F62245941L83377R3308N24597J873627l155594k840348K510987L420868M674301
3800.6F69731064o279602r796372M840317L262253M173660M284210j0451278k510529
3808.3F57253723N629349J667709n07431Q2016P81403J450043M201507k604065j2240753
3817F55713501N004654N421142M020691N25818j6609802K801743O325302K295532K214508
3825.7F67713089l25241l822556Q4916J571502L302460K462692p690048J751862O714477
$$ plain form
3765.9 656398621 652852478 655727615 660176239 660225525 651607361 653808212 657619705 657785339 658324661
3774.5 658324661 658212662 659645004 660345840 662087250 660908051 654301147 657174072 659512405 660589905
3783.2 660589905 662331543 660043869 659499817 660651016 661497803 661651459 661203842 661919556 662245941
3791.9 662245941 662629318 662722626 663247223 665120850 661965256 659124908 661635895 665056763 669731064
3800.6 669731064 663451462 653655090 658495407 661757660 665931320 670215530 659764252 657253723
3808.3 657253723 662883072 664550781 664043350 664125366 664906769 666356812 670558319 667954254 655713501
3817 655713501 660718155 666139297 670159988 670685806 654076004 656877747 663203049 665498581 667713089
3825.7 667713089 667387848 663565292 663650208 665221710 668524170 670986862 663296814 665048676 671763153
3834.3F71763153n295486j425705O227035p170028l753129O529923l749619J33820
3842.1F63259964N823593k705231k360229K936935O90155m44564J087799l37448K542343
3850.7F70493317M773483n621643J074066j2921677n71365Q922348r7046q27408J657868
3859.4F66881943J214828J890106m063949N45273O026611m693222m880600L454742
3867.1F66375732M228592N124359o663742r104004L212128N217056K425080p949143
3874.8F62866058J309662L850632K5940K221374L815537n757980p097092N563583J104584
3883.5F67902298J633301N251846j1296158J209259L342514L50571L960266j442108
3891.2F70911789p383347P18613L325806r22547Q58078J036454J471557K018051q161468
$$ plain form
3834.3 671763153 666467667 665041962 671268997 664098969 660345840 666875763 663126144 663259964
3842.1 663259964 669083557 666378326 664018097 666955032 667645187 667200623 668288422 667950974 670493317
3850.7 670493317 675266800 669645157 670719223 657797546 657226181 666148529 666051483 665224075 666881943
3859.4 666881943 668096771 669986877 665922928 666468201 672494812 667801590 662920990 666375732
3867.1 666375732 670604324 675728683 669064941 659960937 663173065 668390121 670815201 662866058
3874.8 662866058 664175720 668026352 668052292 670273666 674089203 668331223 661234131 666797714 667902298
3883.5 667902298 669535599 674787445 663491287 664700546 668043060 668393631 672353897 670911789
3891.2 670911789 663528442 664247055 667572861 666650314 667508392 668544846 670016403 672034454 663872986
3899.9F63872986L712158J559296m665451M656219l208847k141647O68792J341324
3907.6F65794830K251435p7362L92990m79584K39868J071472j79214q1253J212082
3916.3F70145264k047959l243942L706131R0027l824158K051773J869660N20858j746902
3925F67520752k345963Q13065J218338R85107p23877q4686J556931k074967j458816
3933.7F65405884Q80050j4953M20990L13263l30506k57339J46561J936721L52936l867264
3943.3F64986343R5978J458893O21567J077194k007904M89426Q61053j737823J287536
3952F67132263L7613j27716K25678o25611K17591j98441M31213o50711j2588P63016
3961.6F67192307p26243J58310k54058n6763J19705j56937O23398k51312p35779L67890
$$ plain form
3899.9 663872986 667585144 669144440 664478989 669135208 665926361 663784714 664453506 665794830
3907.6 665794830 668046265 667968903 668361893 667882309 668122177 669193649 669014435 668933182 670145264
3916.3 670145264 668097305 664853363 668559494 668649521 664825363 666877136 668746796 669267654 667520752
3925 667520752 665174789 665987854 667206192 668191299 667467422 667382736 668939667 666864700 665405884
3933.7 665405884 666285934 666270981 666691971 667005234 666674728 666417389 666563950 668500671 668853607 664986343
3943.3 664986343 665082321 666541214 667162781 668239975 666232071 666721497 667582550 665844727 667132263
3952 667132263 667169876 667042160 667267838 666642227 666859818 666661377 667092590 666441879 666429291 667192307
3961.6 667192307 666466064 666624374 666370316 666313553 666433258 666276321 666899719 666648407 665912628 666280518
3971.3F66280518M82406m88281k87247K64359P4310m82559m2191P63398N85021j65328
3980.9F66984406q36945N9586J66168K7542M83398r8419q57696o54450J135025K46353
3990.6F66654968j183319j68381Q13065J099854n73197p02743M22973O20651j15432
3999.2F66868439n26657
4000.2F66341782
$$ plain form
3971.3 666280518 666762924 666274643 665987396 666251755 666326065 665843506 665801315 666564713 667149734 666984406
3980.9 666984406 666147461 666207047 666373215 666400757 666884155 666785736 665928040 665273590 666408615 666654968
3990.6 666654968 665471649 665303268 666116333 667216187 666642990 665940247 666363220 666983871 666868439
3999.2 666868439 666341782
4000.2 666341782
##END=$$ End of the data block
