##TITLE=$$ Begin of the data block
##JCAMP-DX=5.00 $$ ACD/SpecManager v 10.08
##SPECTROMETER/DATA SYSTEM=Varian
##DATE=14 Jan 2013 10:21:38
##DATA TYPE=INFRARED SPECTRUM
##DATA CLASS=XYDATA
##ORIGIN=
##OWNER=
##NPOINTS=3735
##FIRSTX=399.26403809
##LASTX=4000.35498047
##MAXX=4000.35498047
##MINX=399.26403809
##MAXY=72.46571350
##MINY=19.31693459
##XFACTOR=1.0000000000
##YFACTOR=0.000000100000000
##FIRSTY=40.00160599
##DELTAX=0.96440572
##XUNITS=1/CM
##YUNITS=TRANSMITTANCE
##XYDATA=(X++(Y..Y))
399.3D00016060p583771k343063M547424J447182j679116J813164M265404k902603
407C97580681m434166K108345k155380k723236N357704L599891m486999K24037M982834
415.7D00053711j269722m489212o970177p993507J679802M558525K587280O203461
423.4C94360161N168876k677650n799141k741547O26488R52912K340240K018395J711196
432.1C95959930L080979l670082n151406n54657j034660k622414k605896K8344L85894
440.7C83816032N81894O827698P559776l044891n154152j339302j154289L434524R61380
449.4C92488670m393463L06359K150993k25678l41148q53996J317711L175468l675346
458.1C89949570l339196M90838J322822N70145k414780l778534k968902J573295L227577
$$ y = [400016060, 392432289, 390089226, 394636650, 396083832, 394404716, 396217880, 400483284, 397580681, 393146515, 395254860, 393099480, 390376244, 395733948, 399333839, 394846840, 395070877, 400053711, 398783989, 394294777, 387324600, 379331093, 381010895, 385569420, 388156700, 394360161, 399529037, 396851387, 391052246, 388310699, 388937187, 389890099, 392230339, 394248734, 395959930, 399040909, 395370827, 390219421, 389664764, 388630104, 386007690, 383401794, 383430138, 383816032, 384397926, 391225624, 398785400, 395740509, 390586357, 389247055, 388092766, 391527290, 392488670, 388095207, 388401566, 390552559, 390326881, 389985733, 389131737, 390449448, 393624916, 389949570, 386610374, 387101212, 388424034, 388994179, 386579399, 382800865, 379831963, 381405258, 384632835]
466.8C84632835J270256j993904k310447M21905l459396k096520M929505j050721j385688
475.5C78957825P39898p50732M05617j722679j684838J679039o40373j51062O3324
484.1C76896019p43027j759071l320389j70326j92909O39305n23339j329193K443505
492.8C71940575J413459M9019j88408J561966k09350k807884k496987k716179J984406
501.5C68530617J755867k697335o637K769661J277733l079911k929573p72171o8550
510.2C64779701k68059J747399J905174j561623j435203q06961k332878j103707q39080
518.9C60084763k826500J267242J867676j274605N53627J188889M49943k196274j721115
527.5C57393646j3542l27072R77554n85899q43849o51360j590652J387634K479477
$$ y = [384632835, 385903091, 383909187, 381598740, 382020645, 378561249, 376464729, 381394234, 380343513, 378957825, 379697723, 378946991, 379352608, 377629929, 375945091, 377624130, 376983757, 376832695, 376896019, 376152992, 374393921, 371073532, 370903206, 370710297, 371349602, 370826263, 369497070, 371940575, 373354034, 373403053, 373214645, 374776611, 374567261, 371759377, 369262390, 366546211, 368530617, 370286484, 367589149, 367582512, 370352173, 371629906, 368549995, 365620422, 364848251, 364779701, 364511642, 366259041, 368164215, 366602592, 365167389, 364360428, 362027550, 360923843, 360084763, 357258263, 358525505, 360393181, 359118576, 359672203, 360861092, 361311035, 359114761, 357393646, 357380104, 357053032, 358030586, 357444687, 356600838, 355949478, 354358826, 355746460, 358225937]
536.2C58225937q37326k267227p04460k13051Q9950k46124J77917O943j942177r47647
545.9C51342735q05397Q56705J374168k187156k584343j210518J08223K16446k47498
554.5C46863365K63062N47065j073455j901741j136704q42743N35050O39648J809273
563.2C45702820M98504k076721k96325R39216K035065m90685j448173J86424j317711
571.9C43732414M95758Q90389L9673K81829n20820q5106q66165r84993j36376n50880
581.5C42295723q79097M75845J828270R76715J7014l87344j20430M32510K66418M50097
591.2C45355721J97792J47972N88836o86531j044464L92800J343650J406670L63579
599.9C48066025q12531j215744l40080q2359k12555M21600m02603l76434l18032j201477
$$ y = [358225937, 357388611, 355121384, 354416924, 354203873, 354293823, 354047699, 354225616, 354232559, 352290382, 351342735, 350537338, 351394043, 352768211, 350581055, 347996712, 346786194, 346894417, 347110863, 346863365, 347126427, 347673492, 346600037, 344698296, 343561592, 342718849, 343253899, 343893547, 345702820, 346201324, 344124603, 343828278, 344767494, 346802559, 346311874, 344863701, 345050125, 343732414, 344228172, 345118561, 345158234, 345440063, 344919243, 344834137, 343967972, 342982979, 342846603, 342295723, 341416626, 341892471, 343720741, 344697456, 344714470, 344327126, 344206696, 344639206, 344905624, 345355721, 345553513, 345701485, 346290321, 345603790, 344559326, 344952126, 346295776, 347702446, 348066025, 347253494, 346037750, 345697670, 345615311, 345402756, 345824356, 345421753, 345045319, 344727287, 343525810]
609.5C43525810r55238l88641l04299j302490l78876N30205q93326p34901N71136L09677
619.2C39979057o33011o49986m44794J112099J755867N08385L47214R97543K128181
627.8C45100555R19075l85437J747055L550263J465073o44913J365852J982346J077041
636.5C56176910J619683J190452N77431J023865J752357J576615J133957J493644K99263
645.2C66844177l06396K152748J661644n79376N54771J377831O62803J34392K35291
653.9C72737885J244354P95059r04350K0981R26628q2398m88815p44248o80389k9678
663.5C72795029M44336J27487j55525k333146p627716N602646L772431J406402J114273
672.2C75146217k92091L26195J901893J372452R52606J306382J465950Q55674J665802
$$ y = [343525810, 342570572, 342181931, 341877632, 340575142, 340196266, 340726471, 339833145, 339098244, 339669380, 339979057, 339346046, 338696060, 338251266, 339363365, 341119232, 341627617, 341974831, 342972374, 345100555, 346019630, 345634193, 347381248, 350931511, 352396584, 351751671, 353117523, 355099869, 356176910, 357796593, 358987045, 359564476, 360588341, 362340698, 363917313, 365051270, 366544914, 366844177, 366537781, 368690529, 370352173, 369772797, 370327568, 371705399, 372368202, 372502594, 372737885, 373982239, 374777298, 373872948, 373893929, 374820557, 374738159, 374249344, 373505096, 372824707, 372795029, 373239365, 373366852, 373211327, 370878181, 363250465, 368853111, 372625542, 374031944, 375146217, 374854126, 375180321, 377082214, 378454666, 379407272, 380713654, 382179604, 383035278, 384701080]
680.9C84701080J982956J094208R41620N33447J147385J077995L59039N53971M10690
689.6C92802391J758995K084770L15323L81966J317673J314582R52530O94275O1417
698.2D01683922M19349J589814J014175Q1673J39122O54449O64673N51911N33676N68504
707.9D07901268J191826J093635J431046R48524N7106J230774J267395N20745K87742
716.6D15930061P01676L38173l43819J171188J565132J131936P33070k71034M87671
725.2D21444054J406364Q17986J012420J220894P27730J358337R24225M46282N12313
733.9D29870605j08833L02887O62308O32553j04599j9760P56721P55692R75990K79541
743.6D34003105J20545J351280J619491L26500J96610N60608N73654R83810K58599
$$ y = [384701080, 386684036, 387778244, 388719864, 389253311, 390400696, 391478691, 391837730, 392391701, 392802391, 394561386, 396646156, 396961479, 397343445, 398661118, 399975700, 400928230, 401622505, 401683922, 402103271, 403693085, 404707260, 404788933, 404928055, 405582504, 406247177, 406799088, 407332764, 407901268, 409093094, 410186729, 411617775, 412566299, 412623405, 413854179, 415121574, 415642319, 415930061, 416631737, 416969910, 416626091, 417797279, 419362411, 420494347, 421227417, 420956383, 421444054, 422850418, 423668404, 424680824, 425901718, 426629448, 427987785, 428912010, 429358292, 429870605, 429761772, 430064659, 430726967, 431359520, 431254921, 431235161, 431991882, 432747574, 433723564, 434003105, 434123650, 435474930, 437094421, 437420921, 437617531, 438178139, 438751793, 439735603, 439994202]
752.2D39994202J025085J154442N21393J263046J103134J036682L67852M50973J434517
760.9D48351326J902809J320992P02514J160965J169281J465340N61523J21003l92418
769.6D56363335m23432Q41255k5177M93584M28734m06799o51780m55398N48172R0980
779.2D56803474N71900J73416K89612J315346N87883L47213M30451Q65097N68580J71585
788.9D62124557J78795O31333M70085q1368M21982L02277l14369j076851N80978%k220421
799.5D61016998r34334p18536r71069j071053o53419j432839j772957o70242j787948
808.2D51004601j867371j809502j714515j409951j646690j707459j244392m67834j140480
816.9D37996407l21236j43585p27272J88903M27857J219597J293716J472359K579040
$$ y = [439994202, 441019287, 442173729, 442695122, 443958168, 445061302, 446097984, 446465836, 446916809, 448351326, 450254135, 451575127, 452277641, 453438606, 454607887, 456073227, 456634750, 456755753, 456363335, 455939903, 456781158, 456755981, 457249565, 457678299, 457271500, 456619720, 456164322, 456712494, 456803474, 457375374, 457548790, 457838402, 459153748, 459741631, 460088844, 460519295, 461384392, 461952972, 462124557, 462303352, 462934685, 463404770, 463323402, 463745384, 464047661, 463733292, 462656441, 463237419, 463237419, 461016998, 460082664, 459364128, 458393059, 457322006, 456668587, 455235748, 453462791, 452792549, 451004601, 449137230, 447327728, 445613213, 444203262, 442556572, 440849113, 439604721, 439136887, 437996407, 437675171, 437531586, 436804314, 436993217, 437421074, 438640671, 439934387, 441406746, 443985786]
825.5D43985786K954407K506828K497864K888909K438240K939415K458686K073517
833.3D64743652K541619L052215L801918L148461K523422J831779K236100J599426
841D85478592L43437O16226J345940K485809K486000K317047J220208J397018J703339
849.6D99393616O67190O32973Q27789J558075J429329K251702J918983J446342J907082
858.3E12033081J274452J582604R68857R28039K0866L07656P20978o8131J48239l38096
868E17578545R51080r32846j445046n82161k028503j364136j773185j250649j229668
876.7E07923431r31282m05922o17218m81071j233521q93135j203727o52237j127205
885.3E00378113p84683O23703n56603p83386m30412P04536k75040m98390N38368l2119
$$ y = [443985786, 446940193, 449447021, 451944885, 454833794, 457272034, 460211449, 462670135, 464743652, 467285271, 470337486, 474139404, 477287865, 479811287, 481643066, 483879166, 485478592, 485822029, 486438255, 487784195, 490270004, 492756004, 495073051, 496293259, 497690277, 499393616, 500060806, 500693779, 501521568, 503079643, 504508972, 506760674, 508679657, 510125999, 512033081, 513307533, 514890137, 515858994, 516787033, 516807899, 517115555, 517836533, 517768402, 517916641, 517578545, 518529625, 517596779, 516151733, 515569572, 513541069, 512176933, 510403748, 509153099, 507923431, 506992149, 506586227, 505969009, 505487938, 504254417, 503361282, 502157555, 501505318, 500378113, 499593430, 500217133, 499660530, 498877144, 498446732, 499151268, 498876228, 498377838, 498916206, 498884087]
895D98884087O8054l58238Q51516J106186M05579m18968q30994n08461r11865O18591
904.6D98905487J132965J984139K824173L101387K721023J297836J009255o96144J20468
913.3E12400589N7526j291657j413612j953430j861878k804375j569633j481934k956161
922D97125435l850212l503533k733841l959808l330727l297996k821884k310448k575951
930.7D68741035k077217k496986j861305j772232j959229j945572q89129o98052k025719
939.3D53015594j078147p99714q78143j203117j025887r59358j944008j279144k86102
948D43561974K97889n72891l17497J50223j57662l4141j376152j438294j735382k201576
957.7D36176491k368164k350006j792908k298317k415772k657508k000046j621208
$$ y = [498884087, 498952141, 498593903, 499445419, 500551605, 500957184, 500538216, 499707222, 499198761, 498286896, 498905487, 500038452, 502022591, 504846764, 507948151, 510669174, 511967010, 512976265, 512280121, 512400589, 512458115, 511166458, 509752846, 507799416, 505937538, 503133163, 501563530, 500081596, 497125435, 493275223, 489771690, 487037849, 483078041, 479747314, 476449318, 473627434, 471316986, 468741035, 466663818, 464166832, 462305527, 460533295, 458574066, 456628494, 455739365, 455041313, 453015594, 451937447, 451137733, 450259590, 449056473, 448030586, 447071228, 445127220, 443848076, 443561974, 443859863, 443286972, 442969475, 443119698, 442962036, 442927895, 441551743, 440113449, 438378067, 436176491, 433808327, 431458321, 429665413, 427367096, 424951324, 422293816, 420293770, 418672562]
965.4D18672562j588707j412049k257728k454567k718773k185669k415123k818527
973.1D00821419k313347l086662l553467m107323m096374m081307m957580m839592
980.8C69785767m671860m710083n014000n577927m926338m786835n286369m613800
988.5C30198555l455391l363151m350625m053363l381215l446636l574543l147907
996.2C01425724k630444k658309l030682l642902k863694j944523j667099k767429
1004B80220642k668228j288700k365208j894340j749516k156486j876736j623707r63859
1012.6B63633862j834546j748733j985893k019310k076817k259083j749687k797661
1020.3B47162132k580127j620369q92754j640358k039623k481709k256450j40725j476669
$$ y = [418672562, 417083855, 415671806, 413414078, 410959511, 408240738, 406055069, 403639946, 400821419, 398508072, 395421410, 391867943, 387760620, 383664246, 379582939, 374625359, 369785767, 365113907, 360403824, 355389824, 349811897, 344885559, 340098724, 334812355, 330198555, 326743164, 323380013, 319029388, 314976025, 311594810, 308148174, 304573631, 301425724, 298795280, 296136971, 293106289, 289463387, 286599693, 284655170, 282988071, 280220642, 277552414, 276263714, 273898506, 272004166, 270254650, 268098164, 266221428, 264597721, 263633862, 261799316, 260050583, 258064690, 256045380, 253968563, 251709480, 249959793, 247162132, 244582005, 242961636, 242068882, 240428524, 238388901, 235907192, 233650742, 233510017, 232033348]
1029B32033348j689415j326160n02739j19496r25007j7204m51851J044102J114864
1037.7B29160442R28898J489277J479092J903572O56090J467990O66371l76358K7790
1046.4B37403164N5923m84485j462403p77645j113682p36637j337947r22451l25222
1055.1B30298615j225682n31482n30472R95712L83472R92222K013378J263771J464081
1063.7B35123615J169606K923889J536216Q17719J214180J503544J345272L2215J713467
1072.4B47379723L12728L59116N06706K94361J574650P0172N42850R11293R64680Q3561
1082.1B52999840N05256J387425J120129J715927R40609J658916J320267J748390J443691
1090.7B64840450O99005J891900J525821K063790J411171J628437J160793R95674K028732
$$ y = [232033348, 230343933, 229017773, 228515034, 228395538, 227470531, 227453327, 227001476, 228045578, 229160442, 230089340, 231578617, 233057709, 234961281, 235617371, 237085361, 237751732, 237375374, 237403164, 237459087, 236974602, 235512199, 234734554, 233620872, 232884235, 231546288, 230623837, 230298615, 229072933, 228541451, 228010979, 229006691, 229390163, 230382385, 232395763, 233659534, 235123615, 236293221, 239217110, 240753326, 241571045, 242785225, 244288769, 245634041, 245666256, 247379723, 247692451, 248051567, 248558273, 248852634, 250427284, 250497456, 251040306, 251951599, 252916279, 252999840, 253505096, 254892521, 256012650, 257728577, 258669186, 260328102, 261648369, 263396759, 264840450, 265539455, 267431355, 268957176, 271020966, 272432137, 274060574, 275221367, 276217041, 278245773]
1099.4B78245773Q72517R74083R56211K050266J882496J281567J239185R31606J956597
1108.1B90390301M12025M0779O79341R91115J013069J60160N11475P12128R05418N28412
1117.7B96344223R48601J78585q33264n38177q23479M01993R21154J495380J515942
1126.4B99610958J212902J687699J790065J690140J165905J935062J576710J946945
1134.1C12616386K829991K393398K295532J806221K229576J987992J395683O86188
1141.9C28240967O57005J576767Q30193O37054P74536O27899O09665M84009N66597
1150.5C35004692M24004j29776r15680n89333R461j04981n80902m38805k70004p01446
1160.2C31707230j8425r7771l40881O13746J104164J036377J694603K690392K838707
$$ y = [278245773, 279118290, 280092373, 281048584, 283098850, 284981346, 286262913, 287502098, 288433704, 290390301, 290802326, 290843105, 291522446, 292513561, 293526630, 293686790, 294198265, 294910393, 295815811, 296344223, 297292824, 297471409, 296638145, 296099968, 295276489, 295678482, 296599636, 298095016, 299610958, 300823860, 302511559, 304301624, 305991764, 307157669, 309092731, 310669441, 312616386, 315446377, 317839775, 320135307, 321941528, 324171104, 326159096, 327554779, 328240967, 328897972, 330474739, 331304932, 331941986, 332716522, 333344421, 333954086, 334438095, 335004692, 335428696, 335298920, 334383240, 333793907, 333803368, 333698387, 333117485, 332678680, 332408676, 331707230, 331688805, 331591034, 331250153, 331863899, 332968063, 334004440, 335699043, 338389435, 341228142]
1168.9C41228142L031273K826538L161583L131981K978592K986259K453918K927514
1176.6C64725800L231887L307534K848701K534943K836265K446671J555252J639671
1184.3C85126724J650772P44896R31435O18706O39610J128693N71861N26314J07421
1193C92046432j100578j532135j069145j097832j128540j235275j890450j229400k13356
1201.6C81549721r69010j563797j059951j381760k030602j529502p30019n58090m14276
1210.3C71312714n3254j2245k93274l10402j70326k81143o63795p16591o53267n44930
1220C67613487J06659J73950n43060q45451m33159m50478r99603o86226n76363j181068
1229.6C62178688j211662p56150o07070q05092m54865k50435m99649n93872o31561
$$ y = [341228142, 344259415, 347085953, 350247536, 353379517, 356358109, 359344368, 361798286, 364725800, 367957687, 371265221, 374113922, 376648865, 379485130, 381931801, 383487053, 385126724, 386777496, 387522392, 388453827, 389072533, 389712143, 390840836, 391412697, 391939011, 392046432, 390945854, 389413719, 388344574, 387246742, 386118202, 384882927, 382992477, 381763077, 381549721, 380580711, 379016914, 377956963, 376575203, 374544601, 373015099, 372285080, 371726990, 371312714, 371259460, 371247215, 370953941, 370643539, 370473213, 370192070, 369528275, 368811684, 368158417, 367613487, 367720146, 367894096, 367351036, 366505585, 366072426, 365621948, 364622345, 363936119, 363359756, 362178688, 360967026, 360210876, 359603806, 358798714, 358343849, 358093414, 357593765, 356999893, 356368332]
1238.3C56368332o97823o76078j02158J78871j21994m14467m37698k85187k88315p05490
1247.9C52817993j009598m64706k28233N1269M5700p13882n18379K2659J31302p439
1257.6C50126686Q4572l19290m24042K15111j8044J88294O26602O91986M36249N99060
1267.2C52207184Q92677N86434N86051K74468N86891J186218J259041J208878J293258
1275.9C60081100J551667J162643P73430O09589J148948J586151J582871J762237J545258
1284.6C71803894J439896J664924J851158J526032J185112J089249J385765J250114
1292.3C83196144Q25997Q78715P97462R23234R28306R33037P19604K28081J08147M63447
1301.9C90002174K57607N0621N74417K59819L62625N5390m53453n25437j009979n89943
$$ y = [356368332, 355670509, 354994431, 354892273, 355071144, 354949150, 354534683, 354096985, 353811798, 353523483, 352817993, 351808395, 351343689, 351115456, 351166725, 351212425, 350498543, 349980164, 350002823, 350134125, 350126686, 350211258, 349891968, 349467926, 349683037, 349664993, 349853287, 350479889, 351171875, 351608124, 352207184, 353099861, 353686295, 354272346, 354546814, 355133705, 356319923, 357578964, 358787842, 360081100, 361632767, 362795410, 363568840, 364178429, 365327377, 366913528, 368496399, 370258636, 371803894, 373243790, 374908714, 376759872, 378285904, 379471016, 380560265, 381946030, 383196144, 384022141, 384900856, 385698318, 386621552, 387549858, 388482895, 389202499, 389430580, 389538727, 390002174, 390259781, 390310402, 390884819, 391144638, 391507263, 391562653, 391109200, 390583763, 389573784, 388983841]
1311.6C88983841n04112k88582k55051m25415j51214R4566N31769K92167R36089J305046
1321.2C90519104Q44727P87353P72781O57044M42352P75414J0071l46718q0796k51731
1330.9C94129601m39148q16269m63333n19333k19803j9341Q2169L79333m22134j28708
1340.5C91563034P61032J176224M26674N40428J131935M20151P54776L59497K44560
1349.2C97378311K99835k5215l58391m50973k56920p46689L3531k82402o33888m79736
1358.8C94477463m02489k95639j161690n90172n00106L4446k37846m20074J34887r25865
1368.5C90112915o60973o54029n93529k94342m39911k31438k45094L33939k51236j59073
1378.1C86917229k29531m49218o15387j259995j201935j552505j373329j442070j223755
$$ y = [388983841, 388479729, 388191147, 387936096, 387510681, 387359467, 387454033, 387985802, 388277969, 389214058, 390519104, 391363831, 392151184, 392923965, 393581009, 394023361, 394798775, 394808846, 394462128, 394381332, 394129601, 393690453, 392874184, 392410851, 391891518, 391671715, 391652374, 391734543, 392113876, 391691742, 391563034, 392324066, 393500290, 393926964, 394467392, 395599327, 396019478, 396774254, 397133751, 397378311, 397678146, 397652931, 397294540, 396843567, 396586647, 395839958, 395873489, 395591087, 394957199, 394477463, 394074974, 393779335, 392617645, 392027473, 391527367, 391561813, 391323967, 390903893, 391038780, 390112915, 389451942, 388797913, 388204384, 387910042, 387470131, 387238693, 386993599, 387327538, 387076302, 386917229, 386687698, 386238480, 385623093, 384363098, 383161163, 381608658, 380235329, 378793259, 377569504]
1386.8C77569504j818772j368522l53546j491967j905593k024804j727256k805481
1394.5C64073563l448334j455345j764946j603012k731247k112732j066628j758308
1402.2C48133011j797028k364006l205490k194443j238098j397590j316338j147690
1409.9C33472328j614227j282425j573410j207848j032142j731568j195526j029205
1417.7C22805977l31192r85909M82178J418190J96877R1400m18625P26204P93533N32532
1427.3C25311165J190948P16591J584740J012993J575584J451988J342469K149696
1435C36336174J130676Q56209J552887L173103K444535J738739J915626J663399K436523
1443.7C53247871J429825J463356R93996J191101J539726J667938K237092J149215
$$ y = [377569504, 375750732, 374382210, 374028664, 372536697, 370631104, 368606300, 366879044, 364073563, 360625229, 359169884, 357404938, 355801926, 353070679, 350957947, 349891319, 348133011, 346335983, 343971977, 340766487, 338572044, 337333946, 335936356, 334620018, 333472328, 331858101, 330575676, 329002266, 327794418, 326762276, 325030708, 323835182, 322805977, 322474785, 321488876, 321971054, 323389244, 323586121, 323677521, 323258896, 323985100, 324778633, 325311165, 326502113, 327218704, 328803444, 329816437, 331392021, 332844009, 334186478, 336336174, 337466850, 338323059, 339875946, 343049049, 345493584, 347232323, 349147949, 350811348, 353247871, 354677696, 356141052, 357135048, 358326149, 359865875, 361533813, 363770905, 364920120]
1451.4C64920120J795082J287918K029152J473999o22635M62838Q61740L835220J982231
1460.1C78025665K586479J861649J825676K626381L96080K585144K507095L018685
1467.8C95432854K408142K390594K999535J845016L376923L128242M624100L309288
1475.5D19514694K614975K931748K407493K534447J814575J843605J761780J917152
1483.2D37340469J901970J333237J394386O47354R76181J455651q62503n33295M90799
1491.9D44144249R9373m86908q91190j179619l979759k18277j487274k588501n89714
1500.6D32822380j610374j480332j360512k57110j195793m714890l505287J613808
1508.3D20311890K084503p33223Q17909q02345j783829j73721n98335k61689k822418
$$ y = [364920120, 366715202, 368003120, 370032272, 371506271, 370883636, 371346474, 372208214, 376043434, 378025665, 380612144, 382473793, 384299469, 386925850, 387321930, 389907074, 392414169, 395432854, 397840996, 400231590, 403231125, 405076141, 408453064, 411581306, 416205406, 419514694, 422129669, 425061417, 427468910, 430003357, 431817932, 433661537, 435423317, 437340469, 439242439, 440575676, 441970062, 442617416, 443593597, 445049248, 444186745, 443653450, 444144249, 444243622, 443756714, 442865524, 441685905, 437706146, 437487869, 436000595, 433412094, 432822380, 431212006, 429731674, 428371162, 428114052, 426918259, 422203369, 418698082, 420311890, 422396393, 421663170, 422481079, 421678734, 419894905, 419721184, 419122849, 418861160, 416038742]
1517D16038742j129723J490899P13577k523804j795044J652642J150093J596107j067810
1525.7D16125679L12386R42878J94054J062889N80483L81050M58984L73993j777191
1534.3D18655205J282348J168747K80724J011848k214698q21381J284332L98941K47078
1543D21293144K106285M87252j925087J845321Q53882M69322j212806j140938J288185
1551.7D24064560M35066M68712l295555M82368J212578k41966l585777q457680L620605
1560.4D14702911O68793J208725j107941j224098k734184l111115j279411k215652
1568.1D04908028j028023q741989j836930j862983l982659k909355l453598j464577
1575.8C79627914j1257324j399307k739296m521790l938980n338630l591309n547371
$$ y = [416038742, 414909019, 416399918, 417113495, 414589691, 412794647, 414447289, 415597382, 417193489, 416125679, 416438065, 417380943, 417574997, 418637886, 419218369, 419599419, 420058403, 420432396, 418655205, 419937553, 421106300, 421387024, 422398872, 420184174, 419362793, 420647125, 421046066, 421293144, 423399429, 423886681, 421961594, 423806915, 424660797, 425130119, 423917313, 422776375, 424064560, 424499626, 424968338, 421672783, 422155151, 423367729, 423125763, 419539986, 411082306, 414702911, 415371704, 416580429, 415472488, 414248390, 411514206, 408403091, 407123680, 404908028, 403880005, 395138016, 393301086, 391438103, 387455444, 384546089, 381092491, 379627914, 368370590, 366971283, 364231987, 359710197, 355771217, 350432587, 346841278, 341293907]
1583.5C41293907l397598n057182m529496m415970m873218k844963n652943l111210
1591.2C07411327n213031l377991m043732m577007k342053n081081k424927m466057
1599B75885448k228145l555412l363724k264652l963223p85847l640098j214295k990074
1607.6B51879978j247940r53083k997894j32160k844601Q717k183705K5501k41642
1616.3B41313171m540023K277813j127930J013965j485309R68666n88112j818733J786003
1625B37799511k53925K040729j505031K030220L13453M68865J349563Q3218K524185
1633.7B44850788o17390K273674r58690K907200K065487J024169K661801P37820L162307
1642.4B58107166L45021K217903J454735o09360L987694m48800L931103P50199L073005
$$ y = [341293907, 337896309, 332839127, 328309631, 323893661, 319020443, 316175480, 310522537, 307411327, 302198296, 298820305, 294776573, 290199566, 287857513, 282776432, 280351505, 275885448, 273657303, 270101891, 266738167, 264473515, 260510292, 259724445, 256084347, 254870052, 251879978, 250632038, 249678955, 246681061, 246548901, 243704300, 243713017, 241529312, 241554813, 241313171, 236773148, 239050961, 237923031, 238936996, 237451687, 238420353, 237832241, 236013508, 237799511, 237545586, 239586315, 238081284, 240111504, 240424957, 240893822, 242243385, 242326603, 244850788, 244233398, 246507072, 245548382, 248455582, 250521069, 251545238, 254207039, 254944859, 258107166, 258452187, 260670090, 262124825, 261515465, 265503159, 265054359, 268985462, 269735661, 272808666]
1651B72808666K529450j885815R58920N86948M555092J052494K549095J326275J816273
1659.7B86297398K431411K092419M027672J014957L530579K285995L536950K996387
1667.4C08213768K305107M266319J824055N115109K894363M686699L843651K901611
1675.1C36050682L757973L577194N274315L160095M436150M081421N472297N721627
1682.9C71531754Q44764M251366M609375O697922M274292M063949M790917M817886
1690.6D05882225O002083N078087N593071M969444N036278K589721N588494N776062
1698.3D46515465M995537O073303J270599O769829N555077M542121L650017L601876
1706D82973824L305358L455124M324799K837944K738571K963791L140755L201370J040306
$$ y = [272808666, 275338116, 273452301, 274411221, 274998169, 279553261, 280605755, 283154850, 284481125, 286297398, 288728809, 290821228, 294848900, 295863857, 299394436, 301680431, 305217381, 308213768, 310518875, 314785194, 316609249, 321724358, 324618721, 329305420, 333149071, 336050682, 339808655, 343385849, 348660164, 351820259, 356256409, 360337830, 365810127, 371531754, 372376518, 376627884, 381237259, 387935181, 392209473, 396273422, 401064339, 405882225, 411884308, 416962395, 422555466, 427524910, 432561188, 435150909, 440739403, 446515465, 451511002, 457584305, 458854904, 465624733, 471179810, 475721931, 479371948, 482973824, 486279182, 489734306, 494059105, 496897049, 499635620, 502599411, 505740166, 508941536, 509981842]
1714.7E09981842J385727L602028L376732k443581K550430L403016K305908K212257
1722.4E26374359J404495J442566J982575J869583J507568J693344K026863P2480O87484
1731.1E39061317L420563L387337k55661k001953M546165M294586K235642K423973
1738.8E57111969M56085R9793M576187L308868J999779L154831M160690L504067K552337
1747.5E80924606L435631K609062M486122K615242K110558N275345M247322M187241
1755.2F09891129L528862J366958K539978L234329K708893L051644L58467J177063
1762.9F27857323L937874K447853K217331K576599K153511o82907K277526L562546
1770.6F46347656l15246j304322l17382N031738L183670J37100K770538J366044J268234
$$ y = [509981842, 511367569, 514969597, 518346329, 515902748, 518453178, 521856194, 524162102, 526374359, 527778854, 529221420, 531203995, 533073578, 534581146, 536274490, 538301353, 538373833, 539061317, 542481880, 545869217, 545613556, 543611603, 548157768, 552452354, 554687996, 557111969, 557568054, 557667847, 562244034, 565552902, 567552681, 570707512, 574868202, 578372269, 580924606, 584360237, 586969299, 591455421, 594070663, 596181221, 601456566, 605703888, 609891129, 613419991, 614786949, 617326927, 620561256, 623270149, 626321793, 626680260, 627857323, 631795197, 634243050, 636460381, 639036980, 641190491, 640507584, 642785110, 646347656, 646032410, 644728088, 644410706, 649442444, 652626114, 652763214, 655533752, 656899796, 658168030]
1779.3F58168030j86768m77600J711426J990890J914826J15967J437454K169800J249771
1788F68093796M65622J253891O43692K45743o13099k68554L647079J340714K96478
1796.7F75105362K139893K024154M55780j137008J531448m20456J047058K395401J055527
1805.3F84197159J392288O99921Q89358Q56095Q26721r88541L21121J481247O73676
1814F90349045J383133N79757J387482O79779Q42362R98840j49002O02341o39573R65577
1823.7F96999741R98306j549759J051254K385483J928558k44598k416916O21567K112121
1832.3G01885757K33231J21689M55627O31867P50885r7580J566009Q38776O08826L6850
1842G07031937P96737L52707n029831K269974K447128J085282M60663N71365J121216
$$ y = [658168030, 657981262, 657503662, 659215088, 661205978, 663120804, 663236771, 664674225, 666844025, 668093796, 668559418, 669813309, 670457001, 670702744, 670089645, 669821091, 673468170, 674808884, 675105362, 677245255, 679269409, 679725189, 678588181, 680119629, 679699173, 680746231, 683141632, 684197159, 685589447, 686289368, 687178726, 688034821, 688861542, 687873001, 688194122, 689675369, 690349045, 691732178, 692311935, 693699417, 694379196, 695221558, 696220398, 696071396, 696673737, 696034164, 696999741, 697998047, 696448288, 697499542, 699885025, 701813583, 701568985, 699152069, 699773636, 701885757, 702118988, 702240677, 702696304, 703328171, 704079056, 703981476, 705547485, 706386261, 706995087, 707031937, 707828674, 708181381, 703151550, 705421524, 707868652, 708953934, 709414597, 709985962, 711107178]
1850.7G11107178k41928M55551j46637M42276n8289j64490J108399L28827O64139O0196
1860.3G13555222R10263l8681m02604L25165k40021L60184m26178R08814p00074n45501
1869.9G13706589K022934J196975M43726n90820M33349L2578j9379J09482J39465Q37021
1879.6G18311920K75040O73904K7542K89078j12610k51007p2098k24227J128540p21436
1889.2G19324646q94623J309967J370774K21176m0360k37503j027832N22766q9493
1897.9G20459518M41208N51834L69950N52597m62723Q21228O4621m5090P4768k32849
1907.6G22595062p9422k96554L22036j36337Q03070o5994K83661N47714k83585O62079
1917.2G24351730k020416l39203J188050O45523K07214j042633L74222M84085M60815
$$ y = [711107178, 710865250, 711320801, 711174164, 711616440, 711558151, 711393661, 712502060, 712830887, 713495026, 713555222, 714465485, 714426804, 714024200, 714349365, 714109344, 714469528, 714043350, 714952164, 714252090, 713706589, 715729523, 716926498, 717370224, 716779404, 717212753, 717245331, 717225952, 717335434, 717474899, 718311920, 718586960, 719260864, 719288406, 719577484, 719464874, 719213867, 719141769, 718917542, 720046082, 719324646, 718430023, 719739990, 721110764, 721331940, 721291580, 721054077, 720026245, 720549011, 720459518, 720900726, 721452560, 721822510, 722375107, 721912384, 722733612, 722798233, 722753143, 722827911, 722595062, 722515640, 722219086, 722541122, 722404785, 723207855, 723141861, 723425522, 723973236, 723689651, 724351730, 722331314, 721992111, 723180161, 723825684, 724032898, 722990265, 723364487, 723848572, 724309387]
1925.9G24309387R2468o866k39258L510M08249j35117K24762n33752K20565R5673l38211
1936.5G24101410J38855o4621J40533l89557O93894o91834j158828J071090O8512l11279
1946.1G23598175o2180P38831K1210k88697K6093j39694R5901m7607L72162l23487
1955.8G23990707l48816j42135P2784M502l00675K62985j8005L42789m33121k49786
1965.4G23181229J5564q55256r7274K62375P49054J08413K42157r9335l28140J91040
1975.1G23369827n69992j08261m56772L5477J01929n4932L20587j78757L74756k89535
1984.7G22544327k43912j43204j12457l80554n44052Q12835j45340o99310n3635N24750
1994.3G21559448J48163m23584k27890p41730l44772m37698K72674N89676J01929n2490
$$ y = [724309387, 724401855, 724394989, 724155731, 724159241, 724567490, 724432373, 724657135, 724123383, 724343948, 724439621, 724101410, 724240265, 724175644, 724316177, 723926620, 724620514, 723928680, 722769852, 723840942, 723909454, 723598175, 723535995, 724274826, 724296036, 724007339, 724033432, 723893738, 723989639, 723942032, 724314194, 723990707, 723641891, 723499756, 723572540, 723577042, 723276367, 723539352, 723521347, 723864136, 723431015, 723181229, 723196793, 722341537, 722244263, 722506638, 723255692, 723364105, 723606262, 723506927, 723178787, 723369827, 722799835, 722691574, 722234802, 722270279, 722372208, 722317276, 722637863, 722459106, 722833862, 722544327, 722300415, 722157211, 722044754, 721664200, 721120148, 721932983, 721787643, 721088333, 721034698, 721559448, 721707611, 721284027, 721056137, 720314407, 719969635, 719531937, 719804611, 720394287, 720496216, 720443726]
2004G20443726k38419J67694m28696j36718m62036m16413l2425l76968K29797j20849
2013.6G18628693J40380L03345J48010p71102q07038j9760k29645L16086m13513k14615
2023.3G17080841j86386o1417N37949m84695k93885l92227j74255n61982m80957J14594
2032.9G15097580j45111K34375j43738J90659k95868k65961j8768m00849k57415o60935
2042.6G13333969J08643j17035K80151J84708l58582j5640m67148K59171n30854n91049
2052.2G12086334k212P8354L40805j26419O3552n51071j06048j12686j75629J43356
2061.9G11638336l17001J90735k69928k63367j89362L12806M86755l6545j9226o32400
2071.5G10900803o791l6697l76434l72696j04599J62659R918M07257l16086k49405
$$ y = [720443726, 720205307, 720373001, 719944305, 719807587, 719345551, 718929138, 718896713, 718519745, 718749542, 718628693, 718769073, 719072418, 719220428, 718449326, 717642288, 717622528, 717392883, 717708969, 717295456, 717080841, 716894455, 716833038, 717370987, 716886292, 716592407, 716200180, 716025925, 715463943, 714982986, 715097580, 714952469, 715186844, 715043106, 715233765, 714937897, 714671936, 714653168, 714252319, 713994904, 713333969, 713442612, 713325577, 713605728, 713790436, 713431854, 713416214, 712949066, 713208237, 712677383, 712086334, 712084122, 712162476, 712503281, 712376862, 712440414, 711889343, 711783295, 711670609, 711494980, 711638336, 711321335, 711512070, 711242142, 710978775, 710789413, 711102219, 711588974, 711552429, 711533203, 710900803, 710894012, 710857315, 710480881, 710108185, 710003586, 710166245, 710176163, 710583420, 710267334, 710017929]
2081.1G10017929k81601j50223J11084l95431l02429m28772K87017J84021m9591m98962
2090.8G08493042k48489M42657n60608j26724j75934j79748j68686j75324r92o01883
2100.4G06697311O9199P3395J66855m13361m83475J01548l31040J5030r8190J63727
2110.1G05960999m81949n60074m0054n0736K90985k76413j39389m74930J58692L77731
2119.7G04764862l05176j29165m54712O9809l49884l50724q1787J55869L42026j04828
2129.4G03556290L05786k75955j73340l87345k23999L48511j24359J57394j11847J21766
2139G03192902J76239J30691l63464l78266K84119j35651J39618j95007J26877N8212
2148.6G03036270J5793M08554j65024L3112l84369L2425k41699o5232N03006j65481
$$ y = [710017929, 709736328, 709586105, 709697189, 709301758, 708999329, 708570557, 708857574, 709041595, 708992004, 708493042, 708244553, 708687210, 708126602, 707999878, 707823944, 707644196, 707475510, 707300186, 707299194, 706697311, 706766510, 706839905, 707006760, 706593399, 706109924, 706211472, 705880432, 705895462, 705797272, 705960999, 705479050, 704918976, 704878922, 704828186, 705119171, 704842758, 704703369, 704228439, 704387131, 704764862, 704459686, 704330521, 703875809, 703945618, 703595734, 703245010, 703163223, 703319092, 703661118, 703556290, 703862076, 703586121, 703412781, 703025436, 702801437, 703149948, 703025589, 703182983, 703071136, 703192902, 703369141, 703499832, 703136368, 702758102, 703042221, 702906570, 703046188, 702851181, 702978058, 703036270, 703052063, 703460617, 703295593, 703328705, 702944336, 702976761, 702735062, 702669830, 703172836, 703007355]
2158.3G03007355L09753k0218J64795k8457n875J00326m52423j60675l37829J18942
2167.9G02695694o5994P64465P92007m63943j7700o8665l128l66211J4878K18963J79215
2178.5G03679581J88903m11453R3460R3613N24445L9215q3313K80456k62375Q8654
2188.2G04231186k69852M502O3400J93863J47323n5465K69012k07596J45035j37024
2197.8G04384384J56098O8893l21350K56500J07880K16446j92185K50397J07498k13470
2207.5G04821091n0431o2027L10898l07464J63726p6904K8687L51867j1673N32303
2217.1G05700073J00022J05438l65830j00402J06430k78016L8910j45111L39203k6245
2226.8G05474472J87378r384m29383j9226q1024L98407q4076k19497k25907K15607
$$ y = [703007355, 703317108, 703296890, 703461685, 703433228, 703427353, 703527679, 703075256, 702914581, 702576752, 702695694, 702629700, 703394165, 704186172, 703722229, 703704529, 703635864, 703632736, 703266525, 703281403, 703500366, 703679581, 703868484, 703457031, 703550491, 703644104, 704168549, 704207764, 704124451, 704404907, 704142532, 704231186, 703961334, 703965836, 704029236, 704223099, 704370422, 704314957, 704583969, 704376373, 704521408, 704384384, 704540482, 704609375, 704288025, 704544525, 704652405, 704868851, 704676666, 704927063, 705034561, 704821091, 704770660, 704708633, 705019531, 704712067, 704875793, 704798889, 704827576, 705179443, 705167770, 705700073, 705800095, 705905533, 705539703, 705439301, 705545731, 705267715, 705306625, 705161514, 705500717, 705474472, 705661850, 705652466, 705223083, 705203857, 705122833, 705521240, 705437164, 705217667, 704991760, 705207367]
2236.4G05207367p7667l46680O01120j04675K23770k7161k45590m9057l21808r2239
2246G04767380l83072M73480L22037k29q4000p2784o9580l82385K22702l28827M9820
2256.7G04514542j35575j47705M08478P5378J57700m44565L91998j75781m74472n1040
2266.3G04118958m78287K58102k33764K02178K17743J84555J71357l12958j7929m89502
2275.9G03620453j02921l80783L6164K17514j5107L25470P935N18188k08129k91291
2285.6G03727493l78799m59366l13721q10852k31170m34876M11606L87497J43433J1367
2295.2G02052612p93380k12326m90113k24533n87692o25076l68653j5335M25415o60782
2304.9F98500137m01916o84509j14136m15192q05740k11106r96017o8359n23987K53525
$$ y = [705207367, 705129700, 704783020, 705384140, 705279465, 705503235, 705476074, 705230484, 705181427, 704859619, 704767380, 704384308, 704857788, 705179825, 705179596, 705095596, 705022812, 704953232, 704570847, 704793549, 704464722, 704514542, 704378967, 704231262, 704639740, 704715118, 704872818, 704428253, 704820251, 704644470, 704169998, 704118958, 703640671, 703898773, 703665009, 703867187, 704084930, 704269485, 704440842, 704127884, 704109955, 703620453, 703517532, 703136749, 703172913, 703390427, 703375320, 703700790, 703708725, 704226913, 704018784, 703727493, 703348694, 702889328, 702575607, 701764755, 701533585, 701098709, 701510315, 701897812, 702041245, 702052612, 701259232, 701046906, 700556793, 700332260, 699744568, 699119492, 698750839, 698735504, 699160919, 698500137, 698098221, 697413712, 697299576, 696884384, 696078644, 695867538, 694871521, 694803162, 694279175, 694532700]
2314.5F94532700L68805o49415r21630j484833k58179j310272q14133l65371J36032
2323.2F89233704O00280o34002k30179j031799M55703o50253j368637n77545o19660
2331.9F85177612J68686j440429N12466k46201o56356N68084L63694l5248j783219
2340.6F82629089K70234o99387j155777m27322J050949J754074O42929K604904J289978
2349.2F87959671o47430j960144j825867j004257j895142j559982j847077l82614m30374
2357.9F76406784j012726j700744J46560K131577l35846J255646J19705j65177O2943
2366.6F76908722L40271J315308O98013J237030j81122L60031N44892R99832J359710
2375.3F83582687M73557N11703o8664Q82492R48334M58679K87628M00620O71920J83945
$$ y = [694532700, 694901505, 694252090, 693330460, 691845627, 691587448, 690277176, 689463043, 689097672, 689233704, 689833984, 689199982, 688969803, 687938004, 688393707, 687743454, 686374817, 685797272, 685177612, 685346298, 683905869, 684418335, 684172134, 683515778, 684083862, 684447556, 684412308, 682629089, 682899323, 682199936, 681044159, 680616837, 681667786, 683421860, 684064789, 686669693, 687959671, 687312241, 685352097, 683526230, 682521973, 680626831, 679066849, 677219772, 676837158, 676406784, 675394058, 673693314, 673839874, 675971451, 675635605, 676891251, 677010956, 676845779, 676908722, 677248993, 678564301, 679262314, 680499344, 680318222, 680678253, 681223145, 682222977, 683582687, 684056244, 684567947, 684499283, 685381775, 686330109, 686788788, 687076416, 687477036, 688148956, 688332901]
2384.9F88332901J44424p65609l90320j11847m45175K84271j9760k79999l92914J24054
2394.6F86480026J26496m48685p45239o06614m7988m35105j01166o8206j65329r1172
2404.2F83897018p8659l7384o99157n65720o52771l24020l78647n12009J25122j85394
2413.8F80588379j57776J5945j8386p60041n38864J7090o49185p80563m94614m0817
2423.5F77181168l62549j4954J28708l09448n22309p46002j17111n62592m65774m29001
2433.1F73780136l53088O7825l77274k33917o66046j52130l39737o49567k69928q25119
2442.8F69981155j79824j81427l31650l01819j00098l08075p36160m4861m23813n19409
2452.4F66854019l69034k08206o07452q47321j10016k44980k59628m75158p6294l49579
$$ y = [688332901, 688477325, 687711716, 687321396, 687209549, 686764374, 687048645, 687028885, 686748886, 686355972, 686480026, 686606522, 686157837, 685412598, 684805984, 684757996, 684322891, 684221725, 684153519, 683988190, 683897018, 683818359, 683780975, 683081818, 682516098, 681863327, 681539307, 681160660, 680648651, 680773773, 680588379, 680430603, 680446548, 680428162, 679668121, 679129257, 679146347, 678497162, 677716599, 677221985, 677181168, 676818619, 676803665, 676932373, 676622925, 676100616, 675354614, 675237503, 674674911, 674209137, 673780136, 673427048, 673494873, 673117599, 672883682, 672217636, 672065506, 671725769, 671076202, 670806274, 669981155, 669801331, 669619904, 669288254, 668986435, 668886337, 668578262, 667842102, 667797241, 667373428, 666854019, 666484985, 666276779, 665669327, 664822006, 664711990, 664467010, 664207382, 663732224, 663655930, 663306351]
2462.1F63306351q11463m60434n21087r995l22189m29764n86243m65393j96228n90439
2471.7F58913116k62069o12564r25446r82666k01950J61591m33274n38254o21414j33743
2481.3F54363327l14789n83725r77859m41590q5754p97424k72904m49066j12762n35965
2491F49791489j004868n01861n97077o9580m69437n37948o42624m43115m99344p63169
2500.6F44262466K94342k86331q74710j134491n28259k24762p84225l05176m28391
2509.3F39990463j26304n26314n58701k54516n34325l53165o61773m35028o51589m94919
2519F35393829k38189j18943l2196p74307o58531o52237n87387n48782j77880j91726
2528.6F31413651n75829j11008k34642k10380o33469p32765p33185o03409j88141n59806
$$ y = [663306351, 662494888, 662034454, 661513367, 661503372, 661181183, 660751419, 660165176, 659699783, 659503555, 658913116, 658651047, 658038483, 657113037, 656130371, 655928421, 656090012, 655656738, 655118484, 654497070, 654363327, 654048538, 653464813, 652486954, 652045364, 651959610, 651162186, 650889282, 650440216, 650327454, 649791489, 648786621, 648284760, 647687683, 647618103, 647148666, 646610718, 645968094, 645524979, 645025635, 644262466, 644556808, 644270477, 643395767, 642261276, 641733017, 641508255, 640724030, 640418854, 639990463, 639864159, 639337845, 638779144, 638524628, 637990303, 637637138, 636975365, 636540337, 635888748, 635393829, 635155640, 635036697, 635004501, 634230194, 633571663, 632919426, 632332039, 631783257, 631605377, 631413651, 630837822, 630726814, 630492172, 630281792, 629648323, 628915558, 628182373, 627578964, 627390823, 626831017]
2538.2F26831017k84920o76270m56810j4267k28042m87137j004677m94728l57628k22397
2547.9F22604141k69584j57471k20833o15005l40081o43539m61311q00896p02591j78070
2557.5F18214760k16789k11640o27594k16827l98445l42942m64286o93779l23067p33986
2567.2F13985405l84254n26124n05485k37503j05133n6839o55518o45904n59159n5465
2576.8F10254021l31078n16701m75082o47316m05922p73621k24037j85852k27203k25296
2586.5F06241913n31426m97627p02820j33552p20177q27904l15056j02996L814p35778
2596.1F01678391n44739q58193o96640m15458o10276k61039k81678l52096r11637o95266
2605.7E96051369m17862k93961m42009p68165m76265o45714l86696p82509o15463l05100
$$ y = [626831017, 626546097, 625869827, 625413017, 625398750, 625170708, 624683571, 623678894, 623184166, 622826538, 622604141, 622334557, 622177086, 621956253, 621341248, 621001167, 620357628, 619896317, 619095421, 618392830, 618214760, 617997971, 617786331, 617158737, 616941910, 616543465, 616200523, 615736237, 615042458, 614719391, 613985405, 613601151, 613075027, 612569542, 612332039, 612226906, 612170067, 611514549, 610868645, 610309486, 610254021, 609922943, 609406242, 608931160, 608283844, 607877922, 607104301, 606880264, 606694412, 606467209, 606241913, 605710487, 605212860, 604510040, 604376488, 603656311, 602828407, 602513351, 602410355, 602414169, 601678391, 601133652, 600275459, 599578819, 599163361, 598553085, 598292046, 598010368, 597658272, 596746635, 596051369, 595633507, 595339546, 594897537, 594129372, 593653107, 593007393, 592620697, 591838188, 591222725, 590917625]
2615.4E90917625m19883L3493q26912j064682o91071j95884l12882r01413o43310p15485
2625E85179596m16641k51160l10821n24292p65496q88672o40335l15590r11636o03600
2634.7E79551353k95715l60107l64151k89421m89731r85298k69432m04740p57675p88918
2644.3E74546165n22079j32713p95937q00590o16188j63880k42729m87175k14996n21889
2654E70047989n98679o35223l90663p54624q54263m00047l38478n7183j39236k06070
2663.6E65673523m41856m90113p89032p16362k59170m26293k75573m27590k68745l82233
2673.3E61196556k04010j71852o36978k25640o75430n07164l19938n04189k41051l97224
2682.9E57313080n58548l92227K31704n29518r16748o53572m07448m8561o58302m03290
$$ y = [590917625, 590497742, 590531235, 589704323, 588639641, 587948570, 587752686, 587439804, 586538391, 585895081, 585179596, 584762955, 584511795, 584200974, 583676682, 582911186, 582022514, 581382179, 581066589, 580154953, 579551353, 579255638, 578895531, 578531380, 578241959, 577752228, 576766930, 576497498, 576092758, 575335083, 574546165, 574024086, 573891373, 573095436, 572294846, 571678658, 571514778, 571272049, 570784874, 570569878, 570047989, 569449310, 568814087, 568423424, 567668800, 566814537, 566414490, 566076012, 566018829, 565879593, 565673523, 565231667, 564741554, 563952522, 563236160, 562976990, 562550697, 562275124, 561847534, 561578789, 561196556, 560992546, 560820694, 560183716, 559958076, 559282646, 558775482, 558455544, 557951355, 557710304, 557313080, 556754532, 556362305, 556594009, 556064491, 555147743, 554494171, 554086723, 554038162, 553379860, 552976570]
2692.5E52976570m03786k77710m8027k42004m72908q84171k85453m12522n90286p21626
2702.2E48638077l83339J68762l41377j90506m74281l68996m01611n62745L8185k43148
2711.8E45879021n79529o87904m37241l96004k24266j92718l99857n0735j67771m50554
2721.5E42292442p26013l22456J15013j869n07889n93796j44043l93219j63956n00030
2731.1E39054184l32489l0747p73735l25889J7700m9057j72272k3498n68314p09801
2740.8E36086082J28632m35066l66631n6724L2997k7275j92566m3030m10271m26406
2750.4E34289742m80004j96686k71759n34324n31617k29797K11678n30243j84937k06604
2760E31335449o37512j17149k75269m33960m48150k52266l05520j24740m05388n40924
$$ y = [552976570, 552572784, 552295074, 552247047, 552005043, 551532135, 550647964, 550362511, 549949989, 549359703, 548638077, 548254738, 548423500, 548082123, 547891617, 547417336, 547048340, 546646729, 546083984, 546122169, 545879021, 545299492, 544611588, 544174347, 543778343, 543554077, 543361359, 542961502, 542910767, 542742996, 542292442, 541566429, 541243973, 541358986, 541357117, 540849228, 540255432, 540111389, 539718170, 539554214, 539054184, 538721695, 538690948, 537917213, 537591324, 537609024, 537559967, 537387695, 537364197, 536795883, 536086082, 536214714, 535779648, 535413017, 535356293, 535389290, 535362015, 535169449, 535126419, 534716148, 534289742, 533809738, 533613052, 533341293, 532806969, 532275352, 532045555, 532257233, 531726990, 531542053, 531335449, 530697937, 530580788, 530305519, 529871559, 529423409, 529171143, 528865623, 528740883, 528335495, 527794571]
2769.7E27794571l7422l71323k62375l39165k46353l71551o61926n12162o27060n14259
2779.3E23850975p37953l89176m72869n89257m24652o68526l39622k29530L6506n19218
2789E19516678o91261n81818p73163l16925p31697o92101o97670n16052m27322r74274
2798.6E13114395r24148p60918l43437n75257l70864o49720j169014n48935l64837
2807.3E07407265j09101n56068r79424j062126r83848r93882j126899m35334m86717
2816E00673866p06291q00438o60782q33931j106071p53517r89037q48465j006584j081390
2825.6D91887360p66182n41764o55059j191254j013222j041527r03549j275024j309395
2834.3D83190384r16329j111717o77871j108857j417122j698646k030449j710815j534119
$$ y = [527794571, 527757149, 527385826, 527123451, 526784286, 526537933, 526166382, 525504456, 524992294, 524365234, 523850975, 523113022, 522723846, 522250977, 521661720, 521237068, 520568542, 520228920, 519999390, 520035896, 519516678, 518825417, 518243599, 517470436, 517153511, 516421814, 515729713, 515032043, 514515991, 514088669, 513114395, 512190247, 511429329, 511085892, 510510635, 510139771, 509490051, 508321037, 507772102, 507407265, 507298164, 506742096, 505762672, 504700546, 503716698, 502722816, 501595917, 501160583, 500673866, 499967575, 499167137, 498506355, 497672424, 496566353, 495812836, 494823799, 493975334, 492968750, 491887360, 491121178, 490579414, 489924355, 488733101, 487719879, 486678352, 485774803, 484499779, 483190384, 482274055, 481162338, 480484467, 479375610, 477958488, 476259842, 474229393, 472518578, 470984459]
2843D70984459j824303k706756k170716j844635k184944k415657k350273j542244j501236
2851.7D52443695j349449j248322q29734o01159l89289L86619J48049j57433k57111
2860.3D48145866K69738p744p04384q67577j178016n16205n56641j278076j600838
2869D41706123q27980k80952o53114n40238j023788j045685p44095n69038p21741q69713
2878.7D34429779n39360p21626o35796r48257o81115l72734p63435r34257j499825
2887.3D27333374j138420o95076q96301j425934j276283p31316j007233p67326p72438
2896D18623047r83353j001053q00857p42150j031341q74062p71446o21681o47507p10754
2905.7D10438843j027870q90313o09474q62312j103897j781807j230164j156158j524925
$$ y = [470984459, 469160156, 466453400, 464282684, 462438049, 460253105, 457837448, 455487175, 453944931, 452443695, 451094246, 449845924, 449016190, 448415031, 448025742, 448412361, 448560410, 448402977, 448145866, 448415604, 448407860, 447703476, 446835899, 445657883, 445141678, 444585037, 443306961, 441706123, 440878143, 440597191, 439944077, 439403839, 438380051, 437334366, 436590271, 436021233, 435299492, 434429779, 433890419, 433168793, 432532997, 431584740, 430903625, 430530891, 429767456, 428833199, 427333374, 426194954, 425499878, 424603577, 423177643, 421901360, 421170044, 420162811, 419395485, 418623047, 417639694, 416638641, 415837784, 415095634, 414064293, 413190231, 412418785, 411797104, 411149597, 410438843, 409410973, 408520660, 407911186, 407048874, 405944977, 404163170, 402933006, 401776848, 400251923]
2914.3D00251923j323738j665879j756668j922798q67920q91876j719589j176987p55844
2923C88170624m56314n81665m998k13775q3504N17311j09176M1122M4136J08223Q9836
2933.6C87521820P49168Q11425O8893Q35266R26819Q17833L02811L90815J160126Q72727
2943.3C94457703P69844O21147R56840P73545M20684O76690N45539M59214M84695L06664
2952.9D00472565j95999K17208O33316R04618P43866J18866N79490M32511O84089R36432
2962.6D05526962N13382Q07038P01141Q08563J098824P70721N57060O10581P74765
2971.2D12169037J132545M75579J47018R69505Q07724Q01430N88074K67067M53796
2979.9D17811775L73917M09546N1002J53389K91634K66037N72128N71098K25487n5961
$$ y = [400251923, 398928185, 397262306, 395505638, 393582840, 392714920, 391823044, 390103455, 388926468, 388170624, 387714310, 387132645, 387127647, 386913872, 386830368, 387347679, 387238503, 387279625, 387323761, 387431984, 387521820, 388270988, 389082413, 389151306, 389986572, 390913391, 391731224, 392034035, 392424850, 393584976, 394457703, 395227547, 395848694, 396805534, 397579079, 397999763, 398676453, 399221992, 399681206, 400165901, 400472565, 400276566, 400493774, 401127090, 402031708, 402775574, 402894440, 403473930, 403906441, 404590530, 405526962, 406040344, 406847382, 407548523, 408357086, 409455910, 410226631, 410783691, 411394272, 412169037, 413301582, 413777161, 413924179, 414893684, 415701408, 416502838, 417090912, 417357979, 417811775, 418185692, 418595238, 418646240, 418799629, 419091263, 419357300, 419929428, 420500526, 420726013, 420670052]
2989.6D20670052M01725K14501j18981q0070l91503q5372N8364m09278l65639n9128
2999.2D19834671n25742q81767p09114l05366n1079n27764p33337n05676m75426q10280
3008.8D14309120o39953l62702l39432m40292j081619q64525p32765o76384n58739
3017.5D08612709o30493j45416l99819p57713j033020p71904m21028p60193j070290
3026.2D02622833j339035l82004k79769j055909q95919o63605n88532r33799j088829
3034.9C95395432j014138m43687n64995j348877j017075o21833o79970j068306j070633
3043.6C87565918r40552p06138o40564j202622j106262p44476n08576r12895j097145
3052.2C79706688n07813l13263q41369j517906r96743p06291p55882q41141j099510
$$ y = [420670052, 421071777, 421286278, 421167297, 421087227, 420695724, 420610352, 420668716, 420259438, 419893799, 419834671, 419308929, 418427162, 417718048, 417412682, 417361603, 416833839, 416100502, 415594826, 415119400, 414309120, 413669167, 413306465, 412967033, 412526741, 411445122, 410580597, 409847832, 409171448, 408612709, 407982216, 407836800, 407436981, 406679268, 405646248, 404874344, 404453316, 403693123, 402622833, 401283798, 400901794, 400622025, 399566116, 398670197, 398006592, 397418060, 396484261, 395395432, 394381294, 393937607, 393372612, 392023735, 391006660, 390384827, 389704857, 388636551, 387565918, 386625366, 385919228, 385278664, 384076042, 382969780, 382225304, 381716728, 380803833, 379706688, 379198875, 378885612, 378044243, 376526337, 375529594, 374823303, 374067421, 373226280, 372126770]
3060.9C72126770n01060l05062o99119j062355p36542m12560q78982r82781p34901
3069.6C65813408q53157r05838o23360j046142p85218j75285m56123n04113p29866
3078.3C59734306r14840r35517m85534n98030r30596l95965q38242j039467o60591
3087C52935524l81241n35011j045952r10072r61075p93343q40530r49936k25945j64794
3096.6C46127625p36962o68106n35164r18808r78584q13675p03125o99730n02701j67618
3106.2C39403152m78134j125030j024704n17121j171150j074981m88625o47812m61960
3114.9C32413635p51381m64515n52826j286125j006279m83780o07872j090165p60688
3123.6C25410004r59587p52831m29192q89892m19884m23584p71675j159096j029815
$$ y = [372126770, 371625710, 371320648, 370621529, 369559174, 368822632, 368410072, 367531090, 366548309, 365813408, 364960251, 364054413, 363431053, 362384911, 361599693, 361424408, 360968285, 360464172, 359734306, 358819466, 357883949, 357398415, 356800385, 355869789, 355473824, 354635582, 353596115, 352935524, 352554283, 352019272, 350973320, 350063248, 349102173, 348308830, 347468300, 346518364, 346292419, 346127625, 345390663, 344722557, 344187393, 343268585, 342290001, 341476326, 340773201, 340073471, 339570770, 339403152, 338925018, 337799988, 336775284, 336258163, 335087013, 334012032, 333523407, 332875595, 332413635, 331662254, 331197739, 330644913, 329358788, 328352509, 327868729, 327260857, 326170692, 325410004, 324450417, 323697586, 323268394, 322378502, 321958618, 321535034, 320763359, 319604263, 318574448]
3132.3C18574448o60153p54680o89221q39386p07092q03185m78019o90651j092491
3141C11859570o18458q99601n84069n68046o26030m92210j017495j019516q62865o45352
3150.6C04525928q55865q64525p64198p72801q09154p19910l92151r47227o27308o13022
3160.3B97159767j173076r75056q19321l85189p19490r37996p26566l91026n56869
3168.9B90475178j087952p40623p63626n97439q21152j111908r73206q89301n99308
3177.6B82890663p67383m27723p27215j081429p34501m98313l76225r02786n35202
3186.3B76839886m21429p37057p05242q59966o44264o35834p26910r59053n65681l02868
3195.9B70281582q45661r91307q13102k01607m36421p92388m45919o14529q82092p14092
$$ y = [318574448, 317914295, 317159615, 316470394, 315631008, 314923916, 314120731, 313642712, 312952061, 311859570, 311241112, 310341511, 309757442, 309189396, 308563366, 308071156, 307053661, 306034145, 305171280, 304525928, 303670063, 302805538, 302041340, 301268539, 300459385, 299739475, 299347324, 298400097, 297772789, 297159767, 295986691, 295011635, 294192314, 293807125, 293087635, 292149639, 291423073, 291032047, 290475178, 289387226, 288646603, 287882977, 287285538, 286464386, 285352478, 284379272, 283489971, 282890663, 282123280, 281695557, 280968342, 279886913, 279152412, 278654099, 278277874, 277375088, 276839886, 276418457, 275681400, 274976158, 274116192, 273471928, 272836094, 272109184, 271150131, 270584450, 270281582, 269435921, 268444614, 267631512, 267429905, 266993484, 266201096, 265755177, 265140648, 264258556, 263544464]
3205.6B63544464l63655m20876n88989p77435o77395m83875n97477m57783o91090j013584
3215.2B57472305p12623l49083l61367m26368n83515o90327m17004m53834n51205n04112
3224.9B52422867p63512r69658m75960m67414q04978k89097l31897n06974m57573o85329
3234.5B46670475j034870p77455J29319k85588p44609o37246m94232j94015k52190
3243.2B42379589k26192n30262n97535l28865o17351j194134o78253P3433k61040Q7719
3252.8B38107109k22244p20101n15747q49666o09055l57323R0104k53315r28593k77767
3262.5B33463402k61421m52214l69854l69796n49469o15807l7384j07708o52142o45732
3272.1B29401875k88525k0580l56083p88174l94535j51005m01020m05331k06108J18466
$$ y = [263544464, 263180809, 262759933, 262170944, 261393509, 260716114, 260232239, 259634762, 259176979, 258485889, 257472305, 256759682, 256410599, 256049232, 255622864, 255039349, 254349022, 253932018, 253478184, 252926979, 252422867, 251659355, 250689697, 250213737, 249746323, 248941345, 248652248, 248320351, 247813377, 247355804, 246670475, 245635605, 244858150, 244987469, 244701881, 243957272, 243320026, 242825794, 242631779, 242379589, 242153397, 241623135, 241025600, 240696735, 240079384, 238885250, 238206997, 238280430, 238019390, 238107109, 237884865, 237164764, 236649017, 235799351, 235190296, 234832973, 234923077, 234669762, 233741169, 233463402, 233201981, 232749767, 232379913, 232010117, 231460648, 230844841, 230807457, 230699749, 230047607, 229401875, 229113350, 229092770, 228736687, 227948513, 227553978, 227402973, 227001953, 226596622, 226390514, 226508980]
3281.8B26508980j63708n51491p19642m66080J17702l48281n99957k75478j4172J48525
3291.4B23636398l10974o13670o79455o52370m41800j94358j72787l13931J4687k12822
3301B20058918p59735l14388m1638k10361k97680l15476p343k08988n10941n70640
3310.7B16821728n66807O8550j32294o57005m42219l98693l45516k67677k38152k18048
3320.3B13623867l01380m16336l23239m63256m99478l54061n74188l06301o44741p89452
3330B08951435l19462q80336p40929j58539j37310k86827n54009n93242l51467m28143
3339.6B04501171p47452l39451j07765m26559r48754m50344N71309j40000p10831n33657
3349.3B00667667k56538j38721j8330M6043m98352k95658m75941m50744J41430j03016
$$ y = [226508980, 226345272, 225793781, 225074139, 224608059, 224725761, 224377480, 223777523, 223502045, 223487873, 223636398, 223325424, 222711754, 222032299, 221379929, 220938129, 220743771, 220570984, 220257053, 220271740, 220058918, 219299183, 218984795, 218943157, 218732796, 218435116, 218119640, 218112297, 217903309, 217392368, 216821728, 216254921, 216323471, 216191177, 215534172, 215091953, 214693260, 214347744, 214080067, 213841915, 213623867, 213322487, 212906151, 212582912, 212119656, 211620178, 211266117, 210691929, 210385628, 209740887, 208951435, 208631973, 207751637, 207010708, 206852169, 206714859, 206428032, 205874023, 205280781, 204929314, 204501171, 203753719, 203414268, 203306503, 202879944, 201931190, 201480846, 202052155, 201912155, 201201324, 200667667, 200411129, 200272408, 200254078, 200300121, 199801769, 199506111, 199030170, 198579426, 198720856, 198617840]
3358.9A98617840l08457l99360N9280j1234k27738j59645p05261l76205J87435J3866
3368.6A96690521k61307l51238m14333J29814Q9397p55882k96554J52149J48697K6626
3378.2A95157890j45321l62358l91979L8128k09312r8706j06621J32103M95167k0008
3387.8A94488983R2259k34929l88965k91901k01244L03192K75459P2384m45289k94705
3397.5A93375244k05898J23520M71630n0450K59896j06411j77708l6106l53069K44007
3407.1A93544655J8158j36833K88429J65958k03933J05819N04799n9299o0883M89311
3416.8A94656181N87406J77746K02370K51942j23158R9774K53982L42178j14669k63596
3426.4A96070156L60489O27747P62958L204j3656O33793J79519K70443L98865J06087
$$ y = [198617840, 198309383, 197910023, 197969303, 197958069, 197730331, 197570686, 196865425, 196489220, 196676655, 196690521, 196429214, 196077976, 195663643, 195793457, 195882854, 195126972, 194830418, 194982567, 195131264, 195157890, 195012569, 194650211, 194258232, 194296360, 194087048, 193988342, 193881721, 194013824, 194508991, 194488983, 194581242, 194346313, 193957348, 193665447, 193464203, 193767395, 194042854, 194115238, 193669949, 193375244, 193169346, 193292866, 193764496, 193714046, 193973942, 193867531, 193689823, 193653717, 193300648, 193544655, 193562813, 193425980, 193714409, 193880367, 193676434, 193782253, 194287052, 194227753, 194166870, 194656181, 195243587, 195421333, 195623703, 195875645, 195752487, 195852261, 196106243, 196448421, 196333752, 196070156, 196430645, 197058392, 197821350, 197824554, 197810898, 198444691, 198624210, 198894653, 199293518, 199399605]
3436.1A99399605J41830L40576K24209j23882O07700J037484J71508o2084N22709J209507
3445.7B03469162O17867m00200O33030J104068N89199L28312M46549N66520M45481
3454.4B07799988M95777P6237O5879M72718O46648J050739R77612K32449l83721N77221
3464B12011547R47876L97396Q03547N84107O72836J124553Q84266O04477M48895M33273
3473.7B18912773M01821O59580O87142P02648R11083R64146N85594R6092N93472J065121
3483.3B25579472J028785Q31547J094914J163215N57041L97053L37963P82204R69658
3492B32741852J009826J069165O51989O30321M13895P64522J044980J040229J091614
3500.7B40458393J020298J002636J86253O21261J148167P12414Q10070J275177O11782
$$ y = [199399605, 199541435, 199882011, 200106220, 199982338, 200590038, 201627522, 201799030, 201736946, 202259655, 203469162, 204087029, 203686829, 204319859, 205423927, 206013126, 206341438, 206787987, 207354507, 207799988, 208295765, 208372002, 208437881, 208910599, 209557247, 210607986, 211585598, 211818047, 211434326, 212011547, 212959423, 213356819, 214160366, 214744473, 215417309, 216541862, 217426128, 218030605, 218479500, 218912773, 219314594, 219974174, 220661316, 221363964, 222275047, 223239193, 223824787, 223920879, 224514351, 225579472, 226608257, 227439804, 228534718, 229697933, 230254974, 230652027, 230989990, 231772194, 232741852, 233751678, 234820843, 235472832, 236103153, 236517048, 237281570, 238326550, 239366779, 240458393, 241478691, 242481327, 242667580, 243288841, 244437008, 245149422, 245959492, 247234669, 247846451]
3509.4B47846451M4288J687870J359368O38199J132488J109867R68037N79700J408425
3518B56774693J208114N30510J174526J249848J243953P41768M19216P85714J460685
3526.7B65589027J195202J072960J459866R60712J248532J238575J330585J304188
3534.4B75399647R48066Q60653R52378J696319J566239J309833O39897P81879J614513
3543.1B85769424J275235J091022J272030J898022J354027J807270J639461J236153
3550.8B97342644K309551J113911J174297J300316J629047J687203Q05587J990166
3558.5C09352722J578560J467361J471367K062340J971111R16100K655125J333351
3566.2C22808037J101150R45702J256637L412209K146034J669312J319656J796684
$$ y = [247846451, 247890739, 249578609, 250937977, 251576176, 252708664, 253818531, 254786568, 255366268, 256774693, 257982807, 258513317, 259687843, 260937691, 262181644, 262923412, 263342628, 264128342, 265589027, 266784229, 267857189, 269317055, 270277767, 271526299, 272764874, 274095459, 275399647, 276347713, 277208366, 278160744, 279857063, 281423302, 282733135, 283373032, 284154911, 285769424, 287044659, 288135681, 289407711, 291305733, 292659760, 294467030, 296106491, 297342644, 299652195, 300766106, 301940403, 303240719, 304869766, 306556969, 307362556, 309352722, 310931282, 312398643, 313870010, 315932350, 317903461, 318819561, 321474686, 322808037, 323909187, 324854889, 326111526, 329523735, 331669769, 333339081, 334658737, 336455421]
3574C36455421K028923K501717K796974P15447J874008K115555J577873J812706J995964
3582.6C53874588K349129J876983L836022K132530n72243J935578J576080K810364
3590.4C69819031K409935K806129K341652J581383L195190J354561K788239L076172
3598.1C89372292J252555K788506J561737J762810L207855K599411K272377K824326
3605.8D07641869L123512R20257L035775J725807J241646O321907K296066o01730L253326
3614.5D28958435Q75969M359169M881592J430015K409554K007370J925278L398971
3622.2D50246353L649178K936668L652763L101426K331085N502090J371384n176773
3629.9D67614174M069443N124778O214180L589020K57073L363723M082489L090554
$$ y = [336455421, 338484344, 340986061, 343783035, 344498482, 346372490, 348488045, 350065918, 351878624, 353874588, 356223717, 358100700, 361936722, 364069252, 363497009, 365432587, 367008667, 369819031, 372228966, 375035095, 377376747, 378958130, 382153320, 383507881, 386296120, 389372292, 390624847, 393413353, 394975090, 396737900, 399945755, 402545166, 404817543, 407641869, 410765381, 411685638, 414721413, 416447220, 417688866, 424010773, 426306839, 425705109, 428958435, 429834404, 434193573, 439075165, 440505180, 442914734, 444922104, 446847382, 450246353, 453895531, 456832199, 460484962, 463586388, 465917473, 471419563, 472790947, 467614174, 471683617, 476808395, 483022575, 486611595, 486868668, 490232391, 494314880, 497405434]
3637.6D97405434K285385K871322L181343L135567K357254J997528L882180M073143
3645.3E21189156M836273P23457n17959O699829J277771q47054Q90427N450287N516395
3654E45218582L953438M625816m748077K816429O245155K596627K951393J525574K662582
3662.7E67847519K085876K312699K711296J222992M436073K617149P10907J489411
3670.4E85433922n090370L433303Q324242P987290j523400j2808456M018249P360421
3678.1E97135201M386558j281357J214943L469391K212563J422462P47833J124039
3685.8F10431633M820404O155739r257927k855492P963105l921357K52037N862008
3693.5F19450150J952323J363106N684j01662J639634Q24318K666664K566795m538078
$$ y = [497405434, 499690819, 502562141, 505743484, 508879051, 511236305, 513233833, 517116013, 521189156, 526025429, 526748886, 526230927, 532930756, 534208527, 533361473, 534251900, 539702187, 545218582, 549172020, 553797836, 549049759, 551866188, 558111343, 560707970, 563659363, 565184937, 567847519, 569933395, 572246094, 574957390, 576180382, 580616455, 583233604, 583944511, 585433922, 580343552, 583776855, 592101097, 600088387, 598564987, 585756531, 589774780, 597135201, 601521759, 600240402, 601455345, 604924736, 607137299, 608559761, 609307594, 610431633, 615252037, 621407776, 612149849, 609294357, 617257462, 613336105, 613588142, 619450150, 621402473, 622765579, 622771263, 622669601, 624309235, 625133553, 627800217, 630367012, 625828934]
3702.2F25828934r15680M589920J930084L28026J83525L034744L570442p206878L380546
3710.9F34723663M666252r885940L787956M156265J122933O54526J521644J296463
3718.6F42043762k513008J195107M907837l261719l502808N313187O70547j902008
3726.3F42950897j792755P62940L606872P72247M932557j610947o363983P536316j663208
3735F49130936q528366J956329L121185J121369K381210L435211k743072K525787R459534
3743.7F61860123j0829697j2698364R276962N544281O347504k123413j0449906J0086136
3751.4F57013626m293594o681824O144714L883133K881623m658204J569977M820710
3759.1F60680161o707306m88129M236145J507263K30103K651672j810226l711625K982026
$$ y = [625828934, 624913254, 629503174, 631433258, 631761284, 631944809, 634979553, 638549995, 631343117, 634723663, 639389915, 629503975, 633291931, 637448196, 638571129, 639225655, 640747299, 642043762, 639530754, 640725861, 645633698, 642371979, 638869171, 644182358, 644852905, 642950897, 641158142, 641921082, 645527954, 646300201, 651232758, 649621811, 643257828, 650794144, 649130936, 640602570, 642558899, 645680084, 646801453, 649182663, 652617874, 649874802, 652400589, 661860123, 651030426, 638332062, 647609024, 653153305, 659500809, 657377396, 646927490, 657013626, 652720032, 646038208, 652182922, 656066055, 658947678, 654289474, 655859451, 660680161, 653972855, 653484726, 657720871, 659228134, 659458237, 662109909, 660299683, 656588058, 659570084]
3767.8F59570084M542465k07291q996887K294769L940506q0185Q96912P3471K72446
3776.5F62306290j77384K501984M70505o732331K163163K535705J151810J509857k712936
3785.2F63016663o89698J245041P59583M60129j98136O57272K88544O3553L3646J086502
3794.8F66723099J967315l831405k463761K487030K992402M550705o072846q452988
3802.5F57899551L724671K057419M365005N167084r181366l457794N201034K349777
3810.2F68125381L10059J61209O5537J373901M738922j875992j2186126M555206M767990
3818.9F70036087L445663Q69370j6576920K833786O599732K495117K184067o00433
3826.6F71286469m238053N112J946487K690659J605072p270355J819610O584015n520553
$$ y = [659570084, 664112549, 663905258, 654908371, 657203140, 661143646, 661063461, 661960373, 662033844, 662306290, 662128906, 664630890, 665101395, 658369064, 660532227, 663067932, 664219742, 665729599, 663016663, 662326965, 663572006, 664331589, 664791718, 664593582, 665250854, 665539398, 665602951, 665636597, 666723099, 668690414, 664859009, 662395248, 664882278, 667874680, 672425385, 666352539, 657899551, 661624222, 663681641, 668046646, 673213730, 664032364, 660574570, 665775604, 668125381, 668435440, 668596649, 668662186, 670036087, 674775009, 672899017, 660712891, 665268097, 670036087, 673481750, 674351120, 657774200, 660607986, 667207718, 669702835, 671886902, 671286469, 667048416, 667053528, 669000015, 671690674, 673295746, 666025391, 667845001, 674429016, 668908463]
3835.3F68908463q23136P023163o899490l949356O225662l936081m41513N682297j908722
3844F69881287k502976K326813P89947j85089J585388N02778J976471L957901n522080
3852.7F72810440J032333j2841415k89230R800949l70331j740036J725159J718292
3860.4F71846161K592697m796753K66724O485443n685654n354538L943787M754638
3868.1F74052505M465943p897949p822495M050827N858231L068542q418655K70157
3875.8F67627106L718338L44162K210388L364410o245498o522675N876541J611557
3883.5F71984329J326294L559876j1452332K097931L947525N84183L530960j680527
3891.2F73898239o138916J089783J971435j115875J274338N69153J697082J676407
$$ y = [668908463, 668085327, 675108490, 668209000, 664259644, 670485306, 666549225, 666107712, 671790009, 669881287, 667378311, 669705124, 670495071, 670309982, 671895370, 672398148, 674374619, 678332520, 672810440, 673842773, 661001358, 660712128, 670513077, 670142746, 668402710, 670127869, 671846161, 674438858, 669642105, 669908829, 676394272, 670708618, 665354080, 669297867, 674052505, 678518448, 670620499, 662798004, 666848831, 672707062, 675775604, 667356949, 667627106, 671345444, 671689606, 673899994, 677264404, 671018906, 664496231, 670372772, 671984329, 673310623, 676870499, 665418167, 667516098, 671463623, 672047806, 675578766, 673898239, 667759323, 668849106, 670820541, 669704666, 670979004, 671548157, 673245239, 674921646]
3898.9F74921646q613968M673844K538986m624787L885880l277435j713486J259460
3906.7F69050140J650010J635665r01107k31705n89142N91126P09457n62897Q21762
3915.3F72173309J939850k512817l186493L465195p10984l545379K298736J633377
3923.1F71554794R16825j571122k731857J094589J216660J109085l42026p48749J389084
3931.7F71887283j614685j576690J043396N35125P56378L03879l82843o64367q59986
3940.4F69427490J443100J174927l226242l09677J472626N61904M17939k264252J256943
3949.1F69954758J261520k322693J402359K96478q36181j11084m01154L52555O027
3957.8F69602585M00467j87912O65207N07888r16976Q5144p4540K01569k16599j32751
$$ y = [674921646, 666307678, 670981522, 673520508, 668895721, 672781601, 669504166, 667790680, 669050140, 670700150, 672335815, 671434708, 671203003, 670613861, 671204987, 671914444, 671351547, 672173309, 674113159, 671600342, 668413849, 671879044, 671168060, 667622681, 669921417, 671554794, 672471619, 670900497, 668168640, 669263229, 670479889, 671588974, 671246948, 670498199, 671887283, 670272598, 668695908, 669739304, 670274429, 671030807, 671334686, 670951843, 670287476, 669427490, 670870590, 672045517, 668819275, 668509598, 669982224, 670544128, 670962067, 668697815, 669954758, 671216278, 668893585, 670295944, 670592422, 669756241, 669645157, 669244003, 669596558, 669602585, 670003052, 669815140, 670480347, 670988235, 670071259, 670156403, 670081863, 670283432, 670066833, 669934082]
3967.4F69934082K03705n11704J90125N03921r8343n64651j0986O7596k03094L3950
3977.1F69544601N30167N27954j17493j8463o4468j85547q55636q1254R27430N6152
3986.7F70263443l95279m64935J013489M13284j046066l2196M51583M66919p81555
3995.4F69888687q32214M86374P49206m43268p11441
4000.2F69137344
$$ y = [669934082, 670137787, 669626083, 669816208, 670320129, 670221786, 669657135, 669646149, 669713745, 669510651, 669544601, 670074768, 670602722, 670485229, 670466766, 670402298, 670216751, 669361115, 669279861, 670207291, 670263443, 669868164, 669403229, 670416718, 670830002, 669783936, 669751740, 670203323, 670670242, 669888687, 669056473, 669542847, 670292053, 669848785, 669137344]
##END=$$ End of the data block
