##TITLE=$$ Begin of the data block
##JCAMP-DX=5.00 $$ ACD/SpecManager v 10.08
##SPECTROMETER/DATA SYSTEM=Varian
##DATE=14 Jan 2013 10:21:34
##DATA TYPE=INFRARED SPECTRUM
##DATA CLASS=XYDATA
##ORIGIN=
##OWNER=
##NPOINTS=3735
##FIRSTX=399.26403809
##LASTX=4000.35498047
##MAXX=4000.35498047
##MINX=399.26403809
##MAXY=72.59151459
##MINY=19.27317619
##XFACTOR=1.0000000000
##YFACTOR=0.000000100000000
##FIRSTY=39.68720245
##DELTAX=0.96440572
##XUNITS=1/CM
##YUNITS=TRANSMITTANCE
##XYDATA=(X++(Y..Y))
399.3C96872025k781716K436485k196426r982109J990280O024246N171471k378693
407C95155563j022758N408401k412758q63113k187118o9771J977272l531151K604446
415.7C95059013M242478k565651m259873m287033m674759L221703L244896L304024
423.4C93284798K772293J677437M172782m115791p224655n03273M048347O419983K25754
432.1D00757675m160728m076882j570358K694321K640228j912003o217575l561210
439.8C84593468J081619K537041O167068N116043k999305m330178l80516J71929j033173
448.4C90923996j088676N16395J633606L226585J533661l205108k825966j250076m24309
457.1C89040108k113991K16751J7815k677193M04739L051491j177139k961922J976662
$$ plain form
399.3 396872025 394090309 396526794 394330368 384348259 386338539 392362785 397534256 395155563
407 395155563 394132805 399541206 397128448 396265335 394078217 394008446 395985718 392454567 395059013
415.7 395059013 399301491 396735840 392475967 388188934 383514175 386735878 389980774 393284798
423.4 393284798 396057091 397734528 401907310 397791519 390566864 390063591 394111938 400531921 400757675
432.1 400757675 396596947 392520065 390949707 393644028 396284256 394372253 388154678 384593468
439.8 384593468 385675087 388212128 394379196 399495239 396495934 392165756 391785240 391957169 390923996
448.4 390923996 389835320 390351715 391985321 395211906 396745567 393540459 390714493 389464417 389040108
457.1 389040108 386926117 387142868 387160683 384483490 384888229 387939720 386762581 383800659 385777321
465.8C85777321P40852k092018p79457q64563J85509q83942Q83217K622299k17552
474.5C85371666j726151m037361j484298r61228k211037K626076K279244l100090r32350
483.2C75824471J758422m24804m97895j22451k948761l236084J729774J484718L70331
491.8C73937721J928025P66181r47227j790161M8027j068993k223930q62427M47731
500.5C70234947K451096j52703J91498K73018l329964k049789k63824P34405M33617
509.2C68522301p73545q33740M71192J479339j2626k777977k893410M83742r8038k024918
518.9C61542320j78146Q94699J174202p5493j114845R79309r89037l029136Q99543
527.5C60103416j397247k230606O58341J42631N11436l50379M8904K89230j177597
$$ plain form
465.8 385777321 386518173 384426155 383646698 382782135 382967644 382083702 382966919 385589218 385371666
474.5 385371666 383645515 379608154 378123856 377162628 374951591 377577667 379856911 376756821 375824471
483.2 375824471 377582893 377158089 376660194 376537743 373588982 370352898 372082672 373567390 373937721
491.8 373937721 375865746 376631927 375684700 373894539 373942566 372873573 370649643 369787216 370234947
500.5 370234947 372686043 372533340 372724838 372997856 369667892 367618103 367354279 368088684 368522301
509.2 368522301 367748756 366915016 367386208 368865547 368852921 366074944 363181534 363665276 363567238 361542320
518.9 361542320 361364174 362258873 363433075 363357582 362242737 363222046 362233009 359203873 360103416
527.5 360103416 358706169 356475563 357133904 357276535 357787971 357437592 357486496 357775726 356598129
536.2C56598129m4784P14149m30679k888680k196655j17378J413727J023216j611137
544.9C52459908o6681J55906j115532k59704j94283k60582o44035o82755k60200n82275
554.5C48549767j480103q65517j413002j692314P95174J790352R05037j15548K6894
563.2C46500740q09936K43263N83648j934852Q04634J405258o25877N40352o6414j448746
572.9C45192070o72760N78613l3226o29616k11906L61710N41496m3602o83861K74239
582.5C44673157J242561q28438j259727k75459o6948O27136N08461M23927J27068O98509
592.1C45870247L02048l68843Q09478P64313L86581N06630J73607K58904O49452n95894
601.8C48756523j611366j114731m73633R92203P65800j217651j358452k73895J12686
$$ plain form
536.2 356598129 356553345 357267494 356836815 353948135 351751480 351634102 353047829 354071045 352459908
544.9 352459908 352393227 352549133 351433601 351173897 350979614 350719032 350074997 349392242 349132042 348549767
554.5 348549767 347069664 346204147 344791145 343098831 343894005 345684357 346589394 346473846 346500740
563.2 346500740 345690804 345934067 346517715 344582863 345387497 346792755 346166878 346707230 346640816 345192070
572.9 345192070 344519310 345097923 345064697 344435081 344223175 344584885 345126381 345082779 344398918 344673157
582.5 344673157 345915718 345087280 343827553 343552094 343485146 344112282 344620743 345044670 345171738 345870247
592.1 345870247 346172295 345803452 346612930 347377243 347763824 348270454 348444061 348702965 349352417 348756523
601.8 348756523 347145157 346030426 345556793 346548996 347314796 346097145 344738693 344464798 344577484
610.5C44577484l63502k474137k768326K89002O49643K0294o28815k18277J522484
619.2C40605850o1722l81164Q17985Q14858N19562N08728N5923P94449K506485Q57773
628.8C47038727K64282J067734K028694K325478J053123J532631J522636J646576R31359
637.5C59411240N30510P09228k7199J551705J151809M22478J242600J116409J649094
646.2C67757874J760559J272125P80105P18766M10995K29187R16481N91583m81452
654.8C73956223m57688N16815O99692L29552p6294K62565n416j372033n72471q7242
664.5C73193703P5683Q29964k585526p167854O883278L969116Q70590J31379k5292
673.2C76175041Q91228K004280Q48503Q50372J831398J832962J828423J350708P88994
$$ plain form
610.5 344577484 344213982 341739845 338971519 339260521 339910164 339930458 339301643 339083366 340605850
619.2 340605850 340544128 340162964 340980949 341795807 342315369 342824097 342880020 343674469 346180954 347038727
628.8 347038727 347303009 348370743 350399437 352724915 353778038 355310669 356833305 358479881 359411240
637.5 359411240 359941750 360650978 360623779 362175484 363327293 363749771 364992371 366108780 367757874
646.2 367757874 369518433 370790558 371570663 372289429 372700424 372929611 373846092 374437675 373956223
654.8 373956223 373498535 374015350 374715042 375044594 374968300 375230865 375225449 373853416 373280945 373193703
664.5 373193703 373269386 374099350 371513824 364345970 371229248 375198364 376068954 376200333 376175041
673.2 376175041 377066269 379070549 379919052 380769424 382600822 384433784 386262207 387612915 388401909
681.8C88401909J144447Q16345J21155J015282J706772J421051J48964k90642J097946
690.5C95583229J468201J268348N68200K71377J083985J760559J542282n38597m39568
699.2D02568016J387672R72291N50384R46922J008530O42357L46985K83088O35796
707.9D09342041N44472O35185J994057J533012N34859L21998O2447Q75397Q03489K88163
717.5D16935120P50808P85904M83933J362304J646424O19354J62735P8583Q01163J139907
727.2D24766235J288376J240730L34282Q92945J125374R30862R63364P59277K13242
735.8D32514687l38898K13013P2975L57132O75201J004028J437455M05845K54441J193275
745.5D37789154J280556n42412k83585J323967J025811N51910j25465J043243J436920
$$ plain form
681.8 388401909 389546356 390362701 390483856 391499138 393205910 394626961 394775925 394485283 395583229
690.5 395583229 397051430 398319778 398887978 399159355 400243340 402003899 403546181 403007584 402568016
699.2 402568016 403955688 404927979 405478363 406425285 407433815 408076172 408423157 408706245 409342041
707.9 409342041 409886513 410521698 412515755 414048767 414583626 414905624 414968071 415843468 416646957 416935120
717.5 416935120 417685928 418471832 418955765 420318069 421964493 422583847 422746582 422825165 423626328 424766235
727.2 424766235 426054611 427295341 427629623 428522568 429647942 430578804 431542168 432301445 432514687
735.8 432514687 432175789 432388802 432461777 432818909 433494110 434498138 435935593 436341438 436595879 437789154
745.5 437789154 439069710 438527298 438243713 439567680 440593491 441145401 441019936 442063179 443500099
754.2D43500099K45362r6818L31345J670151J208725Q15887J853638J697082O97785
762.8D51923256J425552J660271J125183J509361j29356l02048q7662k00691O02951
771.5D57526817J09063R3421J42556J412773P16247q28018k79579m53644k71415K6397
781.2D58194618Q29315L44162O84777J333008M78019O71768l8566J68266K96211J34850
790.8D63096428j62621N70603J259842n65338n990k61001k40288M2458r27315r75838
800.5D61830940j245346j01204r35745j763573j592674j807403j523858j453437j357117
809.1D50050583j975975j332665j942100j644287m59214j430702j437263j219597k18315
817.8D38390465K5482N5160o37016j020126J326065K012787K397003K413979K728347
$$ plain form
754.2 443500099 443745461 443648643 443979988 445650139 446858864 447674751 449528389 451225471 451923256
762.8 451923256 453348808 455009079 456134262 457643623 457514267 457212219 457124557 456923866 457526817
771.5 457526817 457635880 457729301 457871857 459284630 460000877 459172859 458893280 458439636 458168221 458194618
781.2 458194618 459023933 459368095 460052872 461385880 461863899 462535667 462497101 462665367 462961578 463096428
790.8 463096428 462933807 463504410 464764252 464198914 464192924 463931923 463691635 463734093 462806778 461830940
800.5 461830940 460585594 460484390 459548645 457785072 456192398 454384995 452861137 451407700 450050583
809.1 450050583 448074608 446741943 444799843 443155556 442696342 441265640 439828377 438608780 438390465
817.8 438390465 438415947 438471107 437834091 436813965 438140030 440152817 442549820 444963799 447692146
826.5D47692146L352394K760163K578506K436867K714272J959304K767487L165474
834.2D69426613K902145L611336K242584J838379J966438K462044J502381O62384J384811
842.9D87999115J252861J588860J960907K653198J872482J835938J210136M07906O69021
851.6E01450424L85399K483940J941223J359406J543770J634941K201195J361846K047692
860.3E16409836R66759M74929L15819N14755K47727p57179L89061J01280J207695k81296
869.9E19589386j759071r34410j873017k161674k047310l99361q55064j383095j052399
878.6E07123985m21676j55678j305199n05104j313515j382408j202430p98493m29993
887.3D99609489n27954J079293K89650L68690l04794p52983m74701j92604J058006
$$ plain form
826.5 447692146 451044540 453804703 456383209 458820076 461534348 463493652 466261139 469426613
834.2 469426613 472328758 475940094 478182678 480021057 481987495 484449539 485951920 486614304 487999115
842.9 487999115 489251976 490840836 492801743 495454941 497327423 499163361 500373497 500781403 501450424
851.6 501450424 501835823 504319763 506260986 507620392 509164162 510799103 513000298 514362144 516409836
860.3 516409836 517376595 517851524 518167343 518682098 518929825 518172646 518561707 518662987 519870682 519589386
869.9 519589386 517830315 516895905 515022888 512861214 510813904 510414543 509559479 508176384 507123985
878.6 507123985 506702309 506546631 505241432 504736328 503422813 502040405 500837975 500039482 499609489
887.3 499609489 499081535 500160828 500450478 500819168 500514374 499761391 499286690 499094086 500152092
895.9E00152092m63181K97738K90947r5711O9084n60036J28746m14886Q69140J225357
905.6E01499290J569405K406731K843818L089409R09539O73561L7193n05753j190834
914.3E11332359j425590j180306j852493j084366j651077j523399k627984l382339
922D96604805l079834l799057k864571k967834l173637l309403k840195k944183k857170
930.7D68768921j764526k666626k278176j622963j564941j456909j044960j094551
938.4D55275269j582032r34410j752395j410370q87909j142617q14743j247024n48210
947.1D44955559p6142o24885j143646l15743K0294m86946j65329j006851j360893j631279
956.7D38164139k167092j989898j730347k305183k845841j984749j679306j583786
$$ plain form
895.9 500152092 499688911 499986649 500277596 500181885 500250969 499690933 499819679 499404793 500273933 501499290
905.6 501499290 503068695 505475426 508319244 511408653 512318192 512991753 513028946 512523193 511332359
914.3 511332359 509906769 508726463 506873970 505789604 504138527 502615128 499987144 496604805
922 496604805 493524971 489725914 486861343 483893509 480719872 477410469 474570274 471626091 468768921
930.7 468768921 467004395 464337769 462059593 460436630 458871689 457414780 456369820 455275269
938.4 455275269 453693237 452758827 451006432 449596062 448708153 447565536 446750793 445503769 444955559
947.1 444955559 444879417 444254532 443110886 442795143 442815437 442328491 442163162 441156311 439795418 438164139
956.7 438164139 435997047 434007149 432276802 429971619 427125778 425141029 423461723 421877937
964.4D21877937k088165k754860k437172j842232j864204k513390k254333k388268
972.1D03735313k526550k850685l503151l462067m013443m406967m038772l929673
979.8C75004005m806060n000534m899407n335197n197602m913978m648476m835052
987.6C35367699m985848m186516l764305l701267l264770l501492l409157l332825
995.3C05221519l235149l097992l232040k809124l131695k638626k422581k364216
1003B82290096k189674k748509k045040j939163j773472k082710j674519r61227j474056
1011.7B65401726j044102j971798k304211j787242j552353k113896l219547k446098
1019.4B48962479j975155k040158j821231j077099j439533k125855k283211j867122
$$ plain form
964.4 421877937 419789772 417034912 414597740 412755508 410891304 408377914 406123581 403735313
972.1 403735313 401208763 398358078 394854927 391392860 387379417 382972450 378933678 375004005
979.8 375004005 370197945 365197411 360298004 354962807 349765205 344851227 340202751 335367699
987.6 335367699 330381851 326195335 322431030 318729763 315464993 311963501 308554344 305221519
995.3 305221519 301986370 298888378 295656338 292847214 289715519 287076893 284654312 282290096
1003 282290096 280100422 277351913 275306873 273367710 271594238 269511528 267837009 266875782 265401726
1011.7 265401726 264357624 262385826 260081615 258294373 256742020 254628124 251408577 248962479
1019.4 248962479 246987324 244947166 243125935 242048836 240609303 238483448 236200237 234333115
1027.1B34333115j332417j674042n30872r08928j108913r57165m94385J08757n98869
1035.8B26836281J420975J344051R23939J144561J710873J916618N53952J269111Q13008
1044.5B37933369J210079n91030j515618p8563j230507j250744j654968k55394o36540
1053.1B31930084j174507j037273j359883Q48027k2183p8735n27992P72590K365227
1061.8B31715355J439629K069683J964702K959728J235257P84530J466732J287079
1069.5B44922695J342487m51946L3474M47827J672268O21547N20535J632118m23412
1078.2B50317593M40425O16646J301613J245804J149540J056290l32203J128711J776905
1086.9B58701324K279606P75490N31426K120285K073021J936721J320496J840191R13849
$$ plain form
1027.1 234333115 233000698 231326656 230795784 229886856 228777943 227820778 227326393 227435150 226836281
1035.8 226836281 228257256 229601307 230525246 231669807 233380680 235297298 235851250 237120361 237933369
1044.5 237933369 239143448 238552418 237036800 236958237 235727730 234476986 232822018 232566624 231930084
1053.1 231930084 230755577 229718304 228358421 229206448 229184265 229105530 228577538 229350128 231715355
1061.8 231715355 233154984 235224667 237189369 240149097 241384354 242168884 243635616 244922695
1069.5 244922695 246265182 245813236 245846710 246294537 247966805 248588352 249108887 250741005 250317593
1078.2 250317593 250758018 251374664 252676277 253922081 255071621 256127911 255795708 256924419 258701324
1086.9 258701324 260980930 261756420 262287846 264408131 266481152 268417873 269738369 271578560 272492409
1095.6B72492409R30500J616573J581764J222630R42650J742058N54084J318112J748066
1104.2B84148846J544208J844597O03523Q65364Q22220O57234M14429P79095J077537
1112.9B92757053R63536J216812R03568J251564J82572j98269J03454Q850l6735n27401
1122.6B96625004K6378L12176J383438J399517R75647J366158J488590J714897J775646
1131.2C07067451K350846J021957J429234K698364K011986K555733K702846K244072
1139C24082489J719971J511535J201668J298447J169929M17099P31850N91545O93054
1147.6C33417587J289368J013908k96859o45676L0136l73497l73344m7989J57356j84326
1157.3C33986664o31600p33299q16841j70097j02043J93977K83050P50885J737557
$$ plain form
1095.6 272492409 273422909 275039482 276621246 277843876 278786526 280528584 281082668 282400780 284148846
1104.2 284148846 285693054 287537651 288141174 289006538 289828758 290485992 290900421 291679516 292757053
1112.9 292757053 293720589 294937401 295840969 297092533 297275105 297076836 297180290 297189140 297152405 296625004
1122.6 296625004 296651382 296963558 298346996 299746513 300722160 302088318 303576908 305291805 307067451
1131.2 307067451 309418297 310440254 311869488 314567852 316579838 319135571 321838417 324082489
1139 324082489 325802460 327313995 328515663 329814110 330984039 331401138 332132988 332724533 333417587
1147.6 333417587 334706955 335720863 335424004 334778328 334808464 334434967 334061623 334013634 334170990 333986664
1157.3 333986664 333355064 332621765 331804924 331634827 331532784 331726761 332009811 332760696 334498253
1166C34498253J991958K730484K486420K613754L137284K857361K715683L123512L022652
1174.6C59177361K797622L097382K644348K889557L182525K877846K352638K102128
1182.4C81121407K377090K108345J361465O67458N91889P48939J059799Q78411M77600
1191C91392403m4022l40118j24779r36089j610565j389465j172676j210404j014633
1199.7C83549652j012382j110535r80873j091118j538162k137299j343307o63033p10029
1208.4C72962914l55721o35452l46184M3449l79295n25665j99280j68953q80013o13327
1218C68902473l64570l88832j07575k98691j04560l90702p71751q45223q50448p73773
1227.7C64006348j115380j136779j190377p94792l46680l77922k28500n48706n90820
$$ plain form
1166 334498253 336490211 339220695 341707115 344320869 347458153 350315514 353031197 356154709 359177361
1174.6 359177361 361974983 365072365 367716713 370606270 373788795 376666641 379019279 381121407
1182.4 381121407 383498497 385606842 386968307 387635765 388227654 388976593 390036392 390914803 391392403
1191 391392403 391348381 391008263 390883484 389947395 388336830 386947365 385774689 384564285 383549652
1199.7 383549652 382537270 381426735 380445862 379354744 377816582 375679283 374335976 373672943 372962914
1208.4 372962914 372607193 371971741 371625557 371669006 371289711 370764046 370564766 370395813 369515800 368902473
1218 368902473 368537903 368149071 368041496 367742805 367638245 367247543 366475792 365630569 364780121 364006348
1227.7 364006348 362890968 361754189 360563812 359769020 359422340 359044418 358815918 358267212 357676392
1236.4C57676392n42717m54522m51812m94385k66724l28369j6708k05460m46892o76422
1246C53792381o31103j63155p05032o96564o56776j67733M48266j33591l63159r7237
1255.7C50626297L70064j95503m69552m30984n37834K26249M94576O63147M21944L13606
1265.3C51482010L03612O62079R08164M69780Q65403M48494M88510J173095J020432
1274C57821579J028557J483459J625328R73473R65919R53446J188011J298027J068840
1282.7C68406639J821556J831055J283607J380577J483117J520805J730347J506538
1290.4C80964241J131058P53555J005211J252556O83822Q14400J098938J067734N89485
1299C89361000N29251N18990P0114K43568L35770M05006j06239j81160J18065n6992
$$ plain form
1236.4 357676392 357133675 356679153 356227341 355732956 355466232 355137863 355121155 354915695 354468803 353792381
1246 353792381 353161278 352998123 352293091 351596527 350939751 350772018 351220284 351086693 350723534 350626297
1255.7 350626297 350996361 350800858 350331306 349900322 349362488 349588737 350083313 350746460 351168404 351482010
1265.3 351482010 351785622 352447701 353355865 353825645 354691048 355139542 355628052 356801147 357821579
1274 357821579 358850136 360333595 361958923 362932396 363898315 364851761 366039772 367337799 368406639
1282.7 368406639 370228195 372059250 373342857 374723434 376206551 377727356 379457703 380964241
1290.4 380964241 382095299 382848854 383854065 385106621 385790443 386604843 387703781 388771515 389361000
1299 389361000 389890251 390409241 390479355 390722923 391058693 391463699 391357460 391176300 391294365 391237373
1308.7C91237373l33976q85621q86726o39610j24245j88141k89573j05782O6986O50826
1318.3C88501511M62112O53038Q14743R77669J003952O80923J002427N57212L91999
1327C95045586J40190L2997j55220o90193n79110q28056o24924k31437J36375p8697
1336.7C92167511k31895K01034j81122m2915N02510J168098N72548K95792J098022
1345.3C95549583P95212Q63457N01862M44107J47018m21181o05697n64728l30620n38444
1355C95840569J85661r7847k75078m01306n47676j36299n52979m87900j771812n79948
1364.6C91175385J95236k01187J08070r83772j102372n74531k75345m7264k88620p04422
1374.3C87301178l12500M43916j09482L05787j64910o00090n57823j196670j539956
$$ plain form
1308.7 391237373 390903397 390017776 389131050 388491440 388367195 388179054 387889481 387783699 387850685 388501511
1318.3 388501511 388963623 389616661 390431404 391409073 392413025 393093948 394096375 394653587 395045586
1327 395045586 395185776 395218773 395063553 394373360 393794250 392966194 392341270 392109833 392246208 392167511
1336.7 392167511 391935616 392136650 391955528 391912613 392415123 393583221 394155769 394451561 395549583
1345.3 395549583 396344795 397208252 397710114 398154221 398301239 397880058 397274361 396709633 396379013 395840569
1355 395840569 396026230 395928383 395653305 395251999 394704323 394568024 394015045 393527145 391755333 391175385
1364.6 391175385 391370621 391169434 391277504 390293732 389191360 388616829 388341484 388294220 388005600 387301178
1374.3 387301178 386988678 387432594 387323112 387628899 387463989 386863899 386306076 385109406 383569450
1382.9C83569450k013664j166801j024208j320649j805725j329918q28399j517754
1390.7C72562332j464348j832351j538430l046302l971711j408653j645203j298675
1398.4C56356659k473450k085991j119194k078857j920967k120819k866021k257385
1406.1C39433975j501694j657257j957550j550331j472473j177025r67293r23194j270867
1414.8C26956291j394081o41594q87451p9918p64580n10139P04613J32637M89082j18713
1424.4C23886147P36007Q01087M18892J077575N66063J141396J030769J818085J682625
1433.1C33158646J695099K018966O47736J544914J796494K585640K124252J927948
1440.8C47499695K172050J701088K404709J341171J668015J329307R77364J105385
$$ plain form
1382.9 383569450 381555786 380388985 379364777 378044128 376238403 374908485 374080086 372562332
1390.7 372562332 371097984 369265633 367727203 364680901 360709190 359300537 357655334 356356659
1398.4 356356659 353883209 351797218 350678024 348599167 346678200 344557381 341691360 339433975
1406.1 339433975 337932281 336275024 334317474 332767143 331294670 330117645 329150352 328227158 326956291
1414.8 326956291 325562210 324920616 324033165 323953247 323188667 322678528 323383141 323515778 324004860 323886147
1424.4 323886147 324622154 325423241 325842133 326919708 327485771 328627167 329657936 331476021 333158646
1433.1 333158646 334853745 336872711 337520447 339065361 340861855 343447495 345571747 347499695
1440.8 347499695 349671745 351372833 353777542 355118713 356786728 358116035 359093399 360198784
1448.5C60198784J626167K419892Q45108J498413J835289J708603Q73565K98844J231651
1457.2C72536316J85470L820153K181015K517624J965866J833305K321930P89108K847557
1465.9C90998344K180977K821846K350655K450676L038826J110725K687302L816986
1473.6D11456337M519386L361550L020553L434792K713661K258987J296463J282196
1481.3D33343925J971474K462082K196732J473426J352501R41239L85933P93152n60532
1490D44359932q65326M79202K65007m03480n85404p45964m245453n00030j278572k996559
1499.6D33483353n47066j071091j461334j544724m52423j803588o442757k709351L566399
1508.3D21017418K711372r84001M04511r86061j611214J9226p16515l25126k540703
$$ plain form
1448.5 360198784 361824951 364244843 365089951 366588364 368423653 370132256 371005821 371304665 372536316
1457.2 372536316 372721786 376541939 378722954 381240578 383206444 385039749 387361679 388150787 390998344
1465.9 390998344 393179321 396001167 398351822 400802498 403841324 404952049 407639351 411456337
1473.6 411456337 415975723 419337273 422357826 425792618 428506279 430765266 432061729 433343925
1481.3 433343925 435315399 437777481 439974213 441447639 442800140 443741379 444127312 444920464 444359932
1490 444359932 443494606 443973808 444238815 443835335 443249931 442503967 438258514 437758484 436479912 433483353
1499.6 433483353 432936287 431865196 430403862 428859138 428406715 426603127 420160370 417451019 421017418
1508.3 421017418 423728790 422744789 423149300 422163239 420552025 420571251 419854736 419529610 416988907
1517D16988907j419258J532554J208077k008209k518349R44557R39903J882401n86586
1525.7D16963997J31111R36928o4392P89337Q08105Q47626J208534J150818k214508
1534.3D20557556R16634Q90846J34239J063042l106804j289139J162605R8153O76345
1543D21103477J497231M39796l42788J828613L31078M70047r26476p62634J604347
1551.7D25242691N07355O04057l237801j43165R84650k92092l532753p953338M126091
1560.4D16305695M39376R11980j515465j779594k922783k580757o45600k353210j970100
1569.1D03889542q521233j447754j571998l948021l350678l579979k048530j1640702
1576.8C67780647p29294k266883m151993m176102n387459l317566n557518l718681
$$ plain form
1517 416988907 415569649 417102203 418310280 416302071 413783722 414728279 415668182 417550583 416963997
1525.7 416963997 417095108 418032036 417967644 418756981 419565086 420412712 421621246 422772064 420557556
1534.3 420557556 421474190 422365036 422499275 423562317 420455513 419166374 420328979 420427132 421103477
1543 421103477 422600708 423040504 422697716 424526329 424857407 425327454 424400978 423638344 425242691
1551.7 425242691 425750046 426354103 423116302 422973137 423957787 423665695 420132942 412179604 416305695
1560.4 416305695 416745071 417657051 416141586 414361992 411439209 408858452 408212852 405859642 403889542
1569.1 403889542 395368309 393920555 392348557 388400536 385049858 381469879 379421349 367780647
1576.8 367780647 367051353 364784470 360632477 356456375 351068916 347751350 342193832 338475151
1584.5C38475151n378876m181556l915253n145111l488884n856133l106174n459786
1592.2C01943378l296508l655606m567833k564888m841518k117329m528885k289695
1599.9B74081116l754273l272285j650715l972969j240254l800201j245308l085804
1607.6B52059307j561203j002216k339382K04658l026600j81808k133866J91136o00529
1616.3B41609497m702969K495823j475486Q41159j571540J161880j18847j918354J757736
1625B38078899l36113K106114j602001J751251O82316P70797J422806r479K297363
1633.7B45161953o92234K378578p35588K906895J787395P65934K581063L83396K951297
1642.4B57488689P12243K419433K022762l30104K134437o37035M817734J164588L022652
$$ plain form
1584.5 338475151 333096275 328914719 324999466 319854355 316365471 310509338 307403164 301943378
1592.2 301943378 298646870 294991264 290423431 287858543 283017025 280899696 276370811 274081116
1599.9 274081116 270326843 267054558 265403843 261430874 260190620 256390419 255145111 252059307
1607.6 252059307 250498104 249495888 247156506 247361164 244334564 244152756 242018890 242210026 241609497
1616.3 241609497 236906528 239402351 237926865 238768024 237196484 238358364 238239517 236321163 238078899
1625 238078899 237742786 239848900 238246899 239998150 240680466 241451263 242874069 242864590 245161953
1633.7 245161953 244469719 246848297 246112709 249019604 250806999 251572933 254153996 254537392 257488689
1642.4 257488689 258200932 260620365 262643127 262313023 264447460 263810425 268628159 269792747 272815399
1651B72815399K685318P40071j46523j23978M027443R02748K740803J292820K086735
1659.7B87020836K751350J861553L553219J117459L744697K074490L148594L116340
1667.4C08388538K888279M487954J664237M996872K704316M766922L957405L463134
1675.1C37317657L913041K965927N016021L386422M743232L785515M788895M808998
1682.9C70725708P3738O047707M716301O682624M483262M200325M666671M908409O193619
1691.5D12698364N043831N387154M737625N006752K009506N673981O569366N244370
1699.3D52370949N674858J710510O588631N502815M743691L649444K991409L030396
1707D86262703L783836M449997K783890L030663L379936K916107K747498R95712J815986
$$ plain form
1651 272815399 275500717 276240788 276094265 275970287 279997730 280900478 283641281 284934101 287020836
1659.7 287020836 289772186 291633739 295186958 296304417 300049114 302123604 305272198 308388538
1667.4 308388538 311276817 315764771 317429008 322425880 325130196 329897118 333854523 337317657
1675.1 337317657 341230698 344196625 349212646 352599068 357342300 361127815 365916710 370725708
1682.9 370725708 370799446 376847153 381563454 388246078 392729340 396929665 401596336 406504745 412698364
1691.5 412698364 417742195 423129349 427866974 432873726 434883232 440557213 447126579 452370949
1699.3 452370949 458045807 459756317 466344948 471847763 476591454 480240898 483232307 486262703
1707 486262703 490046539 494496536 497280426 500311089 503691025 506607132 509354630 510350342 512166328
1715.6E12166328L731995J961861l382759L697700M050865K672577K366677J720809
1723.4E28986053J497879J929474J982193J468010J577912J831703k7008Q69942L785476
1732E43901634L737755j002769k300530M599762L889122K091408K884483R77097k00196
1740.7E58577766M414292L211899J723976K950630M167557L877258K759514L300514
1748.4E84983406K711716M675865K634697J947784N374527M020119L902588L758087
1756.2F14008789J537514K669525L381500K715607L052063M81605J658020L982087
1763.9F33486710K108078J941604K378769J946793q52738K461472L875427m1733j205749
1772.5F46098633m74167M710693K929077L36762K913132J237487J437302L15628o69556
$$ plain form
1715.6 512166328 515898323 517860184 514477425 518175125 522225990 524898567 527265244 528986053
1723.4 528986053 530483932 532413406 534395599 535863609 537441521 539273224 539246216 540116158 543901634
1732 543901634 547639389 546636620 544336090 548935852 552824974 554916382 557800865 558777962 558577766
1740.7 558577766 562992058 566203957 567927933 570878563 575046120 578923378 581682892 584983406
1748.4 584983406 587695122 592370987 595005684 596953468 602327995 606348114 610250702 614008789
1756.2 614008789 615546303 618215828 621597328 624312935 627364998 627846603 629504623 633486710
1763.9 633486710 635594788 637536392 639915161 641861954 641009216 643470688 647346115 647304382 646098633
1772.5 646098633 645624466 650335159 653264236 653600998 656514130 657751617 659188919 659504547 658834991
1781.2F58834991J336289K059021K088013L15094J208038J956406J225433M52270J549912
1789.9F71025467Q76541j14441j445389p3852M312897J674881P2097J785355J946335
1798.6F80059891J87530j086120K225189r2316Q69293K040024J024246J799393P68280
1807.3F87795410M61884P42569J116943j104660L19443J461792M40674J687240Q15354
1815.9F93736649J285629M40750P27158J199951l69187L92380k70309J035156O06613
1824.6F98784790j605530J213608K095947J597748o8588j777878R61227K068406O10
1833.3G03270340J94702O99005R49326Q92715m79812J164398M75464N98144O8665P25403
1842.9G08558350J002960m610672K108612K156143N80673P14417P68738J027298k33231
$$ plain form
1781.2 658834991 660171280 662230301 664318314 664633408 665841446 667797852 669023285 669475555 671025467
1789.9 671025467 671902008 671787567 670342178 670268326 674581223 676256104 676328201 678113556 680059891
1798.6 680059891 680247421 679161301 681386490 681294174 682163467 684203491 685227737 687027130 687795410
1807.3 687795410 688257294 688999863 690116806 689012146 689331589 690793381 691234055 692921295 693736649
1815.9 693736649 695022278 695463028 696190186 697390137 697020950 697413330 697143021 698178177 698784790
1824.6 698784790 697179260 698392868 700488815 702086563 702017975 700240097 701201324 703269730 703270340
1833.3 703270340 703465042 704164047 705113373 706006088 705526276 706690674 707166138 707764282 707832947 708558350
1842.9 708558350 709561310 704950638 707059250 709215393 709796066 710510483 711279221 712306519 712073288
1851.6G12073288N37033k71988Q1024L09220J01394O99768K49710R87320L39508M28238
1861.3G15534515l05709J76773O23321m05807k28577o58569J244888n17578l69263
1869.9G15093994K064438J305847L26996q26416L35464j1825K5177p2022K03705J088791
1879.6G19534149L63312P01141N722M15039m01458l88337K23160n27649R96094k64969
1889.2G20656204o88629J084595J128692L34549J94626k54516j187592M31290m3488
1897.9G21655731M33960N03693L45535N47028k19193Q25043k46887R002K41013k00729
1907.6G23894196j60904o41632P7590R2927J148834L04031L36075M0741n02472Q34503
1917.2G25423889j774750j58920J033249L77045L43780m41284L67889K79313J72576
$$ plain form
1851.6 712073288 712610321 712338333 712419357 712728577 712829971 713529739 713779449 714766769 715106277 715534515
1861.3 715534515 715228806 715405579 716028900 715623093 715394516 714735947 715980835 715463257 715093994
1869.9 715093994 717158432 718464279 718791275 717964859 718300323 718288498 718313675 718241653 718445358 719534149
1879.6 719534149 719897461 720598602 720604324 721019363 720617905 720229568 720452728 719925079 720921173 720656204
1889.2 720656204 719967575 721052170 722180862 722515411 722710037 722455521 721267929 721699219 721655731
1897.9 721655731 722089691 722593384 722938919 723485947 723266754 724091797 723844910 723853912 724094925 723894196
1907.6 723894196 723733292 723091660 723169250 723262177 724411011 724715042 725051117 725091858 724589386 725423889
1917.2 725423889 723649139 723490219 724523468 724900513 725244293 724803009 725170898 725450211 725622787
1925.9G25622787m77905J32446J7472l0976L88413k17896M03214m49600K49328K77863
1935.5G25915146j47324N570l54843L65753m69437L78723n43518j297149Q73184M64554
1945.2G25190659K91214j17035K82058j34048j84555J8692m1123K95182m53492j49154
1954.8G24998398j98517n7678j43967Q850P7057l18909L59269J95770N15594k84576
1964.5G25151291n06058l64761o27976L32184P1564L39126j25656K86637L60794l23334
1974.1G24593811j66016n62667R15m47311M9286N57174o4926m60205l18832O69632
1983.7G23850861O1111P3624l17612n59006m23584j81427P29370k99530o12259p7972
1993.4G22243576M87976J4191j93100J86386o67801k79160j90887K22626j82190k01874
$$ plain form
1925.9 725622787 725144882 725277328 725294800 725263824 725652237 725434341 725837555 725387955 725637283 725915146
1935.5 725915146 725767822 725773392 725418549 725784302 725314865 725693588 725150070 723852921 724726105 725190659
1945.2 725190659 725481873 725364838 725646896 725512848 725328293 725346985 725305862 725601044 725147552 724998398
1954.8 724998398 724799881 724742203 724598236 724607086 724684143 724365234 724724503 724920273 725435867 725151291
1964.5 725151291 724645233 724280472 723652496 723984680 724056244 724395370 724269714 724556351 724917145 724593811
1974.1 724593811 724427795 723865128 723866043 723418732 723468018 724025192 723960266 723500061 723181229 723850861
1983.7 723850861 723911972 723985596 723667984 723108978 722685394 722503967 723233337 722933807 722321548 722243576
1993.4 722243576 722731552 722745743 722552643 722739029 722071228 721792068 721601181 721823807 721641617 721439743
2003G21439743L15476k70691J76544m81568l65982j27868j34964p6752k66418J54342
2012.7G20361862l47061p172M883r2544m28315k65197j1826o11648J73492j08643p324
2023.3G18660507j86691L4256N18188n65338m54101n12390j68152n20020l67889k17972
2032.9G16220398n08270L48739o942L68957L7918j58386k83279m42200m4251o16226
2042.6G14916458j1749j93253L03192L4638n12238L281k31171K85797o76040l87268
2052.2G13531647k2583j69068L7461j98975M08173l94974k7847m2954k98843j15128
2061.9G12706909p2937M75083o25992j34278l0899Q8349L61252j38016O9580o49185
2071.5G12049866J27182L40576j67847n89981p14493K06757M55398K69700n88532j52435
$$ plain form
2003 721439743 721755219 721484528 721661072 721179504 720813522 720685654 720550690 720473938 720207520 720361862
2012.7 720361862 720014801 720007629 720012512 719919968 719491653 719226456 719214630 718602982 718776474 718667831 718660507
2023.3 718660507 718473816 718508072 719026260 718460922 718006821 717494431 717326279 716806259 716438370 716220398
2032.9 716220398 715712128 716060867 716053925 716422882 716460800 716302414 716019135 715576935 715532684 714916458
2042.6 714916458 714904709 714711456 715014648 715049286 714537048 714540329 714309158 714594955 713918915 713531647
2052.2 713531647 713509064 713339996 713377457 713178482 713586655 713191681 713163834 713120880 712822037 712706909
2061.9 712706909 712633972 713109055 712483063 712348785 712317886 712406235 712767487 712629471 712699051 712049866
2071.5 712049866 712177048 712517624 712349777 711759796 711045303 711252060 711707458 711977158 711388626 711236191
2081.1G11236191l3112l12881j82572K4262K27356n80750P3242J61896r2926m38995
2090.8G10081711n09415J36795k55203j2131k63214j89590l87650P7744L06778p10068
2100.4G08275757J37558Q0185k24839p07397k42386K74429j33514K09122n11704j47323
2110.1G07009888l90778k44064P5760k86713L75061m1351j30158o03256l4943L02201
2119.7G06031647r0943L4943k61307K73056m08859k89001m14811l44696L23334l7003
2129.4G04816360L26462n75638l86200j28555l5782L16544o714K45056J0681M88129
2139G05070343L5706j9150k14768n03158j27564m90799M20075N2948K27737K28195
2148.6G04679565r4833J63193k28348L32718l36456J48086l2577j25199M42124m77219
$$ plain form
2081.1 711236191 711203079 710890198 710707626 710731888 710959244 710378494 710451736 710613632 710520706 710081711
2090.8 710081711 709572296 709709091 709453888 709441757 709178543 708988953 708601303 708679047 708985825 708275757
2100.4 708275757 708413315 708493500 708268661 707561264 707318878 707593307 707459793 707668915 707157211 707009888
2110.1 707009888 706619110 706375046 706450806 706164093 706539154 706497803 706367645 705764389 705729446 706031647
2119.7 706031647 705940704 705975647 705714340 705987396 705578537 705289536 704874725 704530029 704853363 704816360
2129.4 704816360 705142822 704567184 704180984 704052429 704016647 704333191 704326477 704571533 704582214 705070343
2139 705070343 705106049 705086899 704872131 704368973 704241409 703750610 704170685 704223633 704451370 704679565
2148.6 704679565 704584732 704747925 704519577 704852295 704515839 704663925 704631348 704506149 704948273 704471054
2158.3G04471054Q8654k36588J46103K03552M2038J22681o00662j22528o5766O45142
2167.9G04693680P3471J1673L67660m61425M5776m3106O027j19553K86103K36587Q6975
2178.5G05183868K08512k60315M87060r0179J89896J73111m24729L13797K09427K9907
2188.2G06020355n91812j02692K29798J31531J42593J22299L73078k62223p1945j37176
2197.8G05853806J58386m3717l05862M49600K53678n2872n97305L70635N35965j0681
2207.5G06611633P3624k39868K56271M3640K7161l50952o6223K91977L9215L64532
2217.1G07051010r0866K26746j35575k55203j77917p2403M15039K6550K37503k00119
2226.8G07024765K6703j37634k11029J65634o9733L70941j56708n5313m22668j76010
$$ plain form
2158.3 704471054 704559708 704323120 704469223 704672775 704714813 704837494 704236832 704114304 704048538 704693680
2167.9 704693680 704767151 704778824 705146484 704685059 704730835 704687729 704693756 704574203 704860306 705096893 705183868
2178.5 705183868 705392380 705132065 705619125 705528946 705718842 705891953 705467224 705781021 705990448 706020355
2188.2 706020355 705428543 705325851 705555649 705687180 705829773 705952072 706325150 706062927 705990982 705853806
2197.8 705853806 706012192 705968475 705662613 706112213 706365891 706313019 705715714 706086349 706622314 706611633
2207.5 706611633 706685257 706445389 706701660 706745300 706772461 706421509 706355286 706647263 706686478 707051010
2217.1 707051010 706960144 707186890 707051315 706796112 706618195 706545792 706960831 706987381 707224884 707024765
2226.8 707024765 707051468 706913834 706702805 706868439 706798706 707169647 707012939 706957626 706534958 706358948
2236.4G06358948J74637J7547O06690k70081N4627k95411j85241K80075m59824k16827
2246G06065140k82746M93241L38287K03171N3635j34049Q0338n51377J03379j78528
2255.7G06190491k36969l49503k76260N28641K68173K54135j15738R6359m10232k21634
2265.3G05727463O5918k32468J66931m90799J36872J55563L14026K85339l18680j39846
2275G05670319o59333o3400l27301j06125M1046j15814M97284K13699K02484k50396
2284.6G05102463m6540o52618m14734N8441p17239n6763l5858K78626n43747q6823
2294.3G02885208O11496n16357l46680o78711j94626p04651o09817j03989K7390L93295
2303.9G00762558o78635j63879q24890l94287j91498j117020n11322o90231L26462
$$ plain form
2236.4 706358948 706533585 706551132 707157822 706887741 706942368 706646957 706461716 706741791 706281967 706065140
2246 706065140 705782394 706275635 706613922 706817093 706870728 706736679 706817017 706265640 706369019 706190491
2255.7 706190491 705953522 705604019 705327759 705856400 706124573 706378708 706262970 706359329 705949097 705727463
2265.3 705727463 705793381 705560913 705727844 705237045 705373917 705529480 705843506 706128845 705810165 705670319
2275 705670319 705010986 704947586 704620285 704514160 704555206 704439392 704936676 705150375 705352859 705102463
2284.6 705102463 705055923 704403305 703988571 704047012 703329773 703273010 703237152 703515778 702972031 702885208
2294.3 702885208 703496704 702980347 702633667 701954956 701760330 701055679 700445862 700341873 700369263 700762558
2303.9 700762558 700083923 699920044 699095154 698700867 698509369 697392349 696881027 696190796 696517258
2312.6F96517258o86341n92041m7836k41470J49383j118316p47834r66110o13479o19050
2322.2F91034164K26365J32675j486435o14624j356812K80304j02615n25818k67029
2330.9F87320175j033706K05764j434097k518K11029o74820k72903N59616O37589j355591
2340.6F84160538R2087q73185p06711l3645O91986J551742J381226K565003Q57238
2349.2F89686279m13894j846009k229080j721802k199478r34601k007446j362305k76870
2357.9F76694794L78112q37783l14179J389160n60226R72366j373O9504P1182O04935
2367.6F78466492Q09326k03781J935653R03855J035538M98352j32218N02472M22974
2376.2F84238663J074447M85764P74002R31168R85565O98318R4834K11258O1721N3177
$$ plain form
2312.6 696517258 695830917 695238876 695191040 694949570 695098953 693980637 693232803 692266693 691653214 691034164
2322.2 691034164 691260529 691393204 689906769 689292145 687935333 688215637 688113022 687587204 687320175
2330.9 687320175 686286469 686492233 685058136 685055618 685266647 684591827 684318924 684878540 685516129 684160538
2340.6 684160538 684252625 683379440 682672729 682639084 683331070 684882812 686264038 688829041 689686279
2349.2 689686279 689272385 687426376 685197296 683475494 681276016 680341415 678333969 676971664 676694794
2357.9 676694794 677072906 676235123 675920944 677310104 676749878 677722244 677720871 677790375 677861557 678466492
2367.6 678466492 679275818 679072037 681007690 681911545 682947083 683445435 683313217 683815689 684238663
2376.2 684238663 685313110 685798874 686572876 687504044 688489609 689187927 689282761 689494019 689555740 689608917
2385.9F89608917m35943o7673j84479m15497j4801k365J89591n28031j60827L5476
2395.5F88024368m39605p18689o39725N3329k12860l2806k01798r2239j39694o49414
2405.2F84950867n70984n32456o5612n75791l95279k97928k34756K20032k91443k09732
2414.8F81996918m59290k07367m90875m78897Q3847n24979p49511q03299j04065q7815
2424.5F78174667j77536o8817j30157j75400n81207k91291q13980l75900l03268o03943
2434.1F74653168l891m11225j47781p6904o6986p14951p74078l55378p82241r6588
2443.7F71223145p8278j77460l51105j33132l80021o74133q2703q74786n00793l24097
2453.4F67646637m48837n27726n65032L15170q5373n02777q75168k60925k03095o89621
$$ plain form
2385.9 689608917 689172974 689105301 688920822 688505325 688490524 688488159 688677750 688149719 687988892 688024368
2395.5 688024368 687584763 686866074 686226349 686279678 686066818 686034012 685832214 685739975 685600281 684950867
2405.2 684950867 684379883 683847427 683781815 683206024 682810745 682512817 682278061 682498093 682206650 681996918
2414.8 681996918 681537628 681330261 680839386 680360489 680444336 679919357 679169846 678366547 678262482 678174667
2424.5 678174667 677997131 677928314 677798157 677622757 677041550 676750259 675936279 675560379 675257111 674653168
2434.1 674653168 674649277 674238052 674090271 674013367 673946381 673231430 672457352 672101974 671319733 671223145
2443.7 671223145 671144867 670967407 670616302 670483170 670103149 669429016 669346313 668471527 667970734 667646637
2453.4 667646637 667197800 666670074 666105042 666420212 666334839 665832062 664956894 664695969 664492874 663803253
2463F63803253l86810p70493k92129l73841l83605j87989k07367j72882o21109o40335
2472.7F59766693r06067o65588n32684l92304l44162j90430j47171n77926j16654o05697
2482.3F55288010o32935p70569p50351p248k40249k79770o21185j74866o50788r25140
2492F50234909n50613p76368k17208n77393k27890m79736n50614l08761o96030j33362
2501.6F45716934n61600l89099r17358q22372M119m92935n16052q10928k62680k21329
2511.2F40726700k64435m32205p94144l99208o74095l89748m87861n04265o80161l45306
2520.9F35755272N4626n90477l25012n26504m28276q56667q41751l85742m76570J61628
2530.5F31540527k64434j05629m88587r28917o78139n02471j8807o95877l80287l16620
$$ plain form
2463 663803253 663416443 662645950 662353821 661979980 661596375 661408386 661201019 661028137 660407028 659766693
2472.7 659766693 658860626 658195038 657662354 657270050 656925888 656735458 656588287 656010361 655893707 655288010
2482.3 655288010 654655075 653884506 653134155 653126907 652886658 652606888 651985703 651810837 651160049 650234909
2492 650234909 649684296 648907928 648690720 648113327 647885437 647405701 646855087 646546326 645850296 645716934
2501.6 645716934 645155334 644766235 643848877 643026505 643030624 642537689 642021637 641210709 640948029 640726700
2511.2 640726700 640462265 640030060 639235916 638836708 638162613 637772865 637285004 636780739 636100578 635755272
2520.9 635755272 635809898 635219421 634894409 634367905 633939629 633082962 632241211 631855469 631378899 631540527
2530.5 631540527 631276093 631170464 630681877 629752960 629074821 628572350 628553543 627857666 627477379 627160759
2540.2F27160759k12402J64985l08380m76379r84955o17371m08096n24330n25742l86657
2549.8F22881432k55204m92668l83148m61807j27831o39229q09059k58789k54936l38173
2559.5F18860588o72340k20833m45213l18337l3455l57399n93567r87014k07329l16010
2569.1F14709091o02913l93867k08016k08053o32401l19252p10106p15332l46794p3547
2578.7F10498810l82881p77169k3346n22880p13501k48451p8278k35100n14717n60264
2588.4F06442223p38831l27301m84161n55573m47883j36300l07350r29222m41475p24830
2598F01349297n90706l71743l72772n02128q50449l43437o15845m93927m27742m80232
2607.7E96300316l01132n45807p02973n66139j89133r33914o25190m52042q60787l71322
$$ plain form
2540.2 627160759 626948357 627113342 626804962 626328583 625343628 624726257 624318161 623793831 623268089 622881432
2549.8 622881432 622626228 622133560 621750412 621288605 621160774 620521545 619712486 619453697 619198761 618860588
2559.5 618860588 618188248 617967415 617522202 617203865 617170410 616813011 616219444 615232430 615025101 614709091
2569.1 614709091 614106178 613712311 613504295 613296242 612663841 612344589 611634483 610919151 610572357 610498810
2578.7 610498810 610115929 609338760 609315414 608792534 608079033 607830582 607752304 607517204 607002487 606442223
2588.4 606442223 605703392 605376091 604891930 604336357 603888474 603752174 603444824 602515602 602074127 601349297
2598 601349297 600758591 600386848 600014076 599511948 598661499 598318062 597702217 597208290 596780548 596300316
2607.7 596300316 595999184 595453377 594750404 594184265 593995132 593061218 592436028 591983986 591123199 590751877
2617.3E90751877m45519k41279n25475n75065o71540n78232l00102o93359m44718o15539
2627E85661049n68390p61795o71005l07198j80435k75192j143303o20880n53780m46587
2636.6E80132484l69186n00832j40419r30557n82695n03616o01235n92422n28908q4877
2646.3E75297737p95898m81377l90320n09071o12221o20918k38228p02248m99611n30548
2655.9E69917297m65812n43709n69229k79885n35392k71340l59688l61518m16375l50074
2665.5E65764275m56276o93131m33197n83458k43912k30598k59247k46010m74624p26280
2675.2E61417542m81453J33743m20952l44238m64592n59426o43959q13179j36718m05503
2684.8E57281265R1820j86539q11157n86929o32286j67008m94003m50935m54178l54500
$$ plain form
2617.3 590751877 590306358 590065079 589539604 588964539 588292999 587714767 587414665 586721306 586276588 585661049
2627 585661049 585092659 584330864 583659859 583352661 583172226 582897034 581753731 581132851 580579071 580132484
2636.6 580132484 579763298 579262466 579122047 578191490 577608795 577105179 576503944 575911522 575382614 575297737
2646.3 575297737 574501839 574020462 573630142 573121071 572508850 571887932 571649704 570947456 570447845 569917297
2655.9 569917297 569451485 568907776 568338547 568058662 567523270 567251930 566892242 566530724 566114349 565764275
2665.5 565764275 565307999 564614868 564181671 563598213 563354301 563123703 562864456 562618446 562143822 561417542
2675.2 561417542 560936089 561069832 560648880 560304642 559840050 559280624 558636665 557823486 557686768 557281265
2684.8 557281265 557373085 557186546 556375389 555788460 555156174 554989166 554495163 554044228 553590050 553235550
2694.5E53235550q3199k56195j71928l58505k73781q32939o53115j43699l60031n86052
2704.1E49516106o51970L1395k43950k86408n12504p86438k19536k08321r6702n27306
2713.8E46014366n34897j12724L777l39165o87523l71742k89460j78909n19791m48379
2723.4E42535553l65143j13296r461p23991k08168k42424m72031l69682r3994J21994
2733E40059357n02281l52860m18053n72738k20337K32048l34931o02684K79847K0637
2742.7E37588005o6643m22935m55971j39465m03862l26081l94210k17362n89867l63845
2752.3E34207764k9717k98958k08625k39830j07880m24385k63901o57310o64902K33040
2762E31545296j87493l27034m56390l62740j70440l22953m83512m33121j43509n47752
$$ plain form
2694.5 553235550 553152351 552896156 552724228 552365723 552091942 551259003 550605888 550462189 550102158 549516106
2704.1 549516106 548864136 548895531 548651581 548365173 547852669 547066231 546846695 546638374 546541672 546014366
2713.8 546014366 545479469 545366745 545370522 545031357 544343834 543972092 543682632 543503723 542983932 542535553
2723.4 542535553 542170410 542057114 542047653 541323662 541115494 540873070 540401039 540031357 539937363 540059357
2733 540059357 539557076 539204216 538786163 538213425 537993088 538225136 537890205 537287521 537567368 537588005
2742.7 537588005 537521362 537098427 536642456 536502991 536099129 535773048 535378838 535161476 534571609 534207764
2752.3 534207764 534178047 533879089 533670464 533430634 533322754 532898369 532634468 531977158 531312256 531545296
2762 531545296 531357803 531030769 530574379 530211639 530041199 529718246 529234734 528801613 528658104 528110352
2771.6E28110352m36554j33133j82419p37343p24983p4501k23084l08037n50384m48265
2781.3E24291649r79424r73625Q316l60451m61235l25126k48337n36385o24733l71666
2790.9E19418983n22842o58188q24203k08359n06020r28077l28370k55508j064110
2799.6E14123306j408310k40974l24555q37211r58748j032944r23118j050644j54648
2808.3E07192154r575n78918j063385q51593m52538r49249o33431p46879r21822n48210
2817.9E00436554m12941r87244j582336p86438n49774j045532j221467p33757o85081
2826.6D92431984j070557j010627j188469p82700q23250j085357r74617j195412j066208
2835.3D83234787r49173j167145j255951j001930j236076j750641k108574j874237
$$ plain form
2771.6 528110352 527673798 527540665 527358246 526620903 525895920 525821419 525598335 525290298 524739914 524291649
2781.3 524291649 523312225 522338600 522346916 521986465 521525230 521200104 520951767 520415382 519790649 519418983
2790.9 519418983 518896141 518237953 517413750 517205391 516699371 515771294 515442924 515187416 514123306
2799.6 514123306 512714996 512474022 512149467 511312256 510353508 509320564 508397446 507346802 507192154
2808.3 507192154 507182579 506603661 505540276 504688683 504236145 503286896 502653465 501906586 500984764 500436554
2817.9 500436554 500023613 499036369 497454033 496667595 496117821 495072289 493850822 493117065 492431984
2826.6 492431984 491361427 490350800 489162331 488379631 487556381 486471024 485496407 484300995 483234787
2835.3 483234787 482285614 481118469 479862518 478860588 477624512 475873871 473765297 471891060
2843D71891060j977272k524796j938286k100524k648697k633591j966171j518135j755906
2851.7D52827682r59358p73735p68623n25932j94779n6877l71552j106k82898O3858
2861.3D48956680J74065n08652p53860j276703r34105l79868l65181j220932j481323
2870D42210121o32057n84717r12247r14726p12356p09916n89294j216583r29947K11220
2879.6D35219498m39759j087532j124992p20100q37822q32940n09300j076011j460610
2888.3D27130432j587677p59392p81669j128464p64503r97849p87163r71718r37690
2897D18414307q24204j140747j167717p63893l64609n23262m58946q89092p84683p44400
2906.6D10752754j096267r67408j130295q49380j245689j410294j544495j761283j258164
$$ plain form
2843 471891060 469913788 467388992 465450706 463350182 460701485 458067894 456101723 454583588 452827682
2851.7 452827682 451868324 451094589 450325966 449800034 449605255 449548378 449176826 449175720 448892822 448956680
2861.3 448956680 449130745 448622093 447868233 446591530 445657425 445277557 444912376 443691444 442210121
2870 442210121 441578064 440993347 440081100 439166374 438454018 437744102 437154808 435938225 435008278 435219498
2879.6 435219498 434779739 433692207 432567215 431847115 431009293 430176353 429667053 428591042 427130432
2888.3 427130432 425542755 424783363 424001694 422873230 422108727 421110878 420323715 419351997 418414307
2897 418414307 417590103 416449356 415281639 414517746 414153137 413629875 413170929 412281837 411497154 410752754
2906.6 410752754 409656487 408689079 407558784 406709404 405463715 404053421 402508926 400747643 399489479
2915.3C99489479j418953j491775j644326j301002j354675j437607o78787o75698o50329
2924C88836327o50978m02527m84772k19612N45578L01513l2577J00899L40728K68975
2933.6C88603554P28950M82178N91316J051064K24838N39894Q32558Q17032N62591
2942.3C94433975N41191Q62961N41840R63592Q95500O40221J06087L54004J338424
2951D00677795P84150L99551Q3199L0937j1597L23334O91643N39703J021805O50634
2960.6D05191154M63639O89850Q76999P45353N14984Q95577P75375R45168P82623O43196
2970.3D12523918Q64563O56014L85360N43557J033248P39098P06215N75142N87921
2979D18615036N60989J17417M24232K63787M20684L22457J11999K83928P6294L48244
$$ plain form
2915.3 399489479 398070526 396578751 394934425 393633423 392278748 390841141 390162354 389486656 388836327
2924 388836327 388185349 387782822 387298050 387078438 387624016 387925529 387892952 387993851 388334579 388603554
2933.6 388603554 389332504 389814682 390405998 391457062 391681900 392221794 393054352 393871384 394433975
2942.3 394433975 394975166 395838127 396379967 397343559 398239059 398879280 398985367 399339371 400677795
2951 400677795 401461945 401861496 401944695 401975632 401964035 402287369 402979012 403518715 404540520 405191154
2960.6 405191154 405654793 406344643 407221642 407966995 408481979 409377556 410152931 411098099 411880722 412523918
2970.3 412523918 413388481 414044495 414429855 414973412 416006660 416745758 417451973 418027115 418615036
2979 418615036 419176025 419293442 419717674 419981461 420402145 420724602 420836601 421120529 421196823 421545067
2988.6D21545067J87416L63579L52020j76926Q7281j60904p99218l82957N5199l15934
2998.2D20754623k26745l34168l01132l47252r03015o50139m31289j52817k63329n77392
3007.9D16567345p23076n91545k12746p34291o17828m41132p03087q86001r08814n67398
3017.5D10181427q43887o29731m08515p51305q91762q84781o41479m99573p64694j149140
3027.2D02716560j024894q43392m74472l93638m12369m44489j201324j310883j168823
3035.9C95442276m52080l96309j498298j114006o74630o06079m00200q32710j269073
3044.5C88198891r25484q19473j067124p15713q18024r84955p54547o81228r82781
3053.2C80449562j157532r35173p16247o57349r81598n52635p80106j376113q30956
$$ plain form
2988.6 421545067 421732483 422096062 422448082 422271156 422358437 422197533 421398315 421015358 421070557 420754623
2998.2 420754623 420527878 420193710 419892578 419545326 418642311 417992172 417560883 417408066 417144737 416567345
3007.9 416567345 415844269 415252724 415039978 414305687 413687859 413246727 412543640 411657639 410748825 410181427
3017.5 410181427 409337540 408707809 408299294 407547989 406656227 405771446 405129967 404630394 403865700 402716560
3027.2 402716560 401691666 400848274 400373802 399980164 399567795 399123306 397921982 396611099 395442276
3035.9 395442276 394990196 394593887 393095589 391981583 391306953 390700874 390300674 389467964 388198891
3044.5 388198891 387273407 386453934 385386810 384671097 383853073 382868118 382113571 381432343 380449562
3053.2 380449562 379292030 378356857 377640610 376983261 376001663 375449028 374668922 373292809 372461853
3061.9C72461853o41785m66575o63147q87337q31833o13022n90782j201706r34257
3070.6C65631409n24292n26352o87142o79283p10449o72455p38640j159019l28980
3079.2C59604797l81126q65707o62728n18112j54877j003074j229897q42628p89338
3087.9C53157310o88095n94673l78265q74519j021424p82928l51563o09627j016235
3096.6C46839981m64096k76871j50413q62541j197701r09309r07593r03473r75075
3105.3C40192909k18429n40848r08890m56657o99883p39746q46863q45718o89278q30993
3114.9C33415604j060601o45561l45192o19125p65000q87451n46455p06062r40972
3123.6C26899185p69005r60617p94563n02167o55136o87942m44451r45663j031456
$$ plain form
3061.9 372461853 371820068 371353493 370690346 369803009 368971176 368358154 367767372 366565666 365631409
3070.6 365631409 365107117 364580765 363893623 363214340 362503891 361831436 361092796 359933777 359604797
3079.2 359604797 359223671 358357964 357695236 357177124 357022247 356019173 354789276 353946648 353157310
3087.9 353157310 352469215 351874542 351496277 350621758 349600334 348817406 348465843 347856216 346839981
3096.6 346839981 346375885 346099014 345948601 345086060 343888359 342979050 342071457 341167984 340192909
3105.3 340192909 339974480 339433632 338524742 338068085 337368202 336628456 335781593 334935875 334246597 333415604
3114.9 333415604 332355003 331709442 331364250 330745125 329980125 329092674 328546219 327840157 326899185
3123.6 326899185 326130180 325169563 324375000 323872833 323217697 322529755 322085304 321139641 320108185
3132.3C20108185r83734j226521r21249p67613j43680l35961n84774p89032j335792
3141C13019829p43180r53521q53806o51188q55694p21015j074238o40259j86653j79081
3150.6C06161194q16784j466847q65154n61523r34963q61817n35240q36906r04980
3159.3B98376980q31814n80139l65906p55634r95922j162854o05392m37012p03907
3168B91938400q85162r95026n33447p48157m12407l22342r36280q93192q87813o97022
3177.6B84627552q79078j122417p85141m71344q91743q98781o21433p40109j77154
3186.3B78040352n14431q97389q82568o74362m83017j243343q64621o18915n51167
3195B71310539k91004o44779o89335q05702m27227n11704p98740o65035o70300o33201
$$ plain form
3132.3 320108185 319124451 317897930 316976681 316209068 316065388 315729427 315144653 314355621 313019829
3141 313019829 312276649 311323128 310469322 309818134 308962440 308241425 307167187 306526928 306340275 306161194
3150.6 306161194 305344410 303877563 303012409 302450886 301515923 300654106 300118866 299281960 298376980
3159.3 298376980 297545166 296965027 296599121 295843487 294847565 293684711 293079319 292642307 291938400
3168 291938400 291053238 290058212 289524765 288776608 288364201 288041859 287105579 286212387 285324574 284627552
3177.6 284627552 283748474 282626057 281840916 281369572 280477829 279579048 278957615 278217506 278040352
3186.3 278040352 277525921 276628532 275745964 275071602 274588585 273345242 272480621 271861706 271310539
3195 271310539 271019535 270374756 269685421 268879719 268452492 267940788 267142048 266477013 265806713 265173512
3204.6B65173512p39022m04758l26691n81112r28345r01126n38559k98424P1049p01847
3214.3B59824677j087151m99649n51930p70568n33009j88084n15155p84741o82735
3222.9B54211655m42200n94902r01737q46443o15960k02655l32814k53486k19708m82979
3232.6B49318771n23033r46541j192741r03683j40590j09978l61252j63746o23970
3241.3B44353237q03776l46183j35537o30245q41503m57287l94764l75252l11641l74928
3250.9B39682121n44738l51582m32262p59907m22802m61502q27046l25508N4684o74515
3260.5B34936943o89831j50680j97354m15249n81264m70257p28435m90780k3327J4477
3270.2B31204243K60563k04640r17473r39541k19268k72847p63397P5073M51451m16470
$$ plain form
3204.6 265173512 264434490 264029732 263703041 263121929 262193584 261292458 260753899 260455475 260526524 259824677
3214.3 259824677 258737526 258237877 257685947 256915379 256382370 256194286 255679131 254894390 254211655
3222.9 254211655 253769455 253174553 252272816 251426373 250810413 250607758 250274944 250021458 249801750 249318771
3232.6 249318771 248795738 247849197 246656456 245752773 245612183 245502205 245140953 244977207 244353237
3241.3 244353237 243549461 243203278 243067741 242437496 241595993 241138706 240743942 240368690 240057049 239682121
3250.9 239682121 239137383 238785801 238353539 237593632 237170830 236709328 235882282 235556774 235611458 234936943
3260.5 234936943 234247112 234096432 233899078 233483829 232902565 232432308 231703873 231213093 231189766 231204243
3270.2 231204243 231464806 231260166 230342693 229403152 229183884 228911037 228147640 228222713 228674164 228257694
3279.8B28257694p80639m97818n41020J6518m2515p90157l26653j26552k21463o02398
3289.5B24344997n93795p1659o2218Q5754n23433o23665k07901n84431l52898O6719
3299.1B21477470k42309m44107L3607k67791j021195o47182N8803K83566j8750n47294
3308.8B18664818l99075k03876q54111l86696K30160l25222m19998k97604l44219o64024
3318.4B15000153n36919m19617k39258M2763l58581r5578n78632p36809k60257r25427
3328.1B10891838n93662j24703k82840p53079j060047n55344k26802m06208m07467
3336.7B06481686q6747o69345p10106k88105n94540m70257L63k1038r04942o73351
3346.4B02063618k34318l05500K04201l87001r45187o26259M1847K34261k16961k51465
$$ plain form
3279.8 228257694 227477055 226979237 226438217 226454735 226412220 225622063 225295410 225168858 224947395 224344997
3289.5 224344997 223751202 223679543 223617325 223703079 223179646 222555981 222348080 221763649 221410751 221477470
3299.1 221477470 221235161 220791054 220824661 220556870 219535675 218888493 218947296 219230862 219212112 218664818
3308.8 218664818 218265743 218061867 217207756 216821060 217051220 216725998 216306000 216008396 215664177 215000153
3318.4 215000153 214463234 214043617 213804359 213847122 213488541 213392963 212814331 212077522 211817265 210891838
3328.1 210891838 210298176 210173473 209890633 209137554 208077507 207522163 207295361 206889153 206481686
3336.7 206481686 206394939 205725594 205015488 204727383 204132843 203662586 203662949 203641911 202736969 202063618
3346.4 202063618 201829300 201523800 201728001 201341000 200395813 199769554 199811401 200045662 199828701 199577236
3356A99577236j37939q8749k06108l357l00942j13220K65617q38813o16989q9264r5711
3366.6A97351761J50566m86336o55842j47018k06451l29304L08685K78454l89900l23086
3376.3A95551529k38323m62666l97129J65997K90546o2427k62280K2030Q0967j68915
3385.9A94519329M16870L45612j70040l22876k82975J69869j61572m23164j57051k32735
3395.6A93701267J0662K55757p7668M0761K38742k63080q6327P1392n73749n85995
3405.2A92731762L22990P11480J94149O4010q3484m8810J46008N6381J54515o8474
3414.8A94180527J84478O93188L87821M1733J39580L05710M80785N24388N7640j76087
3424.5A96819763J03340N46379M16260O8684J98269l2120J15814L66783Q1120J42269
$$ plain form
3356 199577236 199439297 199350548 199144440 199141083 198840141 198726921 198992538 198153725 197536736 197447472 197351761
3366.6 197351761 197502327 197015991 196360149 196213131 196006680 195677376 195986061 196264515 195874615 195551529
3376.3 195551529 195313206 194850540 194453411 194619408 194909954 194847527 194585247 194607277 194688244 194519329
3385.9 194519329 194936199 195281811 195111771 194788895 194505920 194675789 194514217 194091053 193934002 193701267
3395.6 193701267 193711929 193967686 193890018 193930779 194169521 193906441 193820114 193891506 193317757 192731762
3405.2 192731762 193054752 193766232 193960381 194024391 193940907 193892097 194038105 194094486 194249001 194180527
3414.8 194180527 194365005 195058193 195446014 195487747 195627327 195933037 196413822 196938210 196995850 196819763
3424.5 196819763 196923103 197469482 197885742 197954426 198152695 198120575 198236389 198603172 198684292 198826561
3434.1A98826561M38099O70357L67527K91385O27728K61154L59726N80482j75285L9692
3443.8B02287426L17078L96080J108951O68869K16789K13261N59845P67117J55220
3452.5B06690636N89771Q38394P45468M68350J15184L94269M22515Q82397Q66528N53074
3462.1B12566586N06782N08347O02054N25341O03314K84691Q32176Q33034L5076K54422
3471.7B17551823O93645J341591P80010K24133M20227N57632J050988J189994J153927
3480.4B24963970N51033M75979Q39653Q94585N93967L75710R04255O35242O31142N27878
3490.1B31393414O59084J250553J041603J290627P89623L88718R27371R39007O16494
3498.7B39296494Q92009J210137O72416R02577Q74862O19393O17638M65068J140595
$$ plain form
3434.1 198826561 199264660 199935017 200302544 200593929 201221657 201482811 201842537 202423019 202247734 202287426
3443.8 202287426 202604504 203000584 204109535 204778404 204995193 205208454 205768299 206535416 206690636
3452.5 206690636 207280407 208118801 208864269 209332619 209447803 209842072 210264587 211146984 212013512 212566586
3462.1 212566586 213073368 213581715 214183769 214709110 215312424 215597115 216429291 217262325 217297401 217551823
3471.7 217551823 218245468 219587059 220367069 220591202 221011429 221569061 222620049 223810043 224963970
3480.4 224963970 225515003 225990982 226830635 227725220 228319187 228694897 229599152 230234394 230865536 231393414
3490.1 231393414 232052498 233303051 234344654 235635281 236424904 236813622 237740993 238680000 239296494
3498.7 239296494 240188503 241398640 242071056 242973633 243848495 244467888 245085526 245550594 246691189
3507.4B46691189J497440J255493Q06122J132546J061191N68886O81686P19033J160183
3516.1B55573769J229057J284923J120205N85766P18956J106587J249923O24409R55086
3524.8B64448681J621246J503105J013699O72359J011754J346149Q97541O59657J537876
3533.5B74712067J802063J886539O77643N2872J978550J914520J405296O92253O67877
3542.1B85789680J365567J460590J507797R53923J806469J144809J383763J711273
3549.9B97123871J314659K066460Q89206J812362J706143J588993K042923O75354J742038
3558.5C10962009K065354J487465P11479K069759J901188P43981L825779J795082L99246
3567.2C25961342J073685J360282L334618J427765J615143K016830J963692J820755
$$ plain form
3507.4 246691189 248188629 249444122 250250244 251382790 252443981 253012867 253694553 254413586 255573769
3516.1 255573769 256802826 258087749 259207954 259793720 260512676 261619263 262869186 263493595 264448681
3524.8 264448681 266069927 267573032 268586731 269259090 270270844 271616993 272514534 273174191 274712067
3533.5 274712067 276514130 278400669 279078312 279131184 281109734 283024254 284429550 285121803 285789680
3542.1 285789680 287155247 288615837 290123634 291077557 292884026 294028835 295412598 297123871
3549.9 297123871 298438530 300504990 301394196 303206558 304912701 306501694 308544617 309219971 310962009
3558.5 310962009 313027363 314514828 315226307 317296066 319197254 319941235 323767014 325562096 325961342
3567.2 325961342 327035027 328395309 331729927 333157692 334772835 336789665 338753357 340574112
3574.9C40574112K002335K321357J138077K408943J744309J791649K410774J919861
3582.6C56311417K117805J288567L372764J823845k04277K646179J269455K861672
3590.4C71487427K771759K930603K247352J400414L114777R99107L058510L770828
3598.1C91780777J328392K808113J485710J357079L295669K635270K254791L529815
3605.8D10475616L412476J68228K895203J245308J185875O893921K697448o027L446312
3614.5D32414360J143990M443626L836555P10907K445603K077675K250175L311501
3622.2D52634392L748550K913475K981949K817307L202934N944023P80602m459954
3629.9D70563278M511414N251922N811310K999420K87056L443947M283600L130646
$$ plain form
3574.9 340574112 342576447 344897804 346035881 348444824 350189133 351980782 354391556 356311417
3582.6 356311417 358429222 359717789 363090553 364914398 364710121 367356300 368625755 371487427
3590.4 371487427 374259186 377189789 379437141 380837555 383952332 384951439 388009949 391780777
3598.1 391780777 393109169 395917282 397402992 398760071 402055740 404691010 406945801 410475616
3605.8 410475616 413888092 414056320 416951523 418196831 419382706 426276627 428974075 428968048 432414360
3614.5 432414360 433558350 438001976 441838531 442549438 444995041 447072716 449322891 452634392
3622.2 452634392 456382942 459296417 462278366 465095673 468298607 474242630 475023232 470563278
3629.9 470563278 475074692 480326614 486137924 489137344 489424400 492868347 497151947 500282593
3637.6E00282593K081413K874680L161392K795677K167130J794853L591804M660759
3645.3E23410301N308457Q21952p55653N233650J503639j12190J455727N680733M981460
3654E47528076M367485N956078m528542K058258O196442K907333K314759R17892K497978
3662.7E70215759J915627K475891K010345R12285N296173K348595m51393J882515l524742
3671.4E83081055L692169Q396988Q387527j303634j3643799K920685P903976M933968
3679.1F04368935j770668J219520L045235K300033K182236J205902J169129L903656
3686.8F17623978O209640p900734k962951Q283157m243202j57929N135117J331177
3694.5F23318253J497383R7236O68869J914711Q0529K201843K591438m243507j208916
$$ plain form
3637.6 500282593 502364006 505238686 508400078 511195755 513362885 515157738 518749542 523410301
3645.3 523410301 528718758 529540710 528785057 534018707 535522346 535410156 536865883 542546616 547528076
3654 547528076 551895561 557851639 553323097 555381355 561577797 564485130 566799889 567717781 570215759
3662.7 570215759 572131386 574607277 576617622 577529907 582826080 585174675 584723282 586605797 583081055
3671.4 583081055 586773224 595170212 603557739 602254105 588610306 591530991 599434967 604368935
3679.1 604368935 602598267 603817787 606863022 609163055 611345291 612551193 613720322 617623978
3686.8 617623978 623833618 615932884 612969933 621253090 617009888 616851959 621987076 623318253
3694.5 623318253 624815636 624912872 625581741 627496452 627576981 629778824 632370262 628126755 626917839
3703.2F26917839M607315K259407R90830Q51745K172432L402367o368218L102227N889282
3711.9F43825226j0886345K934532M068108L05595P92618K157669K054138k099686
3719.6F43151855J172181M731445m470596m215546N218811J983490n33447k678452
3727.3F44359741Q4915L781205J335220N191269j390076p331924O427765j437226q583603
3736F42437286J491928K873154K113190L550644L220138l259430K819977J1177521
3743.7F66424408q600616j6333085Q360291N686035O047592l816223r230194J0430374
3751.4F58968582m405060o792068O007461N276261L187713n161132J649017M821320
3759.1F63552094n915452n02700M315414J298523p1640K486801k727432l513184K854615
$$ plain form
3703.2 626917839 631525154 633784561 634775391 635627136 637799568 641201935 634833717 637935944 643825226
3711.9 643825226 632938881 635873413 639941521 640247116 641039734 643197403 645251541 643151855
3719.6 643151855 644324036 649055481 644584885 640369339 645588150 647571640 647038193 644359741
3727.3 644359741 644444656 648225861 649561081 654752350 653362274 646030350 652458115 651020889 642437286
3736 642437286 643929214 646802368 648915558 652466202 655686340 652426910 655246887 666424408
3743.7 666424408 657823792 641490707 649850998 655537033 661584625 657768402 648538208 658968582
3751.4 658968582 654563522 647771454 653778915 659055176 662242889 657081757 658730774 663552094
3759.1 663552094 657636642 657133942 661449356 662747879 662676239 665163040 662435608 658922424 661777039
3767.8F61777039L846740m6081p880249K403335L825913L77579L67507n69686O23016
3776.5F64725113M15802L037567o96487p765198L096313L261490J203232J194229k409897
3785.2F66062164j45950J379471L17459k04773j95618O73981J20163K75269P6828R37118
3794.8F69296112K341309l127213l217239J764297L733139N296097o990356r119568
3802.5F59976578M219665K830200M263840M338532r388428l077774M953461J781463
3810.2F69897537L43704J53504K64358J795578L906861l487702j1998138N937424O003265
3818.9F72816391L406830q55408j7293930M324570O916351K353745K249755n05294
3826.6F73413010l825302M73327K406616K878952K057572p011337J214599O376267
$$ plain form
3767.8 661777039 665623779 665577698 657697449 660100784 663926697 664304276 664671783 664102097 664725113
3776.5 664725113 665140915 668178482 667481995 659716797 662813110 666074600 667277832 668472061 666062164
3785.2 666062164 665916214 667295685 667613144 667408371 667212753 667886734 668006897 668282166 668358994 669296112
3794.8 669296112 671637421 668510208 665292969 667057266 670790405 676086502 669096146 659976578
3802.5 659976578 664196243 667026443 671290283 675628815 666240387 663162613 668116074 669897537
3810.2 669897537 670241241 670394745 670659103 672454681 676361542 672873840 660875702 666813126 672816391
3818.9 672816391 676223221 675367813 658073883 662398453 669314804 671668549 673918304 673413010
3826.6 673413010 669587708 670061035 672467651 675346603 677404175 670392838 671607437 677983704
3834.3F77983704n943451r34525P727204p617798o057587N896225k185516Q81500N587845
3843F75337601l215637l191834K611618J232452M62723J772461p6752J781159M621277
3851.7F81335068n512772r81445j2130890J054611R229431o99920j099625K271118
3859.4F73465576J447754J311112m203415Q50601M778518n978622l914871M149628
3867.1F71906281M532623N087814p370987r400482M114151N761642K971955q090973
3874.8F69512024P08542M446335J50299J543426K804642n586319n700378N387268J312484
3883.5F74578323J586609M788819j1765137O07376L728333Q72726M038467j759414
3891.2F76676102p361374J470794L050232j213836J364670J156158R74197J095353
$$ plain form
3834.3 677983704 672040253 671105728 678832932 671215134 665157547 671053772 668868256 669749756 675337601
3843 675337601 672121964 668930130 671541748 672774200 673236923 675009384 674932632 676713791 681335068
3851.7 681335068 675822296 674840851 662709961 663764572 672994003 672294083 671194458 673465576
3859.4 673465576 674913330 676224442 672021027 672871628 677650146 671671524 667756653 671906281
3867.1 671906281 676438904 681526718 674155731 664755249 668869400 674631042 677602997 669512024
3874.8 669512024 670220566 674666901 674817200 676360626 679165268 673578949 667878571 673265839 674578323
3883.5 674578323 676164932 680953751 669188614 669795990 673524323 674397049 678435516 676676102
3891.2 676676102 669314728 670785522 673835754 672621918 673986588 675142746 676116943 677212296
3898.9F77212296p822419M619217J689453n134048M293976k521973j891174O40487
3906.7F71085815J659394J942138j86691O06613m09546N4474K37580n42603L96805
3915.3F74843979J406555k417374l239746L242646o9199k559967J816940J005554O95115
3924F74724503j221695j989975O22711J033783J390381m76685n01404J433106k054673
3932.7F72960052j772537P20291L78571J103439Q0719q56399j10245L72162J825790
3941.4F74701843N73273l243637p25784R46426N87921L10822j987915P20520J196060
3950.1F73079529r50165J416931n7754o10199M1732m56771K9525P7210P41806o41251
3959.7F72670593K3728K10418j105423M72336J97754M07562l6316o69860K28347l55072
$$ plain form
3898.9 677212296 669389877 674009094 675698547 670564499 674858475 672336502 670445328 671085815
3906.7 671085815 672745209 674687347 674500656 675107269 674697723 674752197 674989777 674447174 674843979
3915.3 674843979 676250534 673833160 670593414 673836060 673766861 671206894 673023834 674029388 674724503
3924 674724503 673502808 671512833 672135544 673169327 674559708 674083023 673581619 675014725 672960052
3932.7 672960052 671187515 671907806 672286377 673389816 673470535 672614136 672503891 672876053 674701843
3941.4 674701843 675275116 672031479 671305695 672252121 672840042 673150864 671162949 671883469 673079529
3950.1 673079529 672129364 673546295 673488541 672878342 672920074 672463303 672492828 672570038 673311844 672670593
3959.7 672670593 672694321 672904739 671799316 672271652 672469406 672876968 672840652 672170792 672399139 672044067
3969.3F72044067l94592P45850Q91571m40979m38309K83966k82059q29773K82059R55658
3979F72817459L42636M00009o20117j064911k61841M96903Q28400n3330o92673o70242
3988.6F71522293O23703P89490j67160j94168L52096P00684m23966n06820q6975q4763
3998.3F72524414k19803l63312
4000.2F71941299
$$ plain form
3969.3 672044067 671649475 672395325 673286896 672845917 672407608 672691574 672409515 671579742 671861801 672817459
3979 672817459 673160095 673560104 672939987 671875076 671613235 672110138 672938538 672885208 672192535 671522293
3988.6 671522293 672145996 672935486 672768326 672574158 672926254 673626938 673202972 672696152 672609177 672524414
3998.3 672524414 672304611 671941299
4000.2 671941299
##END=$$ End of the data block
