##TITLE=$$ Begin of the data block
##JCAMP-DX=5.00 $$ ACD/SpecManager v 10.08
##SPECTROMETER/DATA SYSTEM=Varian
##DATE=14 Jan 2013 10:02:20
##DATA TYPE=INFRARED SPECTRUM
##DATA CLASS=XYDATA
##ORIGIN=
##OWNER=
##NPOINTS=3735
##FIRSTX=399.26403809
##LASTX=4000.35498047
##MAXX=4000.35498047
##MINX=399.26403809
##MAXY=70.34651184
##MINY=19.77324486
##XFACTOR=1.0000000000
##YFACTOR=0.000000100000000
##FIRSTY=41.27616119
##DELTAX=0.96440572
##XUNITS=1/CM
##YUNITS=TRANSMITTANCE
##XYDATA=(X++(Y..Y))
$$ plain form
399.3 412761612 420959625 413979378 411847610 415321617 416680946 415916901 411635475 412516861 421053543
407.9 421053543 410858383 395188408 398694115 403187370 404982719 405284386 404696350 407055817
415.7 407055817 408999557 410487022 412322197 415420952 410439262 411501503 418571472 412455406
423.4 412455406 399247055 398966484 410497589 413630524 409469872 405706749 400808105 397792625
431.1 397792625 395808334 396139030 401922417 404477348 402998276 403813820 403295441 400674362 400096626
439.8 400096626 403873634 405324173 401320343 401418495 400686302 395990486 394015961 400228996 407144775
448.4 407144775 408714828 409307365 407369003 399455261 394925613 399964333 406559181 406392365 397162552
457.1 397162552 391717377 400439186 403071251 399593735 398044777 398028603 399429970 401541138 399922829
$$ packed form
399.3D12761612Q198013o980247k131768L474007J359329p64045m281426Q81386Q536682
407.9D21053543j0195160j5669975L505707M493255J795349L01667n88036K359467
415.7D07055817J943740J487465J835175L098755m981690J062241P069969o116066
423.4D12455406j3208351k80571J1531105L132935m160652l763123m898644l015480
431.1C97792625j984291L30696N783387K554931j479072Q15544n18379k621079n77736
439.8D00096626L777008J450539m003830R8152p32193m695816j974525O213035O915779
448.4D07144775J570053N92537j938362p913742m529648N038720O594848j66816r229813
457.1C97162552n445175Q721809K632065l477516j548958j6174J401367K111168j618309
$$ plain form
465.8 399922829 396363907 393994789 393438911 393844414 396865044 400254173 392929420 387905540 388997040
474.5 388997040 385727386 387474327 390462418 390878029 391600037 388025665 382978477 379313583 381870384
483.2 381870384 384736824 383919678 385710030 385773697 384667816 384063492 385435905 385101395 382979317
491.8 382979317 385836143 388556442 387039604 381987457 379449654 379330292 380165634 382776909 382549133
500.5 382549133 381383934 382713699 385388184 383199806 377969856 376917686 375683517 375043755 377403526
509.2 377403526 378805885 377139893 375648117 376439590 376647148 373974838 371077919 370105591 370323830
517.9 370323830 373042221 374968643 373777084 372902031 372129517 370926704 369043808 366720772 365708122
526.6 365708122 368344040 370761986 370153046 369432945 369007683 369911156 370547676 368761444 367567902
$$ packed form
465.8C99922829l558922k369118n55878M05503L020630L389129p324753n023880J091500
474.5C88997040l269654J746941K988091M15611P22008l574372n047188l664894K556801
483.2C81870384K866440q17146J790352O3667j105881o04324J372413l34510k122078
491.8C82979317K856826K720299j516838n052147k537803j19362Q35342K611275k27776
500.5C82549133j165199J329765K674485k188378n229950j052170j234169o39762K359771
509.2C77403526J402359j665992j491776P91473K07558k672310k896919r72328K18239
517.9C70323830K718391J926422j191559q75053p72514j202813j882896k323036j012650
526.6C65708122K635918K417946o08940p20101m25262R03473O36520j786232j193542
$$ plain form
535.2 367567902 367068520 367111969 367750320 368032570 367799606 366356812 365688362 365853577 363702431 362106972
544.9 362106972 362225189 361678276 361840057 362101440 361312752 360241814 360705795 360797386 359383965 357918091
554.5 357918091 357122688 357918091 356204605 354178429 353980827 354201508 356962967 357807617 357379532
563.2 357379532 358096237 358254509 357399635 355715027 355398369 356221962 357322617 357076302 356823769
571.9 356823769 357008057 357217216 358487053 358702850 358393402 357333221 356249390 356187553 355724182
580.6 355724182 356009636 356700935 356671944 356311073 357009163 357037277 356406746 356528320 356714516 357205696
590.2 357205696 357502251 358978271 359155426 357812042 358276787 358919678 358954926 358974495 359248734 359236374
599.9 359236374 359090538 358504868 357583733 357847824 358603859 358909988 357466698 355855331 354648628
$$ packed form
535.2C67567902m99382M3449O38351K82250k32964j442794o68450J65215k151146j595459
544.9C62106972J18217n46913J61781K61383p88688j070938M63981R1591j413421j465874
554.5C57918091p95403P95403j713486k026176j97602K20681K761459Q44650m28085
563.2C57379532P16705J58272q54874j684608l16658Q23593J100655k46315k52533
571.9C56823769J84288K09159J269837K15797l09448j060181j083831o1837m63371
580.6C55724182K85454O91299k8991l60871O98090K8114o30531J21574J86196M91180
590.2C57205696K96555J476020J77155j343384M64745O42891L5248J9569K74239j2360
599.9C59236374j45836n85670r21135K64091P56035L06129j443290j611367j206703
$$ plain form
608.5 354648628 353602791 353640862 353001022 353006020 353291397 352659225 352080803 351650658 351386490 351800613
618.2 351800613 352877579 352543411 351968727 352036934 352894440 353821831 353800888 355851784 357728729 358125381
627.8 358125381 358887405 358773079 359356613 361591721 363091736 364198532 365885086 367608910 369711800
636.5 369711800 371561699 372749062 373496399 374034309 374900093 375711823 375992508 376535263 378374596
645.2 378374596 380302467 381780434 382978020 383505135 384021072 384307823 384607430 384978943 384626045
653.9 384626045 384267159 384844398 386293030 387244148 387333603 387104187 386163673 385183640 384558601 383212204
663.5 383212204 382221832 383226471 384509850 384447136 383224983 384464912 385806427 386826057 387937164
672.2 387937164 388567390 388720779 389398270 390063515 391378975 393056374 394922028 397036438 397883682
$$ packed form
608.5C54648628j045837L8071o39840M998K85377o32172n78422m30145k64168M14123
618.2C51800613J076966l34168n74684O8207Q57506R27391k0943K050896J876945L96652
627.8C58125381P62024j14326N83534K235108J500015J106796J686554J723824K102890
636.5C69711800J849899J187363P47337N37910Q65784Q11730K80685N42755J839333
645.2C78374596J927871J477967J197586N27115N15937K86751K99607L71513l52898
653.9C84626045l58886N77239J448632R51118Q9455k29416r40514r80033o25039j346397
663.5C83212204r90372J004639J283379o2714j222153J239929J341515J019630J111107
672.2C87937164O30226J53389O77491O65245J315460J677399J865654K114410Q47244
$$ plain form
680.9 397883682 398560181 399386330 400251007 401098900 401450996 402728577 404289665 405240784 405993271
689.6 405993271 407133408 408026619 408076706 408198357 408140984 409014282 409931946 410429268 411705704 412307663
699.2 412307663 413139572 414070854 414661980 415214653 415385590 415897293 416234741 416763725 417439308 418596649
708.8 418596649 420350952 421077652 421325188 422143974 423254166 423879051 423928795 423496895 424010162 425355263
718.5 425355263 425963783 426962471 428178825 428878059 429356995 430176048 431016693 431820984 432355232 431963043
728.1 431963043 433036613 434806137 436081047 438093834 440245934 441035614 439950218 439828262 440920029
736.8 440920029 441126289 440215034 440407257 442662201 444179039 444930115 445740547 446522446 447573586
745.5 447573586 448230209 447764435 447497025 447979012 448319817 449546051 450546684 451242447 452568474
$$ packed form
680.9C97883682O76499Q26149Q64677Q47893L52096J277581J561088R51119P52487
689.6D05993271J140137Q93211N0087J21651n7373Q73298R17664M97322J276436O01959
699.2D12307663Q31909R31282N91126N52673J70937N11703L37448N28984O75583J157341
708.8D18596649J754303P26700K47536Q18786J110192O24885M9744m31900N13267J345101
718.5D25355263O08520R98688J216354O99234M78936Q19053Q40645Q04291N34248l92189
728.1D31963043J073570J769524J274910K012787K152100P89680j085396j21956J091767
736.8D40920029K06260r11255J92223K254944J516838P51076Q10432P81899J051140
745.5D47573586O56623m65774k67410M81987L40805J226234J000633O95763J326027
$$ plain form
754.2 452568474 453483276 453903503 454479408 456262398 457861519 458997574 460385513 461566505 462596588
762.8 462596588 463569984 465084991 466325607 467176781 467642517 467336807 466663704 467024040 467821274
771.5 467821274 467408295 467557640 467889366 468080368 467971458 467691154 467698059 467339706 468114624 468637009
781.2 468637009 469069519 469918327 470305061 470792236 470741653 471335297 472107239 472222824 471562309 471050911
790.8 471050911 471943512 472900047 473287125 473367500 473668709 473153877 472464409 471963387 470847282 469689941
800.5 469689941 468577652 467680893 466609306 466134796 465062599 463633919 462542000 460647774 458650360
809.1 458650360 456217842 455011177 454307098 453150902 452066727 450678520 450330620 449899483 448747482
817.8 448747482 447281151 447049522 447770538 447871399 448309593 449469566 452418594 454832535 456791878
$$ packed form
754.2D52568474R14802M20227N75905J782990J599121J136055J387939J180992J030083
762.8D62596588R73396J515007J240616Q51174M65736l05710o73103L60336P97234
771.5D67821274m12979J49345L31726J91002j08910k80304O905l58353P74918N22385
781.2D68637009M32510Q48808L86734M87175n0583N93644P71942J15585o60515n11398
790.8D71050911Q92601R56535L87078Q0375L01209n14832o89468n01022j116105j157341
800.5D69689941j112289q96759j071587m74510j072197j428680j091919j894226j997414
809.1D58650360k432518j206665p04079j156196j084175j388207l47900m31137j152001
817.8D48747482j466331k31629P21016J00861M38194J159973K949028K413941J959343
$$ plain form
826.5 456791878 460176277 463070602 466036835 468706245 470735855 472539787 474607010 477205582
834.2 477205582 480628433 483261223 484874878 488126221 490597000 492782402 494935760 495861511 496120605
842.9 496120605 496328697 497658806 499023972 501180649 502774200 504816933 506410599 506075630 507392616
851.6 507392616 508028946 508564796 509735870 511495056 514306564 516244354 517671089 518862762 520236397
860.3 520236397 521131020 521946716 522010155 521949615 521613998 520998039 521401100 520200806 519201012 517701111
869.9 517701111 515373077 513005371 510540810 509075851 506613922 504644356 502749100 501848679 502142296
878.6 502142296 502078743 502488823 502117233 502202072 501745338 500644035 499495277 499194374 499726753 499055748
888.2 499055748 499355316 499096031 498669930 499157906 499289894 499274292 499041328 499419212 499516869 499676590
$$ packed form
826.5D56791878L384399K894325K966233K669410K029610J803932K067223K598572
834.2D77205582L422851K632790J613655L251343K470779K185402K153358R25751K59094
842.9D96120605K08092J330109J365166K156677J593551K042733J593666l34969J316986
851.6E07392616O36330N35850J171074J759186K811508J937790J426735J191673J373635
860.3E20236397Q94623Q15696O3439o0540l35617o15959M03061j200294r99794j499901
869.9E17701111k328034k367706k464561j464959k461929j969566j895256r00421K93617
878.6E02142296o3553M10080l71590Q4839m56734j101303j148758l00903N32379o71005
888.2D99055748K99568k59285m26101M87976J31988j5602k32964L77884R7657J59721
$$ plain form
897.9 499676590 499319229 498847847 499014015 499612236 500300102 499766235 500550232 502444153 505121040
906.5 505121040 508000221 509973717 512128410 513541946 514819489 515445747 515758553 515236320 514013977
915.2 514013977 512918472 511179619 509118690 505690002 502905693 500961342 498856239 496330681
922.9 496330681 493198929 490038490 485890312 481847649 477815590 473941536 470468521 467517700
930.7 467517700 465228157 463434677 462578087 461015358 459551506 458010674 456197853 455226364 454228325
939.3 454228325 453227539 451699486 450723305 449939384 449027100 448391380 447198906 446450081 445914574
948 445914574 446343460 446894455 446381645 446286469 446450119 445894508 444498444 443891335 443053093 440622787
957.7 440622787 437806015 435797119 434291420 432119713 429544716 426873932 425051003 423645554
$$ packed form
897.9D99676590l57361m71382J66168N98221O87866n33867P83997J893921K676887
906.5E05121040K879181J973496K154693J413536J277543O26258L12806n22233j222343
915.2E14013977j095505j738853k060929l428688k784309j944351k105103k525558
922.9D96330681l131752l160439m148178m042663m032059l874054l473015k950821
930.7D67517700k289543j793480q56590j562729j463852j540832j812821r71489r98039
939.3D54228325j000786j528053r76181p83921r12284o35720j192474p48825n35507
948D45914574M28886N50995n12810r5176J63650n55611j396064o07109q38242k430306
957.7D40622787k816772k008896j505699k171707k574997k670784j822929j405449
$$ plain form
965.4 423645554 422016716 420672569 419078331 417083511 414531937 412428093 410534172 407503967
973.1 407503967 404223061 401033478 397679100 394483604 391103706 387126045 383036919 378622246
980.8 378622246 373313408 368042679 363314552 357988014 352479324 347760201 343414879 338784943
988.5 338784943 334639893 330861931 326245193 322533226 319493103 316098461 312607689 309221230
996.2 309221230 306270180 303425198 300778542 297777061 294781818 291429195 288543720 286486244
1004 286486244 284166565 282020664 279712849 278449459 276688156 273980789 271736660 269848862 268343105
1012.6 268343105 266379871 264707108 262447624 260210857 258132458 256453972 254684410 251565800
1020.3 251565800 249512062 246810703 244746075 243806572 242487850 240593719 238582382 238673058 237674389
$$ packed form
965.4D23645554j628838j344147j594238j994820k551574k103844j893921l030205
973.1D07503967l280906l189583l354378l195496l379898l977661m089126m414673
980.8C78622246n308838n270729m728127n326538n508690m719123m345322m629936
988.5C38784943m145050l777962m616738l711967l040123l394642l490772l386459
996.2C09221230k951050k844982k646656l001481k995243l352623k885475k057476
1004B86486244k319679k145901k307815j263390j761303k707367k244129j887798j505757
1012.6B68343105j963234j672763k259484k236767k078399j678486j769562l118610
1020.3B51565800k053738k701359k064628r39503j318722j894131k011337R0676r98669
$$ plain form
1029 237674389 236483250 235700417 234840546 233556805 232229767 233403225 233908482 234568596 235531445
1037.7 235531445 237212219 239525185 241359348 243308811 243972988 245321617 246105156 246342545 245968609
1046.4 245968609 245181046 244809227 243463879 243181725 241911869 240316620 239547768 238990421 237252712
1055.1 237252712 234885273 234828243 233657990 233363895 234234867 235680618 237313633 238655758 241534882
1063.7 241534882 243092098 244803238 246009579 247404041 249203053 249867516 250601902 250596886 251101360
1072.4 251101360 250993023 251650715 252400265 252555275 253686752 253758144 253534813 253797760 256062984
1081.1 256062984 257727833 257993546 258548260 259152336 260359707 261398029 263069401 264348602 266373310
1089.8 266373310 268163605 269568062 271428185 272003117 273605480 275091457 276456852 277518921
$$ packed form
1029B37674389j191139p82833q59871j283741j327038J173458N05257O60114R62849
1037.7B35531445J680774K312966J834163J949463O64177J348629P83539K37389l73936
1046.4B45968609p87563l71819j345348k82154j269856j595249p68852n57347j737709
1055.1B37252712k367439n7030j170253k94095Q70972J445751J633015J342125K879124
1063.7B41534882J557216J711140J206341J394462J799012O64463P34386n016N04474
1072.4B51101360j08337O57692P49550J55010J131477P1392k23331K62947K265224
1081.1B56062984J664849K65713N54714O04076J207371J038322J671372J279201K024708
1089.8B66373310J790295J404457J860123N74932J602363J485977J365395J062069
$$ plain form
1097.5 277518921 279430351 282068119 282715778 284319592 285889072 287514496 289633179 291086140
1105.2 291086140 292213936 293525772 295176220 295683861 296287460 296777554 297337456 298209763 299368134
1113.9 299368134 300989647 301784058 302759590 302924099 302973900 303474445 303340473 303034477 302831116 303697109
1123.5 303697109 304911671 305881748 306306057 307302036 308588753 309740295 311738071 313673801 316031990
1132.2 316031990 318311405 321100121 323947525 326225929 328866882 331238594 333665123 335649185
1139.9 335649185 336715202 337522392 339050713 340512009 341905174 343179817 343330917 344293365 345033531
1148.6 345033531 344994087 345486984 345538101 345087662 344835281 344921455 344449959 343762550 343259621 342782631
1158.3 342782631 342054939 341019630 340746880 340403595 339936371 340191116 341553993 343442154 345404205
$$ packed form
1097.5B77518921J911430K637768O47659J603814J569480J625424K118683J452961
1105.2B91086140J127796J311836J650448N07641O03599M90094N59902Q72307J158371
1113.9B99368134J621513P94411R75532J64509M9801N00545j33972l05996k03361Q65993
1123.5C03697109J214562R70077M24309R95979J286717J151542J997776J935730K358189
1132.2C16031990K279415K788716K847404K278404K640953K371712K426529J984062
1139.9C35649185J066017Q07190J528321J461296J393165J274643J51100R62448P40166
1148.6C45033531l9444M92897N1117m50439k52381Q6174m71496o87409n02929m76990
1158.3C42782631p27692j035309k72750l43285m67224K54745J362877J888161J962051
$$ plain form
1166.9 345404205 347999496 350449829 353255157 356165047 359081688 362596893 366304626 369605064
1174.6 369605064 372347374 375139618 378436508 381468468 383493690 385872841 388494606 391366768
1182.4 391366768 393831100 395481682 397066765 398248863 399644241 400440331 401206551 401902008 401864662
1191 401864662 401820679 401593971 401104279 399903450 399078751 398454208 397670517 397045479 395858536 394669762
1200.7 394669762 393255806 391472549 389906921 388835411 387635460 386344643 385725288 385190620 385158272
1209.4 385158272 385041962 384190598 383685036 383326111 382735825 382129555 381520958 380772247 380645485 380619736
1219 380619736 380003815 379714890 379290619 378654175 378161469 377417259 376247101 375148239 374332123 373599892
1228.6 373599892 373169518 372570992 371807480 371225929 370685196 369700127 368566170 368233452 367982216
$$ packed form
1166.9C45404205K595291K450333K805328K909890K916641L515205L707733L300438
1174.6C69605064K742310K792244L296890L031960K025222K379151K621765K872162
1182.4C91366768K464332J650582J585083J182098J395378P96090P66220O95457l7346
1191D01864662m3983k26708m89692j200829q24699o24543p83691o25038j186943j188774
1200.7C94669762j413956j783257j565628j071510j199951j290817o19355n34668l2348
1209.4C85158272j16310q51364n05562l58925n90286o06270o08597p48711j26762k5749
1219C80619736o15921k88925m24271o36444m92706p44210j170158j098862q16116p32231
1228.6C73599892m30374n98526p63512n81551n40733r85069j133957l32718k51236
$$ plain form
1237.3 367982216 367824745 367758751 367647934 367578354 367335587 367407799 366830254 366297836 366109085 365292702
1247 365292702 364535561 363871346 363488426 362885399 362552567 362919655 363254967 363617668 363213081 362555962
1256.6 362555962 362178078 361932793 361975861 361687469 361252403 361648178 362560043 363253632 364155197 364998779
1266.3 364998779 365672989 365930176 366364403 367268486 367789803 368757401 369670029 370466537 371648560
1274.9 371648560 373128052 374496956 375272331 376227608 377297974 378257408 378847008 379694939 381173058
1283.6 381173058 382945328 384789772 386260033 387770653 389272881 390785637 391850853 392890091
1291.3 392890091 393590240 393860664 394528770 395247002 396419258 396930466 397789154 399101982 399247818
1300 399247818 399303169 399234924 399303856 399163589 398719444 398352280 398161049 398422699 398075523 397180595
$$ packed form
1237.3C67982216j57471o5994j10817o9580k42767P2212n77545n32418j88751q16383
1247C65292702p57141o64215l82920o03027l32832L67088L35312L62701m04587o57119
1256.6C62555962l77884k45285M3068k88392m35066L95775R11865O93589R01565Q43582
1266.3C64998779O74210K57187M34227R04083N21317R67598R12628P96508J182023
1274.9C71648560J479492J368904P75375R55277J070366R59434N89600Q47931J478119
1283.6C81173058J772270J844444J470261J510620J502228J512756J065216J039238
1291.3C92890091P00149K70424O68106P18232J172256N11208Q58688J312828J45836
1300C99247818N5351o8245O8932j40267m44145l67164j91231K61650l47176q94928
$$ plain form
1309.7 397180595 396608734 396109848 395200768 394395027 393567352 393115158 393267326 393137093 393522072 394123993
1319.3 394123993 394817009 395911942 396803093 397504082 397999840 398679199 399289856 399744911 399955864
1328 399955864 400142746 400114212 399734802 399335976 398433533 397658501 397253609 397095985 396799278 396660728
1337.6 396660728 397078323 397250481 397972183 398848610 399636879 400292702 401060219 401925964 402443848 403219490
1347.3 403219490 403412209 403668022 403764038 403891182 404065781 403276634 402966805 402698212 402180557 401708412
1356.9 401708412 401385841 401004868 400695801 400077667 398826866 398557816 398348312 398464584 397958527
1365.6 397958527 396843452 396032562 395006371 394741592 394122810 393983421 393885689 393429298 393440094 393185387
1375.2 393185387 393391571 392969284 392807808 392319260 391660690 391111526 389915810 388899078 387197762
$$ packed form
1309.7C97180595n71861m98886r09080q05741q27675m52194J52168j30233L84979O01921
1319.3C94123993O93016J094933Q91151P00989M95758O79359O10657M55055K10953
1328C99955864J86882k8534l79410l98826r02443p75032m04892j57624k96707j38550
1337.6C96660728M17595J72158P21702Q76427P88269O55823P67517Q65745N17884P75642
1347.3D03219490J92719K55813R6016J27144J74599p89147l09829k68593n17655m72145
1356.9D01708412l22571l80973l09067o18134j250801k69050k09504J16272n06057
1365.6C97958527j115075q10890j026191k64779o18782j39389r7732m56391J0796k54707
1375.2C93185387K06184m22287j61476m88548o58570n49164j195716j016732j701316
$$ plain form
1383.9 387197762 385813446 384387169 383309708 382022400 379970436 378991089 377235985 375033684
1391.6 375033684 372695808 370768356 368687897 366185188 364589233 362417450 360286140 357042847
1399.3 357042847 354898148 353423882 351183243 349396858 347203827 344543114 342193146 340676079
1407.1 340676079 339084396 337049828 335635948 333809891 332292328 330889397 329516907 328448601
1414.8 328448601 327027664 325832367 324544373 324471397 323428040 323047562 323764458 323462982 323951378
1423.4 323951378 323962402 324482307 325242195 325597458 326235352 326695747 328511238 329633064 331479034
1432.1 331479034 333161469 334539261 336225739 337065506 340176811 341884232 344060860 345788841
1439.8 345788841 347303734 349011879 350423622 353028793 354839554 357136688 358510246 359665031
$$ packed form
1383.9C87197762j384316j426277j077461j287308k051964r79347j755104k202301
1391.6C75033684k337876j927452k080459k502709j595955k171783k131310l243293
1399.3C57042847k144699j474266k240639j786385k193031k660713k349968j517067
1407.1C40676079j591683k034568j413880j826057j517563j402931j372490j068306
1414.8C28448601j420937j195297j287994p2976j043357l80478P16896l01476M88396
1423.4C23951378J1024N19905P59888L55263O37894M60395J815491J121826J845970
1432.1C31479034J682435J377792J686478Q39767L111305J707421K176628J727981
1439.8C45788841J514893J708145J411743K605171J810761K297134J373558J154785
$$ plain form
1447.6 359665031 361348724 362537079 364331055 365492325 367438011 368370209 369788818 371087036
1455.3 371087036 372289848 375178375 374220848 377289238 379117622 382048721 384141502 385155983
1463 385155983 386976357 387789917 391423683 393864212 396725464 399237900 401529274 404338608 405836296
1471.7 405836296 408928337 412203827 415755119 418405762 422149658 425515327 427915497 430592308
1479.4 430592308 432472229 434883652 436667633 438362312 440030594 441331329 442784157 443650551
1487.1 443650551 445177765 446503830 446652946 447438889 448515358 448957138 448513336 447595253 446780815
1495.8 446780815 444579277 444090157 443291969 441693611 441315842 440636749 439567490 438545609 438283119
1504.5 438283119 437255287 433314362 431332016 431828156 433108368 433729439 434439468 433830185 432899475
$$ packed form
1447.6C59665031J683693J188355J793976J161270J945686R32198J418609J298218
1455.3C71087036J202812K888527r57527L068390J828384K931099K092781J014481
1463C85155983J820374Q13560L633766K440529K861252K512436K291374K809334J497688
1471.7D05836296L092041L275490L551292K650643L743896L365669K400170K676811
1479.4D30592308J879921K411423J783981J694679J668282J300735J452828Q66394
1487.1D43650551J527214J326065J49116P85943J076469M41780m43802r18083q14438
1495.8D46780815k201538m89120p98188j598358l77769o79093j069259j021881k62490
1504.5D38283119j027832l940925j982346M96140J280212O21071P10029o09283r30710
$$ plain form
1513.1 432899475 432797089 431844864 430551414 428238907 428530083 430151291 430896912 429821053 428916245
1521.8 428916245 430318260 431517181 432080193 431176567 431947479 433223267 434478416 435390739 435789871
1530.5 435789871 435890770 435899506 436532822 436251373 437482185 438321266 438481407 438969612 435994377 434468765
1540.1 434468765 436310196 438191910 438923111 439683571 440053368 439803047 441108551 441123581 441105728
1548.8 441105728 440292435 440590553 441683350 441367760 441751060 439688530 439439621 439731865 440036774
1557.5 440036774 440228958 432288361 433421783 432996025 433691216 432479706 431123657 428449211 425111313
1566.2 425111313 423506050 420982742 419327850 411665840 409708633 407751541 404229317 401047707
1573.9 401047707 397377968 395661583 385296516 383819122 380422363 375963593 371884537 366284294
$$ packed form
1513.1D32899475j02386r52225j293450k312507K91176J621208P45621j075859r04808
1521.8D28916245J402015J198921N63012r03626P70912J275788J255149R12323L99132
1530.5D35789871J00899Q736O33316k81449J230812Q39081J60141M88205k975235j525612
1540.1D34468765J841431J881714P31201P60460L69797k50321J305504J5030j7853
1548.8D41105728q13293K98118J092797l15590L83300k062530k48909K92244L04909
1557.5D40036774J92184p940597J133422m25758O95191j211510j356049k674446l337898
1566.2D25111313j605263k523308j654892p662010j957207j957092l522224l181610
1573.9D01047707l669739j716385j0365067j477394l396759m458770m079056n600243
$$ plain form
1581.6 366284294 362651520 356745987 353090591 348095703 343770447 339492760 334446335 331201820
1589.3 331201820 325071793 321565399 316141357 312619476 308591251 304102287 301659775 296767788
1597 296767788 294635601 290168705 288080368 284732361 281441841 279527378 275503712 274166985 270435886
1605.7 270435886 269687710 267078915 265271683 263828411 261213760 261625500 259098167 259043598 257017727
1614.4 257017727 257171898 257030354 252357311 254362907 253258705 254352779 252950726 254005413 254030495
1623.1 254030495 252896767 254493942 253740826 255600262 254751873 256843605 257650661 258767738 260081253
1631.7 260081253 260038471 262359219 261769371 264563656 264339485 267195721 268890152 269733505 272289619
1640.4 272289619 272782860 275670815 276247292 278273888 279765148 279150295 282532139 283182278 287350674
$$ packed form
1581.6C66284294l632774n905533l655396m994888m325256m277687n046425l244515
1589.3C31201820o130027l506394n424042l521881m028225m488964k442512m891987
1597B96767788k132187m466896k088337l348007l290520j914463m023666j336727l731099
1605.7B70435886p48176k608795j807232j443272k614651M11740k527333n4569k025871
1614.4B57017727J54171j41544m673043K005596j104202J094074j402053J054687K5082
1623.1B54030495j133728J597175p53116J859436q48389K091732Q07056J117077J313515
1631.7B60081253m2782K320748n89848K794285k24171K856236J694431Q43353K556114
1640.4B72289619M93241K887955N76477K026596J491260o14853L381844O50139M168396
$$ plain form
1649.1 287350674 288134460 290794582 292597790 292177887 296537628 295981274 299545746 300909233 303640556
1657.8 303640556 304963779 307262535 309891205 311904163 315327110 316421204 320422096 322807312
1665.5 322807312 325746651 328116951 330198669 334096527 336220703 341613464 344399490 348445702
1673.2 348445702 351985016 355674973 360469170 363858337 368350258 370906487 375084190 378668175
1680.9 378668175 383061829 388061256 391409836 398636818 400906754 406656914 411142654 415671768
1688.6 415671768 420499306 424822388 429841003 434395981 439463654 444155502 449554787 452558327
1696.4 452558327 457470512 463187752 468323860 473567467 474286613 480278549 485404015 489398918
1704.1 489398918 492427406 496434326 500161705 503305359 507044182 509678459 512034035 514531784
$$ packed form
1649.1B87350674P83786K660122J803208m19903M359741n56354L564472J363487K731323
1657.8C03640556J323223K298756K628670K012958L422947J094094M000892K385216
1665.5C22807312K939339K370300K081718L897858K124176N392761K786026M046212
1673.2C48445702L539314L689957M794197L389167M491921K556229M177703L583985
1680.9C78668175M393654M999427L348580P226982K269936N750160M485740M529114
1688.6D15671768M827538M323082N018615M554978N067673M691848N399285L003540
1696.4D52558327M912185N717240N136108N243607P19146N991936N125466L994903
1704.1D89398918L028488M006920L727379L143654L738823K634277K355576K497749
$$ plain form
1711.8 514531784 517008476 519075356 519484634 520381699 523505898 526018295 524876175 528292274 531317444
1720.5 531317444 533218956 534814415 535885124 536758957 538334312 540030479 540976372 542427177 544422302
1729.1 544422302 545282211 546090050 548645592 551224136 549929161 548525162 552719307 556391373 558216286
1737.8 558216286 560744591 562492981 562463074 566291580 569597282 571232834 573446007 577047920 580338707
1746.5 580338707 583056068 586052322 587598572 591626320 594626465 597040596 601675606 605083008
1754.2 605083008 607806435 610119247 611710243 614439125 617817154 620140648 622554245 622997284
1761.9 622997284 623571014 626872749 628958817 630807648 632761917 634739838 634459305 635982018 638871651
1770.6 638871651 638617592 639140778 638748016 641616592 643853378 643752670 645737839 646780777 648355484
$$ packed form
1711.8E14531784K476692K066880M09278Q97065L124199K512397j142120L416099L025170
1720.5E31317444J901512J595459J070709Q73833J575355J696167R45893J450805J995125
1729.1E44422302Q59909Q07839K555542K578544j294975j403999M194145L672066J824913
1737.8E58216286K528305J748390k9907L828506L305702J635552K213173L601913L290787
1746.5E80338707K717361K996254J546250M027748L000145K414131M635010L407402
1754.2F05083008K723427K312812J590996K728882L378029K323494K413597M43039
1761.9F22997284N73730L301735K086068J848831J954269J977921k80533J522713K889633
1770.6F38871651k54059N23186l92762K868576K236786j00708J985169J042938J574707
$$ plain form
1779.3 648355484 649251328 649490204 650453644 651586075 653058777 652874222 653185120 654307251 655454788
1788 655454788 656144638 657590485 659007416 659736176 658843765 658046646 660944519 661802597 661856842 663185043
1797.6 663185043 664280167 664907761 664660416 666484833 666629486 667391434 668999176 669611816 670458069
1806.3 670458069 670753098 671343079 672019577 673128357 672610016 673145905 674931564 675749512 676832123
1815 676832123 676942902 677614746 677646179 678034897 678693695 678625107 679714661 679881668 680880585 681897354
1824.6 681897354 681232605 681317596 682207413 683305130 683139114 681827393 682320480 684212646 684828033
1833.3 684828033 685264053 685855026 686213913 686810150 686559677 687349701 687338715 687520370 687613297 688175812
1842.9 688175812 689461899 686906281 688545151 690163956 690357285 690298157 690730133 691486511 691172638
$$ packed form
1779.3F48355484Q95844K38876R63440J132431J472702j84555L10898J122131J147537
1788F55454788O89850J445847J416931P28760q92411p97119K897873Q58078N4245J328201
1797.6F63185043J095124O27594k47345J824417J44653P61948J607742O12640Q46253
1806.3F70458069K95029N89981O76498J108780n18341N35889J785659Q17948J082611
1815F76832123J10779O71844L1433L88718O58798o8588J089554J67007R98917J016769
1824.6F81897354o64749Q4991Q89817J097717j66016j311721M93087J892166O15387
1833.3F84828033M36020N90973L58887N96237k50473P90024j0986J81655R2927N62515
1842.9F88175812J286087k555618J638870J618805J93329n9128M31976P56378l13873
$$ plain form
1851.6 691172638 691752167 692145004 692911758 693005829 692924042 693498077 693209152 693339539 693141708 694049759
1861.3 694049759 694428711 694360580 694720306 694804916 695321198 694698563 695240326 695117722 694529648 695104904
1870.9 695104904 695544510 696141357 696266174 696981583 697081985 697480621 697979202 698383636 698349609 697571716
1880.6 697571716 698213730 698063660 698093262 698137665 698218994 698672180 698601608 699604874 699602509 698924561
1890.2 698924561 699003677 699420853 699411316 699219894 699146881 698840485 699906235 700100250 700252533 700697632
1899.8 700697632 700999756 701245270 700772324 700968246 700540848 700591278 700786667 701067505 701909103 702152100
1909.5 702152100 702181168 701845703 702168808 701595078 701417084 701270752 700942535 701661682 700745468 701272278
1919.1 701272278 702258377 702841187 703133469 702776947 702628860 702216415 702151794 701490860 701656113 702013321
$$ packed form
1851.6F91172638N79529L92837P66754R4071q1787N74035k88925J30387j97831R08051
1861.3F94049759L78952o8131L59726Q4610N16282o22635N41763j22604n88074N75256
1870.9F95104904M39606N96847J24817P15409J00402L98636M98581M04434l4027p77893
1880.6F97571716O42014j50070K9602M4403Q1329M53186p0572J003266k365o77948
1890.2F98924561P9116M17176r537j91422p3013l06396J065750J94015J52283M45099
1899.8G00697632L02124K45514m72946J95922m27398N0430J95389K80838Q41598K42997
1909.5G02152100K9068l35465L23105n73730j77994j46332l28217P19147r16214N26810
1919.1G01272278R86099N82810K92282l56522j48087m12445o4621o60934J65253L57208
$$ plain form
1928.8 702013321 702344742 703029099 703044510 703465118 703115158 702911530 702510910 702199402 702066498 701750031
1938.4 701750031 701949615 701623764 702315674 702221756 701751404 702343521 702595749 702626648 702048798 702039795
1948.1 702039795 701581268 701370163 701308365 701700134 702648697 702673492 702848892 702389755 702248611 701887589
1957.7 701887589 701430664 701117401 700626068 701004410 701076813 701587143 701393967 701525879 701824188 701148605
1967.3 701148605 701300964 700861053 700602722 700289536 700533066 700918579 700986710 701570435 701679687 701967468
1977 701967468 701670761 701570358 701195602 700666275 700362549 699831314 700308762 700393524 700854721 701101227
1986.6 701101227 701048660 700811844 700077820 700357056 700019073 699226990 698810043 699414291 699818802 699580154
1996.3 699580154 699801941 699748001 699943771 699418869 699444580 699692841 699285736 698888626 698315125 698417969
$$ packed form
1928.8G02013321L31421O84357J5411M20608l49960k03628m00620l11508j32904l16467
1938.4G01750031J99584l25851O91910r3918m70352N92117K52228L0899n77850r003
1948.1G02039795m58527k11105o1798L91769R48563K4795J75400m59137j41144l61022
1957.7G01887589m56925l13263m91333L78342P2403N10330j93176J31912K98309o75583
1967.3G01148605J52359m39911k58331l13186K43530L85513O8131N83725J09252K87781
1977G01967468k96707j00403l74756n29327l03726n31235M77448Q4762M61197K46506
1986.6G01101227n2567k36816p34024K79236l37983p92083m16947O04248M04511k38648
1996.3F99580154K21787n3940J95770n24902K5711K48261m07105l97110n73501J02844
$$ plain form
2005.9 698417969 698180466 698353348 698623199 698656769 698367004 697877426 698149796 697855530 697728958 697396927
2015.6 697396927 697073517 696919327 697092056 697405624 696837921 696975632 696753540 696653137 696440735 695926132
2025.2 695926132 695903702 695675430 695739136 695249329 695318680 695315399 695201187 695323410 695009308 695018234 694496307
2035.8 694496307 694625626 694527512 694145432 693839111 693323746 693342361 693072281 693358307 693231125 693170547
2045.5 693170547 693136444 692857361 692934647 692581406 692759323 692664490 692638016 692326431 692070923 692078476 691637878
2056.1 691637878 691860123 691777344 692000961 691939392 691822128 691728287 691348495 691408768 690957870 691057281
2065.7 691057281 690544205 690405884 690759125 690673981 691087112 690895691 690991974 690653152 690557480 690754471
2075.4 690754471 690535049 690488434 690124283 690137024 689889374 690145798 690230637 690205536 690541916 690196686
$$ packed form
2005.9F98417969k37503J72882K69851L3570k89765m89578K72370k94266j26572l32031
2015.6F97396927l23410j54190J72729L13568n67703J37711k22092j00403k12402n14603
2025.2F95926132k2430k28272O3706m89807O9351l281j14212J22223l14102Q926n21927
2035.8F94496307J29319r8114l82080l06321n15365J8615k70080K86026j27182o0578
2045.5F93170547l4103k79083P7286l53241J77917r4833k6474l11585k55508P553m40598
2056.1F91637878K22245q2779K23617o1569j17264r3841l79792O0273m50898R9411
2065.7F91057281n13076j38321L53241q5144M13131j91421R6283l38822r5672J96991
2075.4F90754471k19422m6615l64151J2741k47650K56424Q4839k5101L36380l45230
$$ plain form
2085 690196686 689828262 689076843 688830795 688643494 688625183 688527222 688402100 688838806 688678894 688950119
2094.6 688950119 688666916 688300858 687903519 687406158 687350388 686781082 686990128 686959839 686884689 687036896
2104.3 687036896 687262650 687298203 686898956 687000656 686432037 686156540 685885925 685801163 685679092 685288086
2113.9 685288086 685724716 685609436 685786057 685848923 686049957 685897217 685166397 684827957 684242935 684483032
2123.6 684483032 684379578 684560013 684572754 684424667 685024490 684923553 684892120 684132919 683987656 683958359
2133.2 683958359 683451462 683874664 684283447 684591522 684328613 684631958 684528122 684041672 684061203 683764420
2142.9 683764420 683766022 683645859 683594208 683465042 684028015 684343109 684353561 684577408 683960953 683994904
2152.5 683994904 683651047 683386307 683278046 683092728 683443146 683657532 684461594 684739609 684667511 684170380
$$ packed form
2085F90196686l68424p51419k46048j87301j8311r7961j25122M36706j59912K71225
2094.6F88950119k83203l66058l97339m97361n5770n69306K09046l0289p5150J52207
2104.3F87036896K25754L5553l99247J01700n68619k75497k70615q4762j22071l91006
2113.9F85288086M36630j15280J76621O2866K01034j52740p30820l38440n85022K40097
2123.6F84483032j03454J80435J2741j48087N99823j00937l1433p59201j45263k9297
2133.2F83958359n06897M23202M08783L08075k62909L03345j03836m86450J9531k96783
2142.9F83764420J602j20163n1651j29166N62973L15094J0452K23847o16455L3951
2152.5F83994904l43857k64740j08261j85318L50418K14386Q04062K78015p2098m97131
$$ plain form
2162.1 684170380 683999939 684167557 683707504 683690643 683594818 684280472 684680252 684485779 684618683 684904099
2171.8 684904099 685015182 684364319 684148331 683853989 684108582 684168854 684138412 684887085 685058136 685325470
2181.4 685325470 684991837 685000153 685072632 684969711 685007782 684364471 684375381 684552917 685018005 685126038
2191.1 685126038 685346756 685777740 685668411 685669556 684987183 684752350 684715347 685157166 685412216 685176392
2200.7 685176392 685663605 685719299 686237640 686543198 686663818 686492157 685864716 685479431 684946060 685364532
2210.4 685364532 685653458 685790024 685923538 686372070 686903152 686409073 686159439 685930862 685826492 685384445
2220 685384445 685436707 686084595 686182556 686326218 686333618 686630020 686414032 686429214 686517487 686133347 686048431
2230.6 686048431 685632248 685777054 685842056 685783691 686117020 686665268 686780548 686538239 686637726 686131134
$$ packed form
2162.1F84170380j70441J67618m60053j6861r5825O85654L99780j94473J32904K85416
2171.8F84904099J11083o50863k15988k94342K54593O0272l0442P48673J71051K67334
2181.4F85325470l33633Q316P2479j02921L8071o43311J0910J77536M65088J08033
2191.1F85126038K20718M30984j09329J145o82373k34833l7003M41819K55050k35824
2200.7F85176392M87213N5694N18341L05558J20620j71661o27441l85285n33371M18472
2210.4F85364532K88926J36566J33514M48532N31082m94079k49634k28577j04370m42047
2220F85384445N2262O47888R7961J43662P400K96402k15988J5182Q8273l84140q4916
2230.6F86048431m16183J44806O5002n8365L33329N48248J15280k42309R9487n06592
$$ plain form
2240.3 686131134 686126862 685963593 685601349 685772552 685841675 686174850 686240997 686129303 685822601 685905838
2249.9 685905838 685675812 685432663 685655441 685600433 685975266 685714340 685613251 685632706 685760956 686112061
2259.5 686112061 685893097 685770874 685145569 685112686 685166092 685673523 686327286 685928879 686003876 685837097
2269.2 685837097 685688400 685232010 685022583 685101471 684927597 684934158 684793854 685234070 685036087 685088348
2278.8 685088348 685095825 684872513 684970245 684415665 684661407 684558105 684485321 684364777 684141006 684426346
2288.5 684426346 684200897 684157257 683557587 683562775 683701096 683657074 683292084 682302780 682737274 683077087
2298.1 683077087 683720398 683795853 683290100 683333130 682733841 682492828 681990051 681634827 681371155 681003494
2307.8 681003494 680797501 681169662 681937103 681903763 681997910 681342010 681307602 681200485 680113831 679659576
$$ packed form
2240.3F86131134m272j63269l62244J71203O9123L33175O6147j11694l06702Q3237
2249.9F85905838k30026k43149K22778n5008L74833k60926j01089J9455J28250L51105
2259.5F86112061k18964j22223o25305l2883N3406N07431O53763l98407P4997j66779
2269.2F85837097j48697m56390k09427P8888j73874O561j40304M40216j97983N2261
2278.8F85088348P477k23312R7732n54580K45742j03302p2784j20544k23771K85340
2288.5F84426346k25449m3640n99670N188J38321m4022l64990r89304M34494L39813
2298.1F83077087O43311P5455n05753M3030n99289k41013n02777l55224k63672l67661
2307.8F81003494k05993L72161P67441l3340R4147o55900l4408j07117j086654m54255
$$ plain form
2317.4 679659576 679164200 679618912 679844284 680069504 680205002 680019455 679803467 679350891 679258270 678840561
2327.1 678840561 679392776 678789902 678526917 679246979 678957214 678674240 678077545 678931274 678434448 677062378
2336.7 677062378 676259003 675507812 675379562 675676651 677460785 677500458 676916656 676715240 677080536 676932449
2346.3 676932449 675595703 675519028 675681381 675930023 675602341 675664215 675887527 675776443 676308975 675307007
2356 675307007 675441971 675424728 674525681 672177658 671517410 672862854 671951141 673038635 674109344
2364.7 674109344 674466324 673794861 673475266 673119049 671594467 671164856 671364212 672786255 672484131
2373.3 672484131 672623749 673926849 674250412 674032898 672974854 672827759 672294006 671812592 671623535
2382 671623535 671331177 671851883 672083435 672219772 671996918 671974945 671659622 670799866 670241089 669489975
$$ packed form
2317.4F79659576m95376M54712K25372K25220J35498j85547k15988m52576r2621m17709
2327.1F78840561N52215o02874k62985P20062k89765k82974n96695Q53729m96826j372070
2336.7F77062378q03375p51191j28250K97089J784134L9673n83802k01416L65296j48087
2346.3F76932449j336746p6675J62353K48642l27682O1874K23312j11084N32532j001968
2356F75307007J34964j7243q99047k348023o60248J345444r11713J087494J070709
2364.7F74109344L56980o71463l19595l56217j524582m29611J99356J422043l02124
2373.3F72484131J39618J303100L23563k17514j058044j47095n33753m81414j89057
2382F71623535k92358N20706K31552J36337k22854k1973l15323q59756n58777p51114
$$ plain form
2391.7 669489975 669151077 668878021 669119186 669458313 669421921 669254608 668820038 668589020 667961273 667366180
2401.3 667366180 666782684 666427917 666194839 666114044 666581116 666933594 667231369 666752396 666312485 665719070
2410.9 665719070 664793701 664149857 663438339 663418427 663456345 663630295 663700104 663796463 663693161 662922897
2420.6 662922897 662512436 661612625 660615387 659950562 659858398 659924393 659826889 660178223 660358429 660340424
2430.2 660340424 659670181 659042053 658122101 657093887 656584015 656047592 656205826 656282272 656725998 656944580
2439.9 656944580 656772919 656623230 655777817 655236282 654319305 653379898 652746658 652715607 653193512 653270798
2449.5 653270798 653222809 652857971 652661667 651882095 651220779 650866547 650107269 649372940 648697128 648817749
2459.2 648817749 648665314 648851166 649292831 649293365 649005051 647914505 646991959 645802841 645282516 645124130
$$ packed form
2391.7F69489975l38898k73056K41165L39127l6392j67313m34570k31018o27747n95093
2401.3F67366180n83496l54767k33078q0795M67072L52478K97775m78973m39911n93415
2410.9F65719070r25369o43844p11518j9912L7918J73950O9809R6359j03302p70264
2420.6F62922897m10461q99811r97238o64825r2164O5995r7504L51334J80206j8005
2430.2F60340424o70243o28128r19952j028214n09872n36423J58234P6446M43726K18582
2439.9F56944580j71661j49689q45413n41535r16977r39407o33240l1051M77905P7286
2449.5F53270798m7989l64838j96304p79572o61316l54232p59278p34329o75812J20621
2459.2F48817749j52435J85852M41665N34k88314j090546r22546j189118n20325j58386
$$ plain form
2468.8 645124130 644741821 644876328 645072632 645270233 644448090 643807144 643588486 642992630 642027054 640999374
2478.5 640999374 640608292 640115128 640152512 640345764 640369949 639975777 639341087 639123154 638405685 637560234
2488.1 637560234 636344833 635816154 635739288 635145836 635106621 635228539 635123901 634612846 634264984 633500595
2497.7 633500595 632647476 632051544 630957527 630356903 630068550 630152893 630186195 630134583 629994392 629421921
2507.4 629421921 628728752 627453728 626485825 625882721 625562248 625376816 625281029 625261192 624845123 624685898
2517 624685898 624220352 623571777 622712746 621889191 621230164 620643578 620891304 621021004 621272736 621261711
2526.7 621261711 620683136 620103722 619709282 619166451 617798920 617113419 616719055 616319237 616176147
2535.4 616176147 616157837 616423454 616033936 615603943 615185890 614523087 613738403 613131409 612290268 611412277
$$ packed form
2468.8F45124130l82309J34507J96304J97601q22143o40946k18658n95856r65576j027680
2478.5F40999374l91082m93164L7384J93252K4185l94172o34690k17933p17469q45451
2488.1F37560234j215401n28679p6866n93452l9215J21918j04638n11055l47862p64389
2497.7F33500595q53119n95932j094017o00624k88353Q4343L3302n1612j40191n72471
2507.4F29421921o93169j275024r67903o03104l20473j85432r5787j9837m16069j59225
2517F24685898m65546o48575q59031q23555o59027n86586K47726J29700K51732j1025
2526.7F21261711n78575n79414l94440n42831j367531o85501l94364l99818j43090
2535.4F16176147j8310K65617l89518m29993m18053o62803p84684o06994q41141q77991
$$ plain form
2545 611412277 611651726 611967506 612185631 611921196 611497574 611027298 610256271 609669647 608512154 607988853
2554.6 607988853 607957153 608002281 608081932 607821579 607772713 607364311 606966476 606327744 605466614 604666176
2564.3 604666176 603988113 603508911 603314629 603647194 603516121 603498993 603138161 602471390 602026291 601469994
2573.9 601469994 601187363 600315475 599670143 599229965 598903389 598977699 599105949 599250450 598591843 598036957
2583.6 598036957 597337646 596432266 595423012 594576111 594736824 594836655 594832993 594461975 594055481 593459892
2593.2 593459892 592793045 592671356 592174873 591391563 590363617 589941635 589921532 589813576 589464378 588915138
2602.9 588915138 588738022 588079109 587595749 587027245 586178894 585302086 584454155 584217529 583801422 583530960
2612.5 583530960 583439407 583525238 583161621 582343826 581700630 580744705 580027618 579108734 578510475 578301086
$$ packed form
2545F11412277K39449L15780K18125k64435m23622m70276p71027n86624j157493n23301
2554.6F07988853l1700M5128P9651k60353m8866m08402l97835o38732q61130q00438
2564.3F04666176o78063m79202j94282L32565j31073j7128l60832o66771m45099n56297
2573.9F01469994k82631q71888o45332m40178l26576P4310J28250J44501o58607n54886
2583.6E98036957o99311r05380j009254q46901J60713R9831l662l71018m06494n95589
2593.2E93459892o66847j21689m96483p83310j027946m21982k0103j07956l49198n49240
2602.9E88915138j77116o58913m83360n68504q48351q76808q47931k36626m16107k70462
2612.5E83530960r1553Q5831l63617q17795o43196r55925p17087r18884n98259k09389
$$ plain form
2622.1 578301086 578186874 578250504 577849922 577403069 576712570 575884399 574899368 574357147 573814926 573137932 572936897
2632.8 572936897 572255478 571925659 571491699 571250153 571144638 570547409 570098114 568961105 567938576
2641.4 567938576 567137108 567059250 567154465 566693039 566543045 565664444 565041924 564856682 564185371 563260536
2651.1 563260536 562877159 562616882 561823654 561573677 561127968 560945702 560792809 560038185 559537926 559219818
2660.7 559219818 559342842 558907471 557940216 557272110 557034378 556738052 556253166 556010895 555308647 554635811
2670.4 554635811 554289894 554297104 554192200 553452339 552878685 552883492 553025093 552512360 551948662 551365433
2680 551365433 550841370 550253792 549376640 549030228 548769493 548796959 548922882 548880386 548515167 547643661
2689.6 547643661 547030373 546681786 546233330 545532646 545380020 545230179 544896660 544758263 544551506 544504890
$$ packed form
2622.1E78301086j14212O3630m00582m46853o90499q28171r85031n42221To76994k01035
2632.8E72936897o81419l29819m33960k41546j05515n97229m49295j137009j022529
2641.4E67938576q01468p7858R5215m61426j49994q78601o22520j85242o71311r24835
2651.1E63260536l83377k60277p93228k49977m45709j82266j52893p54624n00259l18108
2660.7E59219818J23024m35371r67255o68106k37732k96326m84886k42271p02248o72836
2670.4E54635811l45917P210j04904p39861n73654M807J41601n12733n63698n83229
2680E51365433n24063n87578q77152l46412k60735K7466J25923m2496l65219q71506
2689.6E47643661o13288l48587m48456p00684j52626j49841l33519j38397k06757m6616
$$ plain form
2699.3 544504890 543948631 543481903 542874718 542224884 541854858 541276093 541027679 540618973 540516167 540369949
2708.9 540369949 540096016 539898949 539426918 539011192 538333092 538233795 538059654 537536621 537060204 536848984
2718.6 536848984 536929665 536465149 536765556 536774902 535757828 534928703 534609146 534507408 533965530 533872833
2728.2 533872833 533727989 533489609 533351784 533039513 532978706 532950859 532890396 532328758 531838951 531496582
2737.9 531496582 531251945 530944138 530566063 530798149 530532303 530265465 530174370 529690666 529089890 528624229
2747.5 528624229 528598976 528562126 528537521 528392715 528486938 528244133 527630501 527508621 527280312 526931534
2757.2 526931534 526211205 525915108 525796280 525242119 525059242 525032539 525259895 525215950 524727592 524163475
2766.8 524163475 523662682 523069382 522606125 522547302 522287598 522264557 522086029 521499290 520498619 519559059
$$ packed form
2699.3E44504890n56259m66728o07185o49834l70026n78765k48414m08706j02806j46218
2708.9E40369949k73933j97067m72031m15726o78100r9297j74141n23033m76417k11220
2718.6E36848984Q0681m64516L00407R346j017074q29125l19557j01738n41878r2697
2728.2E33872833j44844k38380j37825l12271o0807k7847o0463n61638m89807l42369
2737.9E31496582k44637l07807l78075K32086k65846k66838r1095m83704o00776m65661
2747.5E28624229k5253l6850k4605j44806R4223k42805o13632j21880k28309l48778
2757.2E26931534p20329k96097j18828n54161j82877k6703K27356m3945m88358n64117
2766.8E24163475n00793n93300m63257n8823k59704k3041j78528n86739j000671r39560
$$ plain form
2776.4 519559059 519605331 519461212 519010277 518666573 518394852 518049698 517569733 517023277 516366463 516167068
2786.1 516167068 516017761 515692215 515137405 514365044 513724937 513119469 512456970 511921120 511712151 511158600
2795.7 511158600 510715294 510461617 509660301 508752441 508011627 507613831 507300911 506608543 505679970 505235481
2805.4 505235481 504653130 503426094 502440796 502094994 502003365 501095161 500000534 498877182 498109207
2814 498109207 497986832 497204781 496633377 496114235 495268593 493906097 492570381 492267952 491427574 490477676
2823.7 490477676 489768715 488937225 488426323 487987518 487069702 485721550 485067291 484433517 483267479
2832.4 483267479 481882973 480840721 480329132 479461594 478452110 477207184 476010132 474707451 472672234
2841.1 472672234 470668945 468974037 467249031 465454369 463795853 461947250 459818878 457992210
$$ packed form
2776.4E19559059M6272j44119m50935l43704k71721l45154m79965n46456o56814j99395
2786.1E16167068j49307l25546n54810p72361o40107o05468o62499n35850k08969n53551
2795.7E11158600m43306k53677q01316r07860p40814l97796l12920o92368r28573m44489
2805.4E05235481n82351j227036r85298l45802r1629r08204j094627j123352p67975
2814D98109207j22375p82051n71404n19142q45642j362496j335716l02429q40378r49898
2823.7D90477676p08961q31490n10902m38805r17816j348152o54259o33774j166038
2832.4D83267479j384506j042252n11589q67538j009484j244926j197052j302681k035217
2841.1D72672234k003289j694908j725006j794662j658516j848603k128372j826668
$$ plain form
2848.8 457992210 456783142 455399933 453694267 452174988 450871429 450326271 449698944 449236374 449511070
2857.4 449511070 449456787 449077682 448532944 448097382 447756462 447437973 446752205 445920639 445132027 443923798
2867.1 443923798 443047409 442246094 441489868 440645332 440037766 440034561 439430008 438294182 436961021 436165504
2876.7 436165504 435479050 434577560 434008751 433588753 433271675 432231369 431444435 431030655 429970436
2885.4 429970436 428755951 427762604 426803932 425327950 424316216 423501091 422323303 421366768 420762062
2894.1 420762062 420425301 419691925 418951988 418110199 417289352 416441498 415315132 414653587 414285660
2902.8 414285660 414073029 413262177 412359009 411737671 410570679 409580879 408785782 407839394 406867752
2911.4 406867752 405983086 405223503 404313049 402583694 400940933 399864578 398424225 397445183 396369743
$$ packed form
2848.8D57992210j209068j383209j705666j519279j303559n45158o27327m62570K74696
2857.4D49511070n4283l79105n44738m35562l40920l18489o85768q31566p88612j208229
2867.1D43923798q76389q01315p56226q44536o07566l205o04553j135826j333161p95517
2876.7D36165504o86454r01490n68809m19998l17078j040306p86934m13780j060219
2885.4D29970436j214485r93347r58672j475982j011734q15125j177788r56535o04706
2894.1D20762062l36761p33376p39937q41789q20847q47854j126366o61545l67927
2902.8D14285660k12631q10852r03168o21338j166992r89800p95097r46388r71642
2911.4D06867752q84666p59583r10454j729355j642761j076355j440353r79042j075440
$$ plain form
2920.1 396369743 395197449 394474030 393834801 393505058 392789345 391971970 391067123 390726509 391275024
2928.8 391275024 391501236 391418114 391483688 392073288 392309113 392321777 392717438 392889099 392900314 393390198
2938.5 393390198 394226875 394642143 395490227 396937027 397950172 398185196 398569260 399373665 399714355
2947.1 399714355 400377998 401117783 401800613 402503128 402925034 403680649 404123001 404417343 405094566 405994759
2956.8 405994759 406586914 406888962 407388535 407837906 408459663 409293900 410262527 410791893 411028366 411732330
2966.4 411732330 412810135 413564873 413921356 414929466 415769043 416263962 416854172 417310104 417891273
2975.1 417891273 418564796 419603195 420317688 420783081 421411285 422015724 422217674 421722527 421737785 422218285
2984.7 422218285 422426186 422365417 422560043 422960243 423548470 424081573 423915596 423992500 423530731 422743950
$$ packed form
2920.1C96369743j172294p23419o39229l29743p15713q17375r04847l40614N48515
2928.8C91275024K26212q3122O5574N89600K35825J2664L95661J71661J1215M89884
2938.5C93390198Q36677M15268Q48084J446800J013145K35024L84064Q04405L40690
2947.1C99714355O63643P39785O82830P02515M21906P55615M42352K94342O77223R00193
2956.8D05994759N92155L02048M99573M49371O21757Q34237R68627N29366K36473P03964
2966.4D11732330J077805P54738L56483J008110Q39577M94919N90210M55932N81169
2975.1D17891273O73523J038399P14493M65393O28204O04439K01950m95147J5258M80500
2984.7D22218285K07901o0769J94626M00200N88227N33103j65977P6904m61769p86781
$$ plain form
2994.4 422743950 422600441 422709274 422961426 422458153 421792068 421284752 420856819 420379868 420006371 419962158
3004 419962158 419344635 418777008 418390961 418148918 417667160 416895561 416218987 415473366 415093880 414072647
3013.7 414072647 413191185 412760201 411986847 411388054 410825653 410417824 409654961 409179268 408862152 408043518
3023.3 408043518 407329140 406184044 404921684 403901672 403247452 402941475 402472534 401726036 400730515
3032 400730515 399793129 399388962 398904381 397539062 396457977 395754433 394980736 394054222 393417854 393248215
3041.6 393248215 392173157 391113052 390367661 389539871 388540802 387340660 386833267 386210213 385589676
3050.3 385589676 384858665 383769608 382758675 381962967 381509132 380462494 379411049 378476448 377517395
3059 377517395 376644554 375650520 375126953 374585724 373888741 372975502 372304344 371861115 371083870 370440369
$$ packed form
2994.4D22743950j43509J08833K52152n03273o66085n07316m27933m76951l73497m4213
3004D19962158o17523n67627l86047k42043m81758p71599o76574p45621l79486j021233
3013.7D14072647q81462m30984p73354n98793n62401m07829p62863m75693l17116q18634
3023.3D08043518p14378j145096j262360j020012o54220l05977m68941p46498r95521
3032D00730515r37386m04167m84581j365319j081085p03544p73697r26514o36368j69639
3041.6C93248215j075058j060105p45391q27790r99069j200142n07393o23054o20537
3050.3C85589676p31011j089057j010933p95708m53835j046638j051445r34601r59053
3059C77517395q72841r94034n23567n41229o96983r13239o71158m43229p77245o43501
$$ plain form
3068.6 370440369 369584999 368482628 367317390 366472549 366032982 365636368 365112457 364486656 363823051
3077.3 363823051 362847061 361973419 361114197 360523567 359964485 359268150 358895569 358097420 357366753 356761322
3087 356761322 356248970 355585861 354416695 353645630 352860680 352149239 351458015 350585175 350029411 349514198
3096.6 349514198 348737564 347953529 347321053 346507034 345738068 344826088 344052086 343610649 342985001 342261314
3106.2 342261314 341564369 341163445 340318375 339498940 338900948 337839737 336900749 335867195 335176506
3114.9 335176506 334504471 333576241 333092346 332509804 331620979 330763474 329963531 329037170 328505516 327922668
3124.6 327922668 326859245 325826416 325177116 324930992 324289665 323387909 322396393 321820526 321138840
3133.3 321138840 319806976 319244518 318748169 317954426 317162418 316508522 315914764 315060349 314285259
$$ packed form
3068.6C70440369q55370j102371j165238q44841m39567l96614n23911o25801o63605
3077.3C63823051r75990q73642q59222n90630n59082o96335l72581p98149p30667o05431
3087C56761322n12352o63109j169166p71065p84950p11441o91224q72840n55764n15213
3096.6C49514198p76634p84035o32476q14019p68966r11980p74002m41437o25648p23687
3106.2C42261314o96945m00924q45070q19435n97992j061211r38988j033554o90689
3114.9C35176506o72035r28230m83895n82542q88825q57505p99943r26361n31654n82848
3124.6C27922668j063423j032829o49300k46124o41327r01756r91516n75867o81686
3133.3C21138840j331864n62458m96349p93743p92008o53896n93758q54415p75090
$$ plain form
3141.9 314285259 313064384 312131138 311639900 311007957 310367928 309668198 309067001 308241367 307735710
3150.6 307735710 307207737 306198215 305308781 304333820 303244362 302328167 301981087 301357937 300025730
3159.3 300025730 299203701 298827782 298136082 297634048 297167358 296115856 295372143 294901867 294281693
3168 294281693 293315582 291749783 290603943 290474262 290401745 289453449 288423195 287956200 287724972 286849117
3177.6 286849117 285557098 284810009 283851013 283325157 283043900 282013416 281085281 280672626 280424194
3186.3 280424194 279676056 278976479 278326283 277417336 276417351 275428829 275274696 275153599 274313087 273223228
3195.9 273223228 272319775 271560116 270867348 270446301 270041428 269485855 268552513 268073425 267893696 267158890
3205.6 267158890 266452827 265844021 265485058 265076752 264199810 263057156 262284832 261925430 261347771
$$ packed form
3141.9C14285259j220875r33246m91238o31943o40029o99730o01197q25634n05657
3150.6C07735710n27973j009522q89434r74961j089458r16195l47080o23150j332207
3159.3C00025730q22029l75919o91700n02034m66690j051502p43713m70276o20174
3168B94281693r66111j565799j145840j29681p2517r48296j030254m66995k31228q75855
3177.6B86849117j292019p47089r58996n25856k81257j030484r28135m12655k48432
3186.3B80424194p48138o99577o50196r08947r99985r88522j54133j21097q40512j089859
3195.9B73223228r03453p59659o92768m21047m04873n55573r33342m79088j79729p34806
3205.6B67158890p06063o08806l58963m08306q76942j142654p72324l59402n77659
$$ plain form
3214.3 261347771 260935688 260523357 259958134 259273262 258509007 257668686 256988316 256669693 255883389 255127831
3223.9 255127831 254618511 254398174 254262505 253496780 253009224 252621174 251990852 251180325 250548573 250457439
3233.5 250457439 249977360 249000492 248142509 247911701 247719288 247204647 246485786 245471687 244825764
3242.2 244825764 244472733 244276466 244037609 243597279 243409767 242908154 242208157 242092686 241759033 241267929
3251.9 241267929 241259956 240764732 239973793 239475307 239033241 238515415 237977600 237724304 237247410 236732635
3261.5 236732635 236221027 235455227 234838486 234365749 234267788 234061317 233791046 233895817 233607864 232866039
3271.2 232866039 232409706 232127190 231875591 231877079 231191444 230202351 229843445 229657612 229555550 229273872
3280.8 229273872 228810596 228232632 227861958 227865486 227964706 227898769 227454033 226994858 226429558 226363907
$$ packed form
3214.3B61347771m12083m12331n65223o84872p64255q40321o80370l18623p86304p55558
3223.9B55127831n09320k20337j35669p65725m87556l88050o30322q10527o31752r1134
3233.5B50457439m80079r76868q57983k30808j92413n14641p18861j014099o45923
3242.2B44825764l53031j96267k38857m40330j87512n01613o99997j15471l33653m91104
3251.9B41267929p973m95224p90939m98486m42066n17826n37815k53296m76894n14775
3261.5B36732635n11608p65800o16741m72737r7961k06471k70271J04771k87953p41825
3271.2B32866039m56333k82516k51599J488o85635r89093l58906j85833j02062k81678
3280.8B29273872m63276n77964l70674L528R9220o5937m44736m59175n65300o5651
$$ plain form
3290.4 226363907 226543713 226130352 225779133 225406532 225123672 225031719 224606495 223736916 223287792 223451309
3300.1 223451309 223349876 223021870 222493668 222170067 222076797 221986904 221962891 221550999 220932770 220138912
3309.7 220138912 219591293 219351387 219030819 219112415 219136715 218544445 218040543 218058834 218018913 217754803
3319.4 217754803 217145176 216424103 216180363 215858135 215426350 215179539 214704285 213825207 213271790 213101940
3329 213101940 212442837 211501560 210762501 210414619 210237312 210123005 210016575 209699936 209242363 208571815
3338.7 208571815 207968102 207300625 206836586 206678276 206254692 205921822 205468636 204918900 204996471 205375347
3348.3 205375347 204682884 203854637 204302425 204069214 203138485 202687569 202600937 202813396 202637863 202670116
3357.9 202670116 202979832 202610931 201892700 201269608 200920258 201056633 201422882 201158180 200581837 200791855
$$ packed form
3290.4B26363907J79806m13361l51219l72601k82860r1953m25224q69579m49124J63517
3300.1B23451309j01433l28006n28202l23601r3270q9893k4013m11892o18229p93858
3309.7B20138912n47619k39906l20568Q1596K4300n92270n03902J8291l9921k64110
3319.4B17754803o09627p21073k43740l22228m31785k46811m75254q79078n53417j69850
3329B13101940o59103r41277p39059l47882j77307j14307j06430l16639m57573o70548
3338.7B08571815o03713o67477m64039j58310m23584l32870m53186n49736P7571L78876
3348.3B05375347o92463q28247M47788k33211r30729m50916q6632K12459j75533L2253
3357.9B02670116L09716l68901p18231o23092l49350J36375L66249k64702n76343K10018
$$ plain form
3367.6 200791855 200985584 200572567 200395565 200348835 200012589 199432373 199156761 199316597 199400063 199691410
3377.2 199691410 199728985 199402542 199055557 198650074 198652954 198611813 198843098 199114475 198622704 198458786
3386.9 198458786 198660088 198524151 197984524 197732449 198091602 198342438 198281918 198250732 198421268 198369331
3396.5 198369331 198049908 197900124 197938328 198014202 198105106 198245754 198298206 198238449 198283901 198589077 198682232
3407.1 198682232 198797970 199022846 198756294 198559380 198315601 198307686 199102364 199648170 199695797 199674644
3416.8 199674644 199692726 199996719 200105133 199734535 200379257 201270981 201167564 201215477 201506710 201934967
3426.4 201934967 202161751 202139149 202346306 202816315 203483715 203542843 203726177 204318714 204739113 205043716
3436.1 205043716 205030575 205302505 205833035 206390266 207001057 207493095 207537823 207526302 208251991 209077759
$$ packed form
3367.6B00791855J93729m13017j77002m6730l36246n80216k75612J59836Q3466K91347
3377.2A99691410L7575l26443l46985m05483K880m1141K31285K71377m91771j63918
3386.9A98458786K01302j35937n39627k52075L59153K50836o0520l1186J70536n1937
3396.5A98369331l19423j49784L8204P5874R0904J40648N2452n9757M5452L05176R3155
3407.1A98682232J15738K24876k66552j96914k43779p915P94678N45806M7627k1153
3416.8A99674644J8082L03993J08414l70598O44722Q91724j03417M7913K91233M28257
3426.4B01934967K26784k2602K07157M70009O67400N9128J83334N92537M20399L04603
3436.1B05043716j3141K71930N30530N57231O10791M92038M4728j1521P25689Q25768
$$ plain form
3445.7 209077759 209697895 209472675 209431973 210513744 211041222 211287651 211895123 212409592 212902584 213464699
3455.3 213464699 213778896 214173107 214998436 215339241 215968494 216993961 217484837 218350506 219093170
3464 219093170 219325352 219778214 220261898 220846329 221466465 221889191 222486515 223113422 223906155 225006371
3473.7 225006371 225696774 225981655 226601715 227707958 228526764 229171600 229804859 230394516 231405220
3482.3 231405220 232100105 233008366 233900814 234248123 234958496 235444851 236145382 237162361 237707214
3491 237707214 238590698 239713306 240076122 240728245 242140961 242887192 243811665 244955292 245548134
3499.7 245548134 246435032 247598171 248360748 248748207 249705791 250703812 251464157 252474613 253660297
3508.4 253660297 254763927 255719433 257021370 257963505 258660755 259443436 260520344 262015743 262740364
$$ packed form
3445.7B09077759O20136k25220m0702J081771N27478K46429O07472N14469M92992N62115
3455.3B13464699L14197L94211Q25329L40805O29253J025467M90876Q65669P42664
3464B19093170K32182M52862M83684N84431O20136M22726N97324O26907P92733J100216
3473.7B25006371O90403K84881O20060J106243Q18806O44836O33259N89657J010704
3482.3B31405220O94885R08261Q92448L47309P10373M86355P00531J016979N44853
3491B37707214Q83484J122608L62816O52123J412716P46231R24473J143627N92842
3499.7B45548134Q86898J163139P62577L87459R57584R98021P60345J010456J185684
3508.4B53660297J103630R55506J301937R42135O97250P82681J076908J495399P24621
$$ plain form
3517.1 262740364 263047543 263786201 265332985 266594753 267274246 268139553 268970203 270587921 271939774
3525.7 271939774 272669811 273784046 275171566 276451435 277688217 278907928 279580326 280489902 281765881
3534.4 281765881 283805504 285274086 285565491 287354832 289036293 289862080 290511570 291713371 293147907
3543.1 293147907 294128780 295591488 297036705 298821945 299681301 300904713 302556190 303750324 305520687
3551.8 305520687 306256161 308049126 309907227 311528778 313645420 314822292 316980820 318882141
3559.5 318882141 319858246 320701180 322633095 324405632 325270195 328762970 331692162 333280945 333777199
3568.2 333777199 333948402 336735344 338422546 339950142 342110939 344477539 346161804 347858810
3575.9 347858810 350371628 351837997 354199104 355968399 356886292 358776550 361007538 363241348
$$ packed form
3517.1B62740364L07179P38658J546784J261768O79493Q65307Q30650J617718J351853
3525.7B71939774P30037J114235J387520J279869J236782J219711O72398R09576J275979
3534.4B81765881K039623J468582K91405J789341J681461Q25787O49490J201801J434536
3543.1B93147907R80873J462708J445217J785240Q59356J223412J651477J194134J770363
3551.8C05520687P35474J792965J858101J621551K116642J176872K158528J901321
3559.5C18882141R76105Q42934J931915J772537Q64563L492775K929192J588783M96254
3568.2C33777199J71203K786942J687202J527596K160797K366600J684265J697006
3575.9C47858810K512818J466369K361107J769295R17893J890258K230988K233810
$$ plain form
3583.6 363241348 364898529 368259926 370313759 370136566 372250862 373602409 376658020 379856300
3591.3 379856300 382568741 384848938 387056236 390342064 390832253 393065758 396729393 397963219
3599 397963219 400124741 401961021 403897057 406560249 408677559 410680466 413253403 416469154 417504654
3607.7 417504654 420695000 422484322 423073463 429304085 432084122 432242851 436205330 436475639 439937248
3616.4 439937248 444849319 447077103 449881592 450766373 452028427 455735741 459431458 461926956
3624.1 461926956 464584503 466935272 469475708 475896149 480043297 475655861 478860168 482756233
3631.8 482756233 487318420 490148659 490678101 493809242 497128792 500276642 502412033 504144707
3639.5 504144707 507317963 510580711 513054008 514924316 517113991 520620575 526506615 527453766
$$ packed form
3583.6C63241348J657181L361397K053833j77193K114296J351547L055611L198280
3591.3C79856300K712441K280197K207298L285828M90189K233505L663635J233826
3599C97963219K161522J836280J936036K663192K117310K002907K572937L215751J035500
3607.7D17504654L190346J789322N89141O230622K780037J58729L962479K70309L461609
3616.4D39937248M912071K227784K804489Q84781J262054L707314L695717K495498
3624.1D61926956K657547K350769K540436O420441M147148m387436L204307L896065
3631.8D82756233M562187K830239N29442L131141L319550L147850K135391J732674
3639.5E04144707L173256L262748K473297J870308K189675L506584N886040R47151
$$ plain form
3647.3 527453766 524909477 530102577 533812828 534871712 534737015 539176140 543566322 547603607
3655 547603607 553841171 549164925 550234222 555413589 557527809 560261002 561843109 564543114 565904922
3663.6 565904922 566969528 569124680 570605965 574983101 577392578 578181534 580689812 576771431
3671.4 576771431 578008347 584077415 592201996 594152184 580918007 582637939 589325333 594682312
3679.1 594682312 594174004 593853111 596165390 598188248 599714584 600676308 601383362 604784012 610434608
3687.8 610434608 604273415 601437950 609467735 606912804 605241394 609568939 610974693 612193184
3695.5 612193184 612412720 612197418 613557510 614501457 616761932 619435768 616774330 615166512 618865852
3704.1 618865852 619868355 619217415 619997482 622309990 625699234 619318161 622244606 630419693 620063629
$$ packed form
3647.3E27453766k544289N193100L710251J058884j34697M439125M390182M037285
3655E47603607O237564m676246J069297N179367K114220K733193J582107K700005J361808
3663.6E65904922J064606K155152J481285M377136K409477P88956K508278l918381
3671.4E76771431J236916O069068Q124581J950188j3234177J719932O687394N356979
3679.1E94682312n08308l20893K312279K022858J526336R61724P07054L400650N650596
3687.8F10434608o161193k835465Q029785k554931j671410M327545J405754J218491
3695.5F12193184K19536k15302J360092R43947K260475K673836k661438j607818L699340
3704.1F18865852J002503o50940P80067K312508L389244o381073K926445Q175087j0356064
$$ plain form
3712.8 620063629 621251640 624892120 624882431 625534286 627873688 629630775 626977081 627456055 632399254
3721.5 632399254 630812683 626572495 630236244 631893578 632059212 630489235 629531937 632249947 632633476
3730.2 632633476 636591835 634447327 627326889 636070099 639164658 632294960 632640953 633768539
3737.9 633768539 633536682 635358849 638459549 634805603 636301689 647334213 643684387 626430359
3745.6 626430359 633098564 637641983 642081223 640313110 630981865 640561523 640495377 633378639 637596855
3754.3 637596855 641278152 644165573 639673500 641148987 646723404 640598526 638579674 642082825
3762 642082825 643261337 643237076 646389618 645304718 641330795 643965378 648456955 649382858 641781464
3770.7 641781464 642727890 645463104 645552597 646169891 645789261 646307068 646186905 648794937 650220413
$$ packed form
3712.8F20063629J188011L640480r689O51855K339402J757087k653694M78974M943199
3721.5F32399254j586571m240188L663749J657334J65634j569977r57298K718010L83529
3730.2F32633476L958359k144508p120438Q743210L094559o869698L45993J127586
3737.9F33768539k31857J822167L100700l653946J496086J1032524l649826j7254028
3745.6F26430359O668205M543419M439240j768113r331245R579658o6146p116738M218216
3754.3F37596855L681297K887421m492073J475487N574417o124878k018852L503151
3762F42082825J178512k4261L152542j084900l973923K634583M491577R25903p601394
3770.7F41781464R46426K735214Q9493O17294l80630N17807j20163K608032J425476
$$ plain form
3779.4 650220413 644168167 645622330 647537994 647919159 648835297 647005310 646900635 648217239 648279800
3788 648279800 648262787 648679123 649085083 649135437 649429321 649352341 649715042 652209396 650727310 646763992
3797.7 646763992 647558365 650280762 655849915 652822571 642991409 645710449 647143860 650584259
3805.4 650584259 656261520 650237427 646075516 649504929 651586304 651496353 651169434 651259155 652324219
3814.1 652324219 656411896 655290527 644274673 647504349 651890488 655565643 659303284 647374725
3821.8 647374725 646339035 649933319 650887070 652445450 653074112 650586166 650420761 651853714 654479370
3830.5 654479370 656341248 649684677 650354691 656042786 651359100 650583801 658751450 653767319 648060379
3839.2 648060379 653750458 650108109 649152222 655339890 654827347 651775131 653602753 654072876 653214111
$$ packed form
3779.4F50220413o052246J454163J915664L81165R16138j829987j04675J316604O2561
3788F48279800j7013M16336M05960N0354K93884p6980L62701K494354j482086l963318
3797.7F46763992P94373K722397N569153l027344r831162K719040J433411L440399
3805.4F50584259N677261o024093m161911L429413K081375q9951l26919Q9721J065064
3814.1F52324219M087677j121369j1015854L229676M386139L675155L737641j1928559
3821.8F47374725j035690L594284R53751J558380O28662k487946j65405J432953K625656
3830.5F54479370J861878o656571O70014N688095m683686p75299Q167649m984131n706940
3839.2F48060379N690079l642349r55887O187668n12543l052216J827622M70123q58765
$$ plain form
3847.8 653214111 654048233 652830658 653789368 658779602 654907990 656382370 647477188 645985489 654309464
3856.5 654309464 654145660 651669998 652810745 654752502 657361374 653067093 651990280 656768036
3864.2 656768036 653221817 649671326 652598114 655770721 660790939 656906967 647622681 649219208
3871.9 649219208 653888779 657714920 650984116 650990524 654447403 653927231 655274811 659353027 656657486
3880.6 656657486 649886169 653361816 654408875 655497513 660760956 651194153 650322723 653257370
3888.3 653257370 653539276 656627274 656558151 651076431 651852798 654202957 652364120 652854843 653512497
3897 653512497 654541931 656950455 650324249 653842545 656862564 652411346 655654526 653962860 651959229
3905.7 651959229 651960831 652354279 654145660 654458847 654436035 654079437 654133987 653901215 652614670 652830582
$$ packed form
3847.8F53214111Q34122j217575R58710M990234l871612J474380q905182j491699Q323975
3856.5F54309464j63804k475662J140747J941757K608872m294281j076813M777756
3864.2F56768036l546219l550491K926788L172607N020218l883972r284286J596527
3871.9F49219208M669571L826141o730804O408L456879n20172J347580M078216k695541
3880.6F56657486o771317L475647J047059J088638N263443r566803q71430K934647
3888.3F53257370K81906L087998o9123n481720P76367K350159j838837M90723O57654
3897F53512497J029434K408524o626206L518296L020019m451218L243180j691666k003631
3905.7F51959229J602L93448J791381L13187k2812l56598N4550k32772j286545K15912
$$ plain form
3915.3 652830582 655583344 654410019 651270981 654622192 655226135 652037735 653352585 654495773
3923.1 654495773 654554520 653229218 651199112 652066193 653122864 653831940 653756027 653415909 654814911
3931.7 654814911 653314438 651377640 651941376 652199860 652510681 652201385 652454605 653454590 653383713
3940.4 653383713 654364319 655408249 652509079 651420364 652256393 652456207 653148422 651058121 651126022
3949.1 651126022 652857819 651673965 652594528 652901001 652469254 652223434 652194672 652843628 652121277
3957.8 652121277 652598267 653118057 653569183 653210831 651338730 651582336 652095261 651915512 651719284
3966.5 651719284 651837006 651443710 650798416 650744019 651162109 652156754 652288666 652521820 652424011 651807175
3976.1 651807175 651728287 652206879 652594376 652059860 652370300 652503815 652289276 652447357 652617493 652922134
$$ packed form
3915.3F52830582K752762j173325l139038L351211O03943l188400J314850J143188
3923.1F54495773N8747j325302k030106Q67081J056671P09076p5913l40118J399002
3931.7F54814911j500473j936798N63736K58484L10821l09296K53220R99985p0877
3940.4F53383713R80606J043930k899170j088715Q36029J99814O92215k090301O7901
3949.1F51126022J731797j183854R20563L06473m31747k45820k8762O48956p22351
3957.8F52121277M76990N19790M51126l58352j872101K43606N12925j79749j96228
3966.5F51719284J17722l93296o45294n4397M18090R94645J31912K33154r7809o16836
3976.1F51807175p8888M78592L87497n34516L10440J33515k14539J58081J70136L04641
$$ plain form
3985.7 652922134 652726974 652571869 652182999 652329025 652155533 651701202 652011948 652095413 652690506 653032074
3995.4 653032074 653244476 652886887 652123489 652348404 653005829
4000.2 653005829
$$ packed form
3985.7F52922134j95160j55105l88870J46026j73492m54331L10746Q3465N95093L41568
3995.4F53032074K12402l57589p63398K24915O57425
4000.2F53005829
##END=$$ End of the data block
