##TITLE=$$ Begin of the data block
##JCAMP-DX=5.00 $$ ACD/SpecManager v 10.08
##SPECTROMETER/DATA SYSTEM=Varian
##DATE=14 Jan 2013 10:02:16
##DATA TYPE=INFRARED SPECTRUM
##DATA CLASS=XYDATA
##ORIGIN=
##OWNER=
##NPOINTS=3735
##FIRSTX=399.26403809
##LASTX=4000.35498047
##MAXX=4000.35498047
##MINX=399.26403809
##MAXY=70.48970795
##MINY=19.81555939
##XFACTOR=1.0000000000
##YFACTOR=0.000000100000000
##FIRSTY=42.33372879
##DELTAX=0.96440572
##XUNITS=1/CM
##YUNITS=TRANSMITTANCE
##XYDATA=(X++(Y..Y))
399.3 423337288 419634514 411656799 413559494 413947449 410282135 406650658 407167702 411661835 414456215
407.9 414456215 414734726 409711609 406169472 403373032 403958168 410810471 410965347 412231445 415105019
416.6 415105019 406557388 399445724 414219246 415509377 412861633 412174911 408553810 400248375
424.3 400248375 399074554 403713646 405222931 410000992 410191422 406950035 407525940 405702477 403193169
433 403193169 402619743 402860603 398801079 395717926 399284897 401382408 403646812 408079681 410504723
441.7 410504723 408901062 404946480 400166473 400991859 406818581 409144363 410434189 409794388 405606232
450.4 405606232 405853577 405926399 401149673 399829979 398390541 396847343 400371666 400111656 398412132
459.1 398412132 399302063 399652596 398825912 395204468 394795914 397503700 399842339 400227432 398337326
467.7 398337326 398068695 394948807 392851830 395961418 394792900 390436554 388028603 386142693 389175453
476.4 389175453 392632332 391485100 390542755 391024399 389298019 386091843 385244827 387655792 387309418
485.1 387309418 383524132 382138824 383130684 385220795 386355095 384886436 385346184 387050323 386213837
493.8 386213837 383284035 384036522 387163010 385913925 383725777 383841972 387375450 387702675 381441460
502.5 381441460 379984589 380297356 380025826 378712654 379096603 382063866 381084366 379480476 377149467
511.1 377149467 374895096 376418419 376805267 375545616 374615173 373334007 373647995 373245087 371492691
519.8 371492691 371953430 371768036 372124672 372725639 370799980 369663429 369785538 371124115 371045723
528.5 371045723 369430542 369782410 369940262 368876801 367845726 367685852 367326851 367321091 366836967 365678520
538.1 365678520 367009392 368571472 369428177 369344635 367488823 365375023 364154243 363825836 362322807
546.8 362322807 361013985 361044998 361340981 362334404 362570305 360235825 359198952 360009117 359171448
555.5 359171448 358121147 356534500 356476173 357897034 358401146 358004303 356942825 357704353 357526360
564.2 357526360 357662849 358159447 356752701 356593933 357060966 358930931 358776093 356950836 357907791
572.9 357907791 358736687 357865219 357383728 358064232 356806107 356238060 357270966 357683716 357540588
581.5 357540588 356436729 356810265 357249756 357183762 357347488 357439995 357317810 356292763 356646996 357119484
591.2 357119484 358243904 359490776 359629784 360332298 359671593 359549561 360816498 361012154 360281830
599.9 360281830 359307747 358223763 357212105 357805443 359406166 359913635 359052391 358007507 356738129
608.5 356738129 355368042 354306412 353352585 353380585 353647423 354048576 354068108 353655663 353944969 353460617
618.2 353460617 352569466 352628746 352918663 352789612 353275719 354218254 355606613 357265663 357600708 357498093
627.8 357498093 358327026 360222015 361377678 362020721 363096466 364620132 366923599 368094139 369186745
636.5 369186745 371701698 373920403 374721107 374797058 375199318 376090546 377205620 378265839 379321518
645.2 379321518 380243797 381469650 382817802 384102936 384302788 383230209 383809547 385287094 385895958
653.9 385895958 386017494 386254158 386694794 386624336 386721115 387507362 387907066 386212158 384222412 383329010
663.5 383329010 383623810 385843124 386486168 385508575 385779343 386645851 387662239 387717438 388234558 389192696
673.2 389192696 389852371 391122093 391926079 392742958 394216881 396432457 398100052 399065056 400478554
681.8 400478554 401717606 402854881 402893639 402485123 402597656 403129501 406097412 409174423 409421921
690.5 409421921 409271889 409623642 409503937 409775085 410600967 411199265 412452507 413939209 414326744
699.2 414326744 414326324 415167732 416405678 416491890 416215935 416418114 416943550 417727051 418221016 419181633
708.8 419181633 420607948 421873589 422952843 423973503 424719582 424622536 424811134 425450172 426357689
717.5 426357689 427279930 427530289 427953148 428979607 430432472 431142578 431144524 431763535 432796173 433742485
727.2 433742485 434221535 435181046 437004356 438023033 438529778 440476990 441957207 441545219 441734505
735.8 441734505 442391167 442409439 442253761 442883453 444205132 445250854 445966454 446847305 447996407
744.5 447996407 448685684 449351883 449748154 449898033 450207748 449949608 449702301 450613441 452713165 454104576
754.2 454104576 455374565 456394768 456577950 458248940 460118828 460981560 461619072 463012657 464146118
762.8 464146118 464846764 466488762 467291832 467619743 467757912 467551384 467171555 467752914 469025993
771.5 469025993 468548698 468316612 468257751 468304863 469367409 470604630 470776329 470021400 470251389 469540367
781.2 469540367 469372139 470830994 471549377 471406364 471472473 472686691 473096924 473101540 472855110 473097916
790.8 473097916 474986305 475928497 474893913 473870010 474907303 475010185 473807640 472895088 472533646
799.5 472533646 472370720 470773582 470027695 469293861 467582588 466448135 465924454 464559174 461772804
808.2 461772804 459635658 457838440 456411591 454967728 453537865 452433891 451498184 451184654 450337486
816.9 450337486 449572067 448997231 449268417 449994621 449955597 449735909 449772377 452103996 455352325 458467369
826.5 458467369 461149483 463294449 466582870 469511032 471735916 473325119 475746613 478721962
834.2 478721962 481168785 483733444 486364098 489633636 491858826 493868790 495411339 496798286
841.9 496798286 498118019 498564148 499569206 499696121 501078987 502924767 504544868 506161270 506609459
850.6 506609459 508688126 510889091 511993523 512246857 512826576 513929558 515287628 516723022 518151360
859.3 518151360 520794411 522090302 523601303 524438057 523791351 523246269 522203026 522535820 522303429
868 522303429 521239128 518718300 515855484 514104156 511994400 509764824 506743011 504126053 501907234
876.7 501907234 501935997 503257523 503459167 503509216 503173599 503613510 502731628 500704498 499759598 500508041
886.3 500508041 500355988 498635330 498618011 498382988 499035339 499552879 499443588 500028534 499882393 500390816
895.9 500390816 500443001 500474205 500050392 500001144 500465698 499735336 499634209 499679871 500385246 501650848
905.6 501650848 504763069 508246689 510013046 512447548 514774818 516766968 516865273 516477280 516236916
914.3 516236916 514987793 513457870 510939865 508197098 505138168 503144341 501211586 498557968
922 498557968 496115990 493269348 490081177 485914650 482101784 478620796 475233459 471794128 468590736
930.7 468590736 466046906 463565979 462628632 461622734 459850845 458510361 457212296 455687675 454038506
939.3 454038506 452981911 452079010 451172752 449648628 448994408 448986778 447867241 447490387 446815987 446197968
949 446197968 446688766 446998138 447072563 447108307 446663246 445492096 444332123 442501030 440817642 439188271
958.6 439188271 436908798 434402542 431830826 430070763 427533836 425372620 424260178 422656097
966.3 422656097 420800629 418341179 416479912 414492264 412213211 410080910 407455025 405237923
974.1 405237923 402291908 398679581 394703445 390728989 387245865 382800331 378323059 373502426
981.8 373502426 368324699 363465500 357651367 352242470 347334747 342903214 338964195 334886894
989.5 334886894 330752449 326324425 322805405 319372044 316536217 313860779 310351276 306742382
997.2 306742382 303274899 300846786 297595234 294587078 291799412 288911743 286838074 284256554
1004.9 284256554 282153168 279758015 278138180 276652412 274481335 272241364 269900837 268756313
1012.6 268756313 266630859 264578457 262529106 260030041 258035316 256269073 255111008 252683163
1020.3 252683163 250143661 247659092 245405293 243752766 242514305 241429539 239636536 238517876
1028.1 238517876 236940823 236131668 235562973 234627857 233978462 232954903 232928848 233541451 234962025
1036.7 234962025 235617638 237267056 239807796 241642303 243438740 244314842 245962963 246502762 246559944
1045.4 246559944 246601715 246118965 245534649 244149055 243533192 241765995 240345211 239343166 238372726
1054.1 238372726 237710133 236017380 235074654 234019928 234084797 234207230 235101986 236914864 238374271
1062.8 238374271 240572281 242246170 244883366 246522484 247778149 248899879 249777489 251163120
1070.5 251163120 251342354 251901932 251680450 252314777 253059559 252932014 252958069 253055630 254358578 254636574
1080.1 254636574 255668106 256541157 257382717 258491173 259122562 260955048 261827068 263597393 265414219
1088.8 265414219 266921387 268318634 269051857 270843258 272574062 274162998 275187397 277117500
1096.5 277117500 278891106 280305901 281963959 282831707 284616241 286479664 288606873 290376492
1104.2 290376492 291773891 292521725 293544483 295278225 295442371 296425629 297141838 297981548 299066391
1112.9 299066391 299528217 301233673 302538567 304015751 304849968 304817905 304398746 303640385 303870144
1121.6 303870144 304648876 305772343 305971966 306266384 307072296 308031750 309068966 310026302 311838360
1130.3 311838360 313796654 316360130 318880787 321344261 323760757 325926857 328415985 330936775
1138 330936775 333503342 335446396 337513275 339149323 339939690 341030273 342486153 343288689 343330765
1146.7 343330765 344327698 345340157 345766296 345789375 345896912 346380577 345961037 345222130 344301147 343881035
1156.3 343881035 343545799 342689018 342288437 341457176 340903740 340769615 340976295 341652222 342193909 343591843
1166 343591843 346022911 348539543 350777359 353464584 356700592 359970665 362571335 365535393 369011154
1174.6 369011154 372073860 375000763 377746048 380551491 383239784 386325607 389159470 391569099
1182.4 391569099 393701782 395415459 397319450 398534698 399647026 400808830 401446915 401877327 402136612
1191 402136612 401836700 401642227 401336823 400228233 399805527 398905754 397320976 396365700 395666351 394652519
1200.7 394652519 393044586 391815720 390372925 388979492 388273087 387437210 386574020 385638084 385218239
1209.4 385218239 384849815 384181633 383855972 383595009 383110237 382277870 381806564 381590500 381318359 380833168
1219 380833168 380399475 380339928 379781876 378980064 377968254 377112541 376454773 375574951 374853821 373986855
1228.6 373986855 373437080 372748604 371873093 371520386 371288605 370696068 369507256 368982201 368407745
1237.3 368407745 367581673 367667809 367637634 367472954 367539635 367787247 367447243 366586876 365874825 365168686
1247 365168686 364652786 364024620 363660545 363366089 363067513 363062630 363261414 363760452 363714294 363342628
1256.6 363342628 362694206 362011986 361817169 361781502 362202148 362543678 362569542 363055420 364102516 364958763
1266.3 364958763 365890045 366602287 366741486 367274704 368151588 369035339 369699135 370631447 372026253
1274.9 372026253 373293533 374179802 375400276 376780777 377465363 378299980 379004478 380054588 381782951
1283.6 381782951 383546562 385258980 386564293 388104401 389574127 390761185 391655540 392736168
1291.3 392736168 393955574 394672966 395288429 395995522 397100372 397700500 398235207 399146996 399669228
1300 399669228 399772911 399695511 399637756 399267845 399181900 398896065 398702278 398717575 398024025 397621155 397319069
1310.6 397319069 396757927 395901413 394911385 394081802 393568840 393538704 393759689 394388847 394908371 395567627
1320.3 395567627 396583977 397485352 398045998 398443069 399086990 399439545 399807930 399988937 399992027 399978752
1329.9 399978752 399915466 399579239 398698006 398426132 398377075 398013573 397230186 397129402 397622643 397509346
1339.6 397509346 398379745 399250984 400187569 401060791 401513443 402206497 402849770 403675804 403896370 404322090
1349.2 404322090 404462891 404483833 404615631 403830223 403120384 402218819 401871109 401622581 401457825 401297417
1358.8 401297417 400856972 400602226 399757538 399374466 398538361 398513451 398588791 397786674 397159424 395896950
1368.5 395896950 395177155 394520454 394164658 394048653 393527184 393656158 393846931 394032364 393503036 393074188
1378.1 393074188 392390633 391956215 391896973 390898972 389761124 388160553 386937561 385537186 384301605
1386.8 384301605 382637787 380434036 379235001 377141457 375067749 373107643 371193542 368737183
1394.5 368737183 365834694 364542732 362707100 360884018 358075714 355522537 353958511 351638603
1402.2 351638603 349515305 347466278 344703598 342259483 340989265 339484444 337334099 335473976
1409.9 335473976 333357201 332144928 331251221 330029984 328791618 327285194 326290627 324948120 324192238
1418.6 324192238 323147964 323544159 324365845 324018898 324243698 323986053 324943733 325893822 325898132 326497040
1428.3 326497040 327195740 328956909 329901772 331818695 333553696 334546432 336062927 337276115 340225487
1437 340225487 341600533 344023743 345939369 347816734 349979324 351280785 353554993 355264320 357364006
1445.6 357364006 358420258 359617577 361579323 362916946 364696541 365629158 367690544 368568497 370008125
1454.3 370008125 372064362 373566093 375710297 374898186 378802643 380616341 382679291 384395256
1462 384395256 385786858 387835312 388410263 391655846 394084816 397322731 400077400 402269173 404963722
1470.7 404963722 406963043 410817451 412830429 416372871 419254112 422339554 425712929 428244476
1478.4 428244476 430964661 432559090 434766235 437247429 439238434 440777283 441998444 443637886
1486.1 443637886 444865303 445805054 446410713 446836395 447995529 448890915 449394417 448881378 448062630
1494.8 448062630 447318268 444738998 444695778 444218407 442489662 442069397 441088142 439585228 438686714
1503.5 438686714 438868217 437884483 432678261 431151009 433395958 434898186 434811707 434712029 433479424
1512.2 433479424 432806168 432917671 432263680 431456757 429141197 428834877 430043602 430938187 430639992
1520.8 430639992 429439011 429972534 431168518 432684631 432888870 433234482 433730240 434809303 436057854
1529.5 436057854 436836815 437451210 437474976 437803421 437225113 438301697 439127045 439170113 439492912 437782173
1539.2 437782173 439345932 439267960 438846970 439466171 441167564 442176361 441289482 442173004 442088165
1547.9 442088165 442022781 441389084 441255569 442264328 442546577 443229294 440913467 440897560 441500282 441216698
1557.5 441216698 438367119 434206047 436603317 434686279 434677849 433253822 431797752 429181671 426460953
1566.2 426460953 424961357 422106361 420820999 413992004 411741028 409548073 405544243 401951790
1573.9 401951790 398533936 397282867 386391144 384916954 381633949 377006645 372805672 367143898
1581.6 367143898 363306732 357540054 353996925 348625145 344457626 340463257 335100403 331622238
1589.3 331622238 325556908 322210464 317013111 313725834 309656525 304900265 302295837 297376251
1597 297376251 295099907 290398254 288419018 285169754 281748104 279319630 274965076 274365711 271055012
1605.7 271055012 269910202 267078896 265632019 264686375 261798763 261723862 259165516 259275970 257316952
1614.4 257316952 257157650 256315632 252032280 254320564 253400497 254954281 253685074 254389591 253869476
1623.1 253869476 252746429 254560642 254195938 256496658 255527153 257246265 257546749 258335304 259942970
1631.7 259942970 260061016 262121868 260956268 263832397 264102306 267074986 269328594 270392017 272616158
1640.4 272616158 272624855 275422363 276386414 278817081 280526619 280508804 284162941 284296570 287861729
1649.1 287861729 288351841 291096230 292955742 291489697 295164795 295982113 300467968 301793480 304364166
1657.8 304364166 305654087 307838249 310701046 312817974 315960579 317211514 321415024 323665276
1665.5 323665276 326397057 328659782 330503006 334388428 336574402 342107620 345598946 349891777
1673.2 349891777 353490601 357197762 361159439 364075165 368547935 371756477 376366234 379834747
1680.9 379834747 384402885 388996773 391043777 398847885 401800690 407994308 412811661 417328835
1688.6 417328835 421853714 426317406 431331749 435182266 439809113 444341469 449312515 453313103
1696.4 453313103 458909073 464681091 469995384 475868835 476060333 481582794 486185455 489949608
1704.1 489949608 493189735 496992416 501023521 504619408 508417969 511048393 513272438 515717125
1711.8 515717125 518176804 520221367 520917625 521987114 524992065 527291946 525600739 529065475
1719.5 529065475 532369690 534460335 535944977 536990318 537911873 539185028 540832787 542093887
1727.2 542093887 543617249 545279770 545699844 547044754 550076027 552116394 550204124 550011520 553986511
1735.9 553986511 557517166 559229965 561465530 563682365 564247589 567711143 570460815 572071037
1743.6 572071037 574725494 578607330 581964264 583830948 586330986 588672256 593190918 596270065
1751.3 596270065 598292732 602873993 606148720 608820648 611365051 612901077 615363274 618420982
1759 618420982 620941467 623646049 623905716 624851990 628135223 630021210 632092476 634015541 635900040
1767.7 635900040 635967445 637519302 640512543 640428085 640304565 639878731 643082581 645337601 645029449
1776.4 645029449 646991959 648039322 649507599 650376511 650769730 651852493 652847519 654165878 654123001
1785.1 654123001 654811249 656031418 656957779 657589340 658572235 659302597 660253372 659762268 659305649
1793.8 659305649 662205734 662993469 663128281 664127808 665158539 666168137 665812225 667420731 667788925
1802.4 667788925 668908310 670655212 671346512 672151031 672191467 672683105 673249283 674234695 673875122
1811.1 673875122 674277725 676011505 676878662 677978439 678287811 678964615 678987045 679273529 679908218
1819.8 679908218 679912949 680681229 680915833 682458038 683686218 682466354 682201996 683292999 684569702
1828.5 684569702 684328537 682912216 683742676 685623169 685966568 686534805 687194290 687460327 688105316
1837.2 688105316 688017197 688744125 688581009 688868790 688994751 689438858 690626526 688438568 690202484
1845.8 690202484 691698456 691916885 691645660 691879501 692640839 692355499 693183365 693547363 693846512
1854.5 693846512 693847122 694007568 694651031 694459915 694789963 694578934 695120850 695384903 695597076 695962524
1864.2 695962524 695983734 696642456 696368179 696815567 696145172 695817261 696467285 697044373 697955399 698019867
1873.8 698019867 698771744 698906479 699428558 699735413 699539490 699619293 699190750 699673996 699236984 699273529
1883.4 699273529 699381638 699566116 700197601 699896164 700646896 700719223 700390625 700614548 700812149 700603256
1893.1 700603256 700392380 700466156 700200424 701338577 701823807 702077179 702447739 702554474 702569733 702031097
1902.7 702031097 702130280 701519012 701666794 702065048 702285919 702882462 703015060 703470230 703475647 703877487
1912.4 703877487 703247223 702744370 702503433 702007370 702584229 701869965 702363510 703337097 704122009 704703064
1922 704703064 704205780 703739548 703436356 703542633 702819366 702948074 703692627 704007187 704347992 704487228
1931.7 704487228 704897079 704480896 704463272 703962021 703454971 703278275 702748718 703209000 703431549 704169617
1941.3 704169617 704114532 703648834 704312744 704510574 704132080 703209381 703090820 703202438 703519287 703361893
1951 703361893 703364563 703890762 703823242 703974991 703519897 703398209 702984238 702534943 702291870 701798782
1960.6 701798782 702244492 702580261 703245697 703243866 703294678 703461456 702993469 702822495 702123184 702103195
1970.2 702103195 701976089 702030411 702271957 702559280 703111420 703145599 703537521 703194656 703147049 702988815
1979.9 702988815 702360153 701880341 701428299 701747437 701837311 702474823 702457199 702296829 702284088 701654053
1989.5 701654053 701947937 701509171 700549011 700007935 700412903 701021652 701166382 701287537 700975952 701212006
1999.2 701212006 701296005 701476364 701129074 700570984 700411530 700006866 699876099 699382629 699782562 700158539
2008.8 700158539 700060501 699892273 699495697 699568024 699393463 699261017 698621063 698308640 698122253 698323059
2018.5 698323059 698750763 698234406 698411942 698174438 698033218 697709274 697497025 697789154 697332306 697274780
2028.1 697274780 696817703 696918106 697145767 697158508 697120972 696542816 696134262 695478897 695782471 695689240
2037.7 695689240 695530014 695612640 695309601 695333252 694848785 694976349 694847183 694828873 694941940 694947815
2047.4 694947815 695179749 694785538 694548416 694056015 694199371 693938293 693553925 693471603 693036804 693350677
2057 693350677 693170013 693568954 693645401 693308182 693128586 692791748 692948761 692591553 692882080 692696381
2066.7 692696381 692721634 692682114 692032242 692354889 692438431 692898407 692506104 692241821 692406387 691867218
2076.3 691867218 691532669 691019745 691215668 691370163 691705780 691674500 691592255 692180939 692188187 691783905
2086 691783905 690678024 690565948 690862808 690797043 690558777 690489044 690906448 690564804 690749435 690625458
2095.6 690625458 690321274 690035248 689590225 689377823 688564224 688507080 688487701 688672562 688976898 689013367
2105.2 689013367 688940887 688606491 688611603 688105164 688055420 687692719 687310791 687068634 686739807 687407761
2114.9 687407761 687319107 687496262 687491302 687107010 686887131 686531677 686652222 686426468 686347122 686042023
2124.5 686042023 686275787 686687393 686782913 686817856 686369324 686609039 686162643 685659409 685535202 685363922
2134.2 685363922 685491867 685842056 686414871 686108170 686292267 686438217 686336136 686180954 685509644 685170135
2143.8 685170135 684841309 685084381 685123367 685530167 686083908 686163788 686184845 685716553 685824432 685678101
2153.5 685678101 685558014 685345306 685301056 685655365 685565262 685996552 686238632 686492157 686137085 685746384
2163.1 685746384 685603409 685143204 685311661 685198135 685819550 686507492 686492996 686354446 686521606 686858978
2172.8 686858978 686307144 686038895 685819702 686016846 686154404 686151581 686472244 686470184 686917572 686884918
2182.4 686884918 686918259 686968689 687037354 686874008 686169434 686308212 686351013 686645126 686803131 687105865
2192 687105865 687449799 687421799 687705460 687390518 687192230 686773300 686814804 686861954 686844025 687551727 687473755
2202.6 687473755 687644043 687798309 688101273 688127060 687686310 687446289 686778183 686803360 687118378 687544937
2212.3 687544937 687771072 688180084 688469772 688013687 687898712 687787170 687944946 687468491 687357559 687830887
2221.9 687830887 687982788 688267517 688002014 688357773 688642120 688625031 688320465 687595978 687311020 687236938
2231.6 687236938 687623520 687657928 687830200 687918472 688076782 688496628 688338013 688164215 687829590 688015442
2241.2 688015442 687961273 687794189 687733231 687540207 687844009 687848816 687848969 687647934 687773285 687756958 687574387
2251.8 687574387 687514191 687062683 687282639 687199936 687304764 687573624 687817993 687938995 687399139 687385178
2261.5 687385178 687222061 687110519 686980362 687395630 687944565 687805786 687702103 687341919 687348633 686893005
2271.1 686893005 686744843 686768188 686701889 687025604 686821442 687074814 687077484 687278900 687144089 686763763
2280.8 686763763 686750793 686259232 686389236 686198273 686296234 686384277 686254883 686119461 685688629 685921402
2290.4 685921402 685427856 685393295 685574036 685487976 685192413 684474258 684761581 685160446 685600586 685229034
2300 685229034 685115891 685198593 684539261 684414444 683871765 683216248 682314758 682281418 682534561 682949677
2309.7 682949677 683782883 683326111 683471527 683418274 683201523 682577515 681581268 681136322 680730438 681272354
2319.3 681272354 681083832 681349716 681470566 681229019 681386566 680977020 680493927 679947052 680995636
2328 680995636 680748978 680123749 680169067 679936142 679600296 678524551 679340439 679180374 678743210 677614899
2337.7 677614899 676103058 676628876 677270432 678463364 678310089 679012222 679029617 678247299 678097382
2346.3 678097382 677115936 677216187 677199478 677622070 678116684 677671051 677261505 677307281 676968536 675503006
2356 675503006 675810623 675334854 675360794 674986649 673482590 673585205 673857803 675001755 675590515 676167374
2365.6 676167374 675384064 675183105 674551773 673506622 674065628 674128952 675478287 675001221 674541855
2374.3 674541855 675462265 675374222 675094147 674384613 674210510 673605804 673164291 672984009 672934799 673344955
2383.9 673344955 673080368 673197556 673674850 674035492 673386459 672661057 672238541 671321487 671046524 670494232
2393.6 670494232 670418396 670804596 671033020 671117935 670896912 670741196 669903107 669406586 668778152 668437424
2403.2 668437424 668540344 667970200 668016510 668458939 668618393 668065186 667604523 667108002 666307526 665721893
2412.9 665721893 664883728 664454956 664478607 664703979 664780197 665142899 665135117 664633408 664360809 663406677
2422.5 663406677 662658615 661877213 661509857 661546936 661636887 662300873 662317123 662028961 661427917 660855560
2432.2 660855560 659994659 659068756 658468399 657739716 657899475 657767487 657505798 657665787 658064499 658099060
2441.8 658099060 657654572 657148819 655738907 655149841 654719696 654185791 654087296 654034119 654590149 654595566
2451.5 654595566 654604874 653858490 652752075 652151260 651374130 650950546 650475082 650465164 650372162 650452652
2461.1 650452652 650705795 650564346 650259399 649343796 648466873 647278061 646488342 646285095 646297836 646469574
2470.7 646469574 646592102 646845551 646373367 645848541 644866562 643817368 643092194 642469330 642390289 641760788
2480.4 641760788 641610107 641676559 641505737 641394882 641124344 640682068 639840889 639391136 638446732 637761497
2490 637761497 637622375 637222557 637056313 636751022 636592369 636075478 635390282 634719543 633897285 633195648
2499.7 633195648 632646141 632153549 631695175 631892090 631832848 631660042 631366539 631023064 630743752 629400673
2509.3 629400673 628179207 627495575 627202415 626871567 626517868 626391258 626358948 626447334 625855713 625217552
2519 625217552 624225845 623594170 623121872 622243996 622255020 622245522 622608681 622783241 622579231 622155113
2528.6 622155113 621209526 620325775 619193230 618889999 618559456 618233833 618153191 617742195 617867317 617613487
2538.2 617613487 616994553 616444550 615965576 615219383 614737778 614244652 613512154 613737831 613705940 613541260
2547.9 613541260 613242264 612885933 612483444 611711159 611352272 610419846 609519272 609185371 609367676 609469986
2557.5 609469986 609344444 609450111 608928299 608589668 607860756 606818733 606116486 605472298 605126228
2566.2 605126228 605089302 605381584 605117645 604942818 604746513 604374199 603797722 602733192 602147102 601575279
2575.9 601575279 601052094 600341835 600257721 600536613 600184708 600106163 600028152 599926224 599130974 598236084
2585.5 598236084 597194214 596242943 596352921 596390533 596425705 596002769 595847435 595454788 594583282 594159889
2595.1 594159889 593075485 592257538 591694221 591319923 591235275 591161156 590835495 590177689 590103149 589831543
2604.8 589831543 589289093 588511772 587869644 587081413 586121750 585633011 585028419 585072060 584874725 584650650
2614.4 584650650 584415665 583511047 582945328 582333183 581955223 581246300 580404358 579882736 579567146 579450188
2624.1 579450188 578999596 578420410 577642441 577171822 576253166 575522804 575114899 574395638 574383354 573929062
2633.7 573929062 573487511 573106384 572985764 573017616 572187653 571238594 569953918 569326820 568708458 568134651
2643.4 568134651 568231697 567862740 567457390 566732941 566162758 565812416 565429726 564852066 564032288 563529205
2653 563529205 563006935 562799263 562467957 562032051 561694870 561218491 560811577 560439072 560074730 559624367
2662.6 559624367 559325104 558758621 558437576 558309822 558131752 557991028 557234840 556657524 556127129 555923767
2672.3 555923767 555589905 554709244 554397774 554367714 554437180 554046593 553648415 553112755 552229996 551759377
2681.9 551759377 551253471 550889702 550511360 550267487 550136604 549741478 549260788 549010277 548831635 548204193
2691.6 548204193 547540092 546858139 546461754 546050453 545861969 546174393 546137581 545925941 545193100 544508896
2701.2 544508896 544026184 543791504 543656502 542849464 542286491 542046814 542048302 541956978 542098541 541975365
2710.9 541975365 540886841 540173759 539738007 539749031 539606743 539075241 538651390 538316994 538553772 538502197
2720.5 538502197 538174973 537668076 536977501 536480484 536208458 536039238 535604286 535149574 534682198 534540520
2730.2 534540520 534419327 534434280 534615173 534182320 533809624 533648605 533475800 533082581 532573929 532086411
2739.8 532086411 531869736 531927605 531981049 532241287 531987305 531424942 530633049 530183678 530275574 530223999
2749.4 530223999 530456886 530095177 529740410 529614334 529288368 528934708 528349991 528186417 527801361 527352333
2759.1 527352333 526957932 526612892 526204872 525633202 525938530 526253395 526265221 525800133 525208054 524897842
2768.7 524897842 524270897 523947792 523840370 523888893 523682022 522911797 522047081 521604080 521357994 520786552
2778.4 520786552 520525551 520154572 519606705 519150772 518925591 518864365 518491173 518177223 517773781 517217560
2788 517217560 516419029 515886993 515498619 514839706 514275475 513525085 513166275 512843971 512391586 511809006
2797.7 511809006 510743256 509925346 509264183 508735466 508150520 507416954 506854248 506514587 505890884
2806.3 505890884 505023575 504589844 504141426 503408318 502399254 501587486 500819511 500223389 499800186
2815 499800186 498832741 498143425 497419930 496548080 495264168 494125481 493810196 492686310 491650581
2823.7 491650581 490985756 490225792 489667969 489009132 488313751 487343178 486356659 485372391 484483604 483452492
2833.3 483452492 482366219 481297340 480140457 479499626 478478394 477090263 475693474 474176826
2841.1 474176826 472459106 470386620 468419075 466493034 464865913 463121376 461286888 459550323
2848.8 459550323 457922630 456723480 455074081 453445053 452227478 451418037 451079025 450568199 450113182
2857.4 450113182 450004883 450035515 450039978 450020638 449487877 448800316 448180695 447499428 446972427 446090546
2867.1 446090546 445011940 443856354 443021660 442210999 441320801 440881920 440232277 439548988 438586731
2875.8 438586731 437643089 436939812 435946884 435174026 434734573 434346504 433678665 432990341 431922836
2884.4 431922836 430636597 429625778 428846016 428411407 427325249 426103554 424845123 423491020 422804871
2893.1 422804871 422192307 421667709 420892143 420021973 419242325 418274689 417246742 416386757 416248398
2901.8 416248398 415955963 415430298 414822159 413578186 412580872 411980934 411258621 410643768 409966316
2910.5 409966316 408955765 407885628 406423492 404732704 403264732 401938477 400803986 399452629
2918.2 399452629 398279305 397768402 397128296 395765228 394585114 394329910 394101410 393418312 392690811
2926.9 392690811 392418137 392471809 392548409 392578659 392574158 392807693 393238487 393624649 393907776 394467888
2936.5 394467888 395232048 395949020 396319008 396483955 396946449 397360764 398244019 399321289 400113564
2945.2 400113564 400868149 401176109 401741791 402751923 403524742 403904495 404207306 404733543 405559158
2953.9 405559158 406261559 406739883 407495956 408001442 408544006 408945122 409202499 409729347 410194283 411334534
2963.5 411334534 412359352 412942696 413324280 413591614 414315033 415113983 415886688 416498108 417500076
2972.2 417500076 418397293 419039421 419863892 420447960 421088066 421450577 422186813 422685966 422627411 423052368
2981.8 423052368 423485985 423737907 423526611 423643303 423864708 424110680 424720116 424972458 425397873 425387115
2991.5 425387115 425000572 424812737 424643822 424325294 423995819 423961716 423711395 423564835 423126068 422229462
3001.1 422229462 421648827 421720734 421647301 420784302 420195694 419797516 419588966 419109879 418217278 417606735
3010.8 417606735 417097931 416710281 415968323 415175171 414234352 413571587 413151550 412198334 411678429 411155815
3020.4 411155815 410519791 409896317 409055939 408314362 407787018 407038345 405730247 405010376 404591446
3029.1 404591446 404007111 403176155 402321930 401714172 400714722 399781570 398821640 398223152 397482414 396348534
3038.7 396348534 395826683 395294495 394911537 394210129 392932587 391854706 391041298 390093307 389121590
3047.4 389121590 388375397 387300186 386548195 385938835 385331116 384588127 383309822 382619057 381995964
3056.1 381995964 381039238 379981270 378924637 378098488 377530746 377278023 376706734 375786476 374926720
3064.8 374926720 374608536 374013748 372891426 372160110 371255379 370089760 368888931 368163948 367999382
3073.5 367999382 367771301 367119522 366174240 365450439 364698563 363728828 362587624 362131805 361768532
3082.1 361768532 360896683 360352402 359395409 358775673 358685493 358208122 357427788 356246109 355148659
3090.8 355148659 354068146 353349915 352992249 352356186 351734657 351077347 350420990 349825172 348867035
3099.5 348867035 347716637 346732979 345980759 345742264 345271683 344400330 343661194 343080864 342949066
3108.2 342949066 342355232 341451836 340775070 339865646 338843880 337839775 337152939 336257057 335252609
3116.9 335252609 334614143 333876839 332802658 332151566 332282791 331439400 329903755 329201660 328932152
3125.5 328932152 328355751 327451706 326694145 325765114 324796333 324018860 323553276 322957878 321767464
3134.2 321767464 320695267 319702816 318931885 318375530 317893028 317447357 317010498 316483784 315296993
3142.9 315296993 314044743 313131809 312519913 311641541 310545101 309893131 309144897 308791084 308301411
3151.6 308301411 307268143 306633110 305839539 304812737 303873920 303107376 302536221 301788101 301049633
3160.3 301049633 300487328 299776421 299033184 298205261 297229233 296450577 295868568 295423946 294470768 293369675
3169.9 293369675 292736931 291945000 291173916 290529823 289964008 289030914 288084087 287948246 287385883 286396713
3179.5 286396713 285688229 284756527 283898354 283394642 282822704 282327385 281905994 281069317 279883595
3188.2 279883595 278956909 278434010 277609215 277129021 276919155 276237259 275711040 274901695 273873196
3196.9 273873196 272697372 271942406 271755371 271119537 270803852 270216160 269449253 268840866 267966518
3205.6 267966518 267787094 267270145 266389637 265753956 264745770 264095268 263957367 263674698 262852478
3214.3 262852478 261813717 261236610 260916996 260383358 259530354 258540325 258258972 258151913 257478924
3222.9 257478924 257034149 256322708 255625553 255188065 254412498 254034061 253948345 253833771 253097897 252035751
3232.6 252035751 251372967 250816822 250677109 250225487 249412498 248872013 248387604 247982006 247361164 246789913
3242.2 246789913 246136990 245476494 245229530 244793072 244456005 244143963 243663979 243417835 242864418 242129765
3251.9 242129765 241633167 241396217 241179581 240665379 240245285 239610481 239092007 238890572 237964821 237098141
3261.5 237098141 237077045 236994076 236543999 236354046 235953693 235061989 234511280 234309483 234492435 234570732
3271.2 234570732 234014244 233073463 232300014 232088871 231774960 231520500 231204510 230723190 230528221 230522308
3280.8 230522308 230568466 229986553 229538727 229596367 229330482 228930378 228490944 228098965 227584457 227235813
3290.4 227235813 227005939 226348896 225905075 226188965 226564331 226099682 225322895 224894161 224439316 223887482
3300.1 223887482 223568249 223564377 223850002 223994637 223319073 222535648 222098866 222051582 222045021 221418686
3309.7 221418686 221136570 221071377 220354652 219266701 219133205 219732876 219449406 219067898 218833675 218400688
3319.4 218400688 217966576 217577515 217475166 216816444 215981598 215697079 215383453 214869747 214424114 214188232
3329 214188232 214108009 213656960 211972065 210702229 210988140 210978794 210479069 210206680 209933968 209469032
3338.7 209469032 208847370 208183689 207647552 207288361 206978397 207033863 207176800 206839600 206288528 205818253
3348.3 205818253 205532284 205118942 204590302 204442062 204227390 203863926 203653240 203345432 203381138 203669987
3357.9 203669987 203717117 203514156 203180618 203030872 202661037 202050533 201613579 201451015 201297264 201323833
3367.6 201323833 201957207 201954880 201138630 200376740 199963703 199785519 199684448 200256557 200455093 200049896
3377.2 200049896 200078278 200039349 199583759 198961239 198829594 198930073 199280529 199851875 199571419 199018402
3386.9 199018402 198753948 198722305 198726139 198515282 198445282 198550987 198522911 198432636 198969460 199517345 199073906
3397.5 199073906 198561020 198403072 198155594 198284988 198728981 198680248 198454552 198627987 199003487 199238567
3407.1 199238567 199479275 199443264 198952847 199129829 199750881 199817772 199735279 200125484 200509148 200447979
3416.8 200447979 200359821 200430031 200758419 200879707 200897579 201176319 201598892 202219105 202411270 202702084
3426.4 202702084 203140278 203066654 202949734 203064270 203539715 204020100 204188652 204277592 205022125 205785084
3436.1 205785084 206077232 206495018 206275902 206153183 206762447 207498283 207827320 208016491 208737278 209312801
3445.7 209312801 209727116 209677620 210224438 211317444 211904678 212658596 212831459 213120651 213864346 214498672
3455.3 214498672 215061111 215298042 216050053 216652813 217132454 217713146 218114662 218830128 219580917 220133839
3465 220133839 220654182 221494713 221623554 221807785 222707253 223582592 224940414 225867405 226556015 227097244
3474.6 227097244 227264938 227721081 228154125 229045467 230175991 230818806 231298218 232265396 232908020
3483.3 232908020 233313408 234237480 235279636 236525517 237200871 237531586 238295727 239478245 240628300
3492 240628300 241094856 241655674 242297783 242892914 243474789 244669952 246300373 247312050 247959385
3500.7 247959385 248540916 249886951 250831642 251077213 251796284 252431240 253414783 254650097 255799274
3509.4 255799274 256679268 258028736 259355850 259707680 260476933 261854248 263055573 263657570 264248791
3518 264248791 265065289 265978222 267248116 268558369 269771938 270804100 272315559 273479786 273801212
3526.7 273801212 274234638 275122013 276493378 278075237 279678650 280924625 282196007 283308926 284605618
3535.4 284605618 285899830 286671410 288098831 289581051 291288662 292298813 293057423 294582310 295880222
3544.1 295880222 297680206 298992729 300119247 300855827 301988144 303936844 305778694 307658081
3551.8 307658081 308069801 309758224 311950493 313358059 314812469 316035213 318537426 320718155
3559.5 320718155 322181778 322901459 324655304 327112732 328274040 331013756 332653313 334187431
3567.2 334187431 335407104 336111641 339294853 341142578 342767792 344728699 346905861 348599739
3574.9 348599739 350159264 352872810 354505844 356552887 358188972 359606438 361700897 363729134
3582.6 363729134 366121330 367784843 370609589 372551842 373503838 376124344 376991997 379348755 382258110
3591.3 382258110 385143204 387373123 389461937 392535744 393128471 395502090 399134102 400645638
3599 400645638 402875595 404927864 407234993 410417786 412685661 414334946 416749573 419695244 420641441
3607.7 420641441 423776360 425785027 426499748 432150917 434795341 435565033 439777756 440493851 444213066
3616.4 444213066 448164711 449300194 452699127 454327240 456009674 459494286 462684402 464807281
3624.1 464807281 467445755 470280304 472896729 478747025 481416206 476946220 481121140 486006622
3631.8 486006622 491310806 494262238 494433060 497202950 500863228 503929062 505364189 507473526
3639.5 507473526 510770187 513924904 516588364 518433304 521160240 524996986 530389671 531022301
3647.3 531022301 529115334 535050011 538006668 538495293 538475075 542506371 546906738 551086731 557245636
3655.9 557245636 552744827 554159927 559318504 560821686 562946930 564062500 567099838 569287491
3663.6 569287491 571313210 574215851 574716797 578556366 581335564 580812607 582838020 580548630 582363281
3672.3 582363281 588397865 595813026 597272339 586005859 586510124 592834930 598036766 596238327
3680 596238327 596348839 599263268 601269226 602791405 603422775 603690872 606984406 614269028 609570923
3688.7 609570923 604855270 611576080 608337250 607683640 612653923 614204369 615486946 616061440 615990562
3697.4 615990562 617167358 617864571 620000839 622835426 619219704 617123299 621229744 623313293
3705.1 623313293 623743591 624066429 625718079 629404602 624778786 627687531 633781509 622687035
3712.8 622687035 624450836 628531189 628723602 628813972 630177422 632555122 631386986 631659966 636530533
3721.5 636530533 634491768 629837532 634000320 636032562 635709000 633326645 632243690 634645195
3729.2 634645195 635133286 640106125 639665031 631345787 638031616 640984726 634557533 634794884 636111679
3737.9 636111679 636718788 639021683 642299652 639239731 639977074 649750519 645099335 629419746
3745.6 629419746 636877594 641994476 647383194 645781250 635887413 645259171 644144592 636918716
3753.3 636918716 641039352 644298706 647242126 642788773 643646240 649040375 643183060 641667709
3761 641667709 645446854 646205063 645827637 649012680 648440628 644217682 646099243 650253525 651906891
3769.7 651906891 646007690 647147522 649944305 650155029 650403061 649155121 649639511 650171509 652416534
3778.4 652416534 653316498 646759720 648151474 650243988 650581131 651765442 650103989 650118256 651408539
3787.1 651408539 651776810 652136078 652252579 651876602 651151886 651950455 652410812 653237228 655958176
3795.8 655958176 652985764 648926163 650563889 654129181 659791260 655511398 645574341 648772736
3803.5 648772736 651518326 655567780 661558228 655059891 649113083 651885757 653384399 653874207
3811.2 653874207 654819946 654675751 654817581 658758087 658656082 647923584 650446701 654626694 658750000
3819.9 658750000 662379303 650546112 649669952 653008270 654666061 656518555 656580048 653922119 653806839
3828.6 653806839 655451736 658077850 659647903 653029327 654081726 659954529 655632095 654706116
3836.3 654706116 661369095 655557022 650786514 657311172 654587708 653269348 659371872 658519745
3844 658519745 654890900 656580048 657195511 656579285 657217712 656019592 656897812 661065140 657309875
3852.7 657309875 661047516 651542130 648708344 656939697 656758804 654836960 655822296 657591400 660979462
3861.3 660979462 656696548 655496750 660985794 657686081 652488861 655400620 659317398 663491974
3869.1 663491974 658845825 649791336 652474213 658392563 661614380 653796310 653573685 657428589
3876.8 657428589 657244720 658109360 661820068 659784775 653927383 656777573 657634735 658997498 663601913
3885.4 663601913 654060059 653481827 656676102 657188339 660461502 660943069 654061966 653307495 656006088
3894.1 656006088 655122604 655900879 656884003 658244705 660686417 653937836 657551422 660329819 655063171
3902.8 655063171 658484192 658013077 656596375 655982742 656043472 657582626 657270279 657253799 656907654
3911.5 656907654 657168198 657305145 656130142 656700287 659335709 657489166 653938065 657455139 658572845
3920.2 658572845 655291367 655938034 656710129 657563095 656923676 654495697 655352325 656871719 657562485
3928.8 657562485 656708832 656353912 658656387 657336960 655299301 656409988 656523437 656372223 656392365
3937.5 656392365 656324997 655882263 655459366 656866455 657197800 654251938 654296799 655498352 655140457
3946.2 655140457 655493088 654851303 655933228 656987839 654767914 655583725 656146240 655556717 655622940
3954.9 655622940 655696793 656279831 655497437 655520477 655659561 655548096 655536346 654311295 654601135 655604630
3964.5 655604630 655731125 655251465 655428772 655698395 654916840 654581451 654960327 655513000 655638504 655830841
3974.2 655830841 655870438 655517273 655303421 655298233 655424576 655420151 655679779 655512695 655596695 656301422 656326141
3984.8 656326141 655868530 655828934 655879059 655434189 655484085 654931183 654362411 654782104 655130615 655709229
3994.4 655709229 655916595 656039963 655908051 655466385 655128326 655364304
4000.2 655364304
##END=$$ End of the data block
