##TITLE=$$ Begin of the data block
##JCAMP-DX=5.00 $$ ACD/SpecManager v 10.08
##SPECTROMETER/DATA SYSTEM=Varian
##DATE=14 Jan 2013 10:02:12
##DATA TYPE=INFRARED SPECTRUM
##DATA CLASS=XYDATA
##ORIGIN=
##OWNER=
##NPOINTS=3735
##FIRSTX=399.26403809
##LASTX=4000.35498047
##MAXX=4000.35498047
##MINX=399.26403809
##MAXY=70.59798431
##MINY=19.89171982
##XFACTOR=1.0000000000
##YFACTOR=0.000000100000000
##FIRSTY=41.77523422
##DELTAX=0.96440572
##XUNITS=1/CM
##YUNITS=TRANSMITTANCE
##XYDATA=(X++(Y..Y))
399.3D17752342L32489k896309n192070N388260M525604p550201o990852J698456O869888
$$ 417752342 418084831 415188522 409996452 415384712 419910316 412360115 405369263 407067719 413937607
407.9D13937607K265892k806130l576774K79732J310462K33498L594856l475875n944596
$$ 413937607 416203499 413397369 409820595 410100327 411410789 411644287 415239143 411763268 405818672
416.6D05818672n946579j4476127J375961J0474472R058266M444732n918693r285889
$$ 405818672 399872093 385395966 386771927 397246399 406304665 410749397 404830704 395544815
424.3C95544815l393288O118699P231826N178147n411492o102256K456665J589698
$$ 395544815 392151527 398270226 405502052 410680199 405268707 399166451 401623116 403212814
432.1D03212814l10630J41677J815110l34053K735862L070526m83131J635552j048279
$$ 403212814 402902184 403043861 404858971 404524918 407260780 410331306 409848175 411483727 410435448
440.7D10435448n20554m786873p427025K892189L746109M098397J132126m027901j33743
$$ 410435448 409914894 405128021 397700996 400593185 404339294 408437691 409569817 405541916 405408173
449.4D05408173r56154k343750k00920p95365N90935J760407K572364k597961r569664
$$ 405408173 404452019 402108269 401907349 401111984 401702919 403463326 406035690 403437729 393868065
458.1C93868065M434242M866905K075272j31187o163483n648728p36541K635574J315041
$$ 393868065 398302307 403169212 405244484 405113297 398949814 393301086 392564545 395200119 396515160
466.8C96515160J707649J553459k210007q72459N14336m846268n244866M05503P52449
$$ 396515160 398222809 399776268 397566261 396693802 397208138 392361870 387117004 387522507 388274956
475.5C88274956L136558L526497O36101j631470m940300j539726k16713j450729k206765
$$ 388274956 391411514 394938011 395574112 393942642 389002342 387462616 387245903 385795174 383588409
484.1C83588409k265472L637657K068138j698494p72628j353608n62706K342225J051139
$$ 383588409 381322937 384960594 387028732 385330238 384557610 383204002 382641296 384983521 386034660
492.8C86034660k279892J750260K039680k537803j184578J08490l09258l29857Q76160
$$ 386034660 383754768 385505028 387544708 385006905 383822327 383930817 383621559 383291702 384167862
501.5C84167862J026306k287445j527252Q31108m41055j04485J975823k94571j883889
$$ 384167862 385194168 382906723 381379471 382210579 381769524 381665039 383640862 383346291 381462402
510.2C81462402j118431k42958J74370j674118l343582j393318N90591p43561j645508
$$ 381462402 380343971 380101013 380275383 378601265 375257683 373864365 374454956 373711395 372065887
518.9C72065887j546325N03807J254234j82800p28912j101075O1035J126900K05269
$$ 372065887 370519562 371023369 372277603 372094803 371365891 370264816 370325851 371452751 371658020
527.5C71658020J50948m7417m97780N14755J260033l34129k683335k503700m02985
$$ 371658020 371808968 371761551 371263771 371778526 373038559 372704430 370021095 367517395 367114410
536.2C67114410o26068P4806J352959Q13103R86977p67441j538468j652641j036072
$$ 367114410 366488342 366563148 367916107 368729210 369716187 368948746 367410278 365757637 364721565
544.9C64721565P83310j012001k060242j040458K63557k65426j241532m27360M99458
$$ 364721565 365504875 364492874 362432632 361392174 361655731 361390305 360148773 359721413 360220871
553.6C60220871l50266j873016j55945m05044q34770k27395O33088J865120k40784
$$ 360220871 359870605 357997589 357841644 357436600 356601830 356374435 357007523 358872643 358631859
562.3C58631859K39868M83475q05702r34449K46392J327896m54827p39479j977005
$$ 358631859 358871727 359355202 358549500 357615051 357861443 359189339 358734512 357995033 356018028
570.9C56018028l38363K129974J293526J056060p40394j413994j537933o7330J368637
$$ 356018028 355679665 357809639 359103165 360159225 359418831 358004837 356466904 356399574 357768211
579.6C57768211J40038j198235j005821J486130O43234Q81004J031533j130600j179428
$$ 357768211 357908249 356710014 355704193 357190323 357833557 358714561 359746094 358615494 357436066
588.3C57436066q20275Q59833O16875J030884P51762j239243K46354J784591J000672
$$ 357436066 356615791 357475624 358092499 359123383 359875145 358635902 358882256 360666847 361667519
597C61667519m91524j6251j090240j103287J539383O76918q74672l72429O65703j954842
$$ 361667519 361175995 361159744 360069504 358966217 360505600 361182518 360307846 359935417 360601120 358646278
606.6C58646278k001686Q09593p28263j188774l28980k3346m21142l7423M0665j482086
$$ 358646278 356644592 357454185 356725922 355537148 355208168 355184822 354763680 354726257 354766922 353284836
616.3C53284836o92673J74484o294N4054O02837K95105L80707Q98895P59430K093315
$$ 353284836 352592163 352766647 352760353 352814407 353417244 353712349 354093056 354991951 355751381 357844696
625.9C57844696J953430P95708M00505P00836Q34160J14517Q32672J697884J295128
$$ 357844696 359798126 360593834 360994339 361695175 362529335 362643852 363476524 365174408 366469536
634.6C66469536J455154K430916K101059J666603J530914O23780J88331K07901O44875
$$ 366469536 367924690 370355606 372456665 374123268 375654182 376277962 376466293 376674194 377319069
643.3C77319069R00841Q61473J049804J079293J015739J290741J109886j23405O91643
$$ 377319069 378219910 379081383 380131187 381210480 382226219 383516960 384626846 384503441 385195084
651.9C85195084J029281m19769K79503Q83751Q63456L94288j27068J20506j261329
$$ 385195084 386224365 385804596 386084099 386967850 387831306 388225594 388098526 388219032 386957703
660.6C86957703j648102l63121O6643J06658N32036J132241L24592l393249J932144
$$ 386957703 385309601 384946480 385013123 385119781 385651817 386784058 387108650 383715401 385647545
669.3C85647545K175712Q31910O74934K45171O69441K003784J002121K93655N01328
$$ 385647545 387823257 388655167 389330101 389575272 390244713 392248497 393250618 393544273 394045601
678C94045601J344833K620545J407547L40919Q77648J333885J146354N15633P59773
$$ 394045601 395390434 398010979 399418526 399759445 400637093 401970978 403117332 403632965 404392738
686.7D04392738N08347O62346J953201J215134N50842J373100J148262K31324k67296
$$ 404392738 404901085 405563431 407516632 408731766 409282608 410655708 411803970 412035294 411767998
695.3D11767998P2746J046333J070328Q45566J141014J052093O34156j21842K3804
$$ 411767998 411840744 412887077 413957405 414802971 415943985 416996078 417630234 417508392 417532196
704D17532196N71976J4496K18048R64851Q31108J229973J676903P41768M07982M60968
$$ 417532196 418104172 418118668 418336716 419301567 420132675 421362648 423039551 423781319 424189301 424650269
713.7D24650269N17120J266594O83441L1433J62048Q01125J710434J386070O98204
$$ 424650269 425167389 426433983 427117424 427148857 427310905 428112030 429822464 431208534 431906738
722.3D31906738L45497R08242N82199k34795O47469J342163Q41789J80397J245308
$$ 431906738 432252235 433160477 433742676 433507881 434155350 435497513 436339302 436519699 437765007
731D37765007J967506J304551J087303J016655Q54492J99814k63252n52140p3395P70302
$$ 437765007 439732513 441037064 442124367 443141022 443995514 444195328 443932076 443379936 443306541 444076843
740.7D44076843J139260J125984J154213K203369J293487n96695n00831K28271N20478
$$ 444076843 445216103 446342087 447496300 449699669 450993156 450396461 449895630 450123901 450644379
749.3D50644379J005478J135368K67868M77791Q53729J614151J394043M02145J339608
$$ 450644379 451649857 452785225 453053093 453530884 454384613 455998764 457392807 457794952 459134560
758D59134560J179008R66377J216164J623497R92165n913J536903J613503L83568j4992
$$ 459134560 460313568 461279945 462496109 464119606 465111771 465105858 466642761 468256264 468639832 468624840
767.7D68624840O26983N02091M14848L98712n82313K46315m33159n2757O12335m13017
$$ 468624840 469251823 469753914 470168762 470567474 469985161 470231476 469798317 469745560 470357895 469944878
777.3D69944878J87873j82800K26937K71492L40003R30214M71116R83886Q43888K97393
$$ 469944878 470132751 469949951 470176888 470448380 470788383 471718597 472189713 473173599 474017487 474314880
787D74314880m48913l35846J5678j2130N87883Q18290P31545m94004p51915M76761
$$ 474314880 473865967 473530121 473545799 473533669 474121552 474939842 475671387 475177383 474425468 474902229
796.6D74902229N29595r61876j354370j525498j790695k73590p25136j262970q21991
$$ 474902229 475431824 474469948 473115578 471590080 469799385 469525795 468800659 467537689 466715698
805.3D66715698j200104j438369j502571j756173k428054j724472j318093j478805
$$ 466715698 465515594 464077225 462574654 460818481 458390427 456665955 455347862 453869057
813D53869057j041451k39219m26140j529999j041565p93915K24571J043015M9400J21002
$$ 453869057 452827606 452588387 452162247 450632248 449590683 448796768 449021339 450064354 450113754 450234756
822.6D50234756J138535K240372K376747K382278K506867L068123K946090K130204
$$ 450234756 451373291 453613663 455990410 458372688 460879555 463947678 466893768 469023972
830.4D69023972K848091K376365K518502K358055J828613L159637L809090L188973
$$ 469023972 471872063 474248428 476766930 479124985 480953598 484113235 487922325 491111298
838.1D91111298J281929J181373J841622K208099J162033j19400J013603J817551J914215
$$ 491111298 492393227 493574600 495416222 497624321 498786354 498666954 499680557 501498108 503412323
846.8E03412323Q12454J793137J449928P19376K186660N53513J4000P01866J888352
$$ 503412323 504224777 506017914 507467842 508187218 510373878 510927391 510941391 511643257 513531609
855.4E13531609J706123J875801K509270N78422J119461J439362R12094P6218L87878
$$ 513531609 515237732 517113533 519622803 520201225 521320686 522760048 523672142 523748360 524136238
864.1E24136238l62282j119537J128769q62122k372322k372055k175178j808587k108192
$$ 524136238 523773956 522654419 523783188 522921066 520548744 518176689 516001511 514192924 512084732
872.8E12084732j943245k422333j628990j533317k62146J4190m82864p591o89202K95792
$$ 512084732 510141487 507719154 506090164 504556847 504294701 504308891 503826027 503818436 503129234 503425026
882.4E03425026m02603o58379m97360m39758n75295j296615L59458l49235k88162K95105
$$ 503425026 503022423 502364044 501866684 501426926 500851631 499555016 499914474 499565239 499277077 499572182
892.1D99572182L95508P06138j43051N21049o40640p75146P88421Q37136l56827j169052
$$ 499572182 499967690 500673828 500530777 501051826 500411186 499636040 500424461 501261597 500904770 499735718
901.7D99735718p80220L37333K374230K353477K918778K637787J766662K083130J340485
$$ 499735718 498955498 499292831 501667061 504020538 506939316 509577103 511343765 513426895 514767380
910.4E14767380J614723J13792j48544j87874j353569j442947k049866k134361k984352
$$ 514767380 516382103 516495895 516347351 516159477 514805908 513362961 511313095 509178734 506194382
919.1E06194382k606049k162666k372132k890739l151550k933922l947373l655624
$$ 506194382 503588333 501425667 499053535 496162796 493011246 490077324 486129951 482474327
926.8D82474327m193306m155731k931290k489090k046203k137375j861649j865158
$$ 482474327 478281021 474125290 471194000 468704910 466658707 464521332 462659683 460794525
934.5D60794525j247063r70344j537438j404609j175575j242257j147575k59247j016044
$$ 460794525 459547462 458577118 457039680 455635071 454459496 453217239 452069664 451810417 450794373
943.2D50794373j242371o74019q94852o42738j180954j27945Q91609M20151R4376n56526
$$ 450794373 449552002 448877983 447983131 447340393 446159439 446031494 446923103 447343254 447437630 446881104
952.8D46881104o43502q72688j211433j887017j971092j408272j854820k250710j902732
$$ 446881104 446237602 445364914 444153481 442266464 440295372 438887100 437032280 434781570 432878838
961.5D32878838k392350l167801k256622j596756j766968j738929j449128j731033
$$ 432878838 430486488 427318687 425062065 423465309 421698341 419959412 418510284 416779251
969.2D16779251j932144j507111k597274l412095k926673k515870l202018l974839
$$ 416779251 414847107 413339996 410742722 407330627 404403954 401888084 398686066 394711227
976.9C94711227l604698m065819m375305m426880n028381m546814m537964n896339
$$ 394711227 391106529 387040710 382665405 378238525 373210144 368663330 364125366 358229027
984.7C58229027n148697m248734m923210m448089l898583m175072m546546m316636
$$ 358229027 353080330 348831596 343908386 339460297 335561714 331386642 326840096 322523460
992.4C22523460l905620k950344k682629l279972l244400l041191k969303l517761
$$ 322523460 318617840 315667496 312984867 309704895 306460495 303419304 300450001 296932240
1000.1B96932240k821331k572842k472210k270260k395973j544647k359238k031841
$$ 296932240 294110909 291538067 289065857 286795597 284399624 282854977 280495739 278463898
1007.8B78463898j765862k064266k175846k464714j871166k314949j411000j735916
$$ 278463898 276698036 274633770 272457924 269993210 268122044 265807095 264396095 262660179
1015.5B62660179k100620k184963k676793j850605k237892j061344j492157k360878
$$ 262660179 260559559 258374596 255697803 253847198 251609306 250547962 249055805 246694927
1023.2B46694927k083740j726456j130962j945305j439724j080494k35004j070576
$$ 246694927 244611187 242884731 241753769 239808464 238368740 237288246 237053242 235982666
1031B35982666j104546m75597q99067P55615J42174J051884J132259J305065K411366
$$ 235982666 234878120 234402523 233503456 234259071 234401245 235453129 236585388 237890453 240301819
1039.6B40301819J292896J801262J011543P54586O61296N76249O256q99639j86215
$$ 240301819 241594715 243395977 244407520 245162106 245823402 246399651 246405907 245506268 245320053
1048.3B45320053q23612j078777j587525j359501j814441j312771j33896j356239p70245
$$ 245320053 244496441 243417664 241830139 240470638 238656197 237343426 237209530 235853291 235083046
1057B35083046o55270K93370N06553Q62141J887131J260681J291237J786442K676486
$$ 235083046 234427776 234721146 235227699 236089840 237976971 239237652 240528889 242315331 244991817
1065.7B44991817J128541J060981R10454R45225K076835P27940N39951m40158o4030
$$ 244991817 246120358 247181339 248091793 249037018 251113853 251841793 252381744 251941586 251877556
1074.4B51877556J05915L83911J021080l0422J168270J064510R47647O05278P87945
$$ 251877556 251983471 252367382 253388462 253358040 254526310 255590820 256538467 257143745 257931690
1083B57931690P12834N67627J579189N82924J955185K345562J770096J030540J242981
$$ 257931690 258644524 259212151 260791340 261374264 263329449 265675011 267445107 268475647 269718628
1091.7B69718628K268009M82597J178341J845513J689453J026173J431808K381859
$$ 269718628 271986637 272469234 273647575 275493088 277182541 278208714 279640522 282022381
1099.4B82022381J512298K200146J795521J659679J050301Q36506J549282J117573
$$ 282022381 283534679 285734825 287530346 289190025 290240326 291076832 292626114 293743687
1107.1B93743687J255836L17993J34449N58663J729488J693726Q09612J670666J366615
$$ 293743687 294999523 295317516 295451965 296010628 297740116 299433842 300243454 301914120 303280735
1115.8C03280735R17568k46506l39107K81486J18733k93980p74498R73625J600419
$$ 303280735 304198303 303951797 303612690 303894176 304012909 303718929 302944431 303918056 305518475
1124.5C05518475J288337P85942M85707P29503J158543K540283K191563J925678K219715
$$ 305518475 306806812 307592754 308078461 308807964 309966507 312506790 314698353 316624031 318843746
1133.2C18843746K490673K851334K811050K190972J843872K645073J836433J292458
$$ 318843746 321334419 324185753 326996803 329187775 331031647 333676720 335513153 336805611
1140.9C36805611J994629J589279P55424N77088O51893J097298J549110O06881K69928
$$ 336805611 338800240 340389519 341144943 341722031 342373924 343471222 345020332 345627213 345897141
1149.6C45897141K14767k94075l02315k40402R3269m00695n34440k53982q01964q81729
$$ 345897141 346111908 345817833 345515518 345275116 345368385 344967690 344433250 344179268 343377304 342495575
1159.2C42495575o16608m89273o54869n8632O52848R67941J205330J332550K328109
$$ 342495575 341878967 341389694 340734825 340676193 341329041 342296982 343502312 344834862 347162971
1167.9C47162971L033715L451957L701897K986756K273788L151855L280488K911720
$$ 347162971 350196686 353648643 357350540 360337296 362611084 365762939 369043427 371955147
1175.6C71955147L174171K892342L183632K968750K348709K200584K843895K450447
$$ 371955147 375129318 378021660 381205292 384174042 386522751 388723335 391567230 394017677
1183.3C94017677J451493J643333J639061J393738N49774M88625L26500j13526m2953
$$ 394017677 395469170 397112503 398751564 400145302 400695076 401183701 401510201 401396675 401353722
1192D01353722l6011n3711p52144p86514j004753j233979j096611j296424j136704
$$ 401353722 401317711 401264000 400511856 399725342 398720589 397486610 396389999 395093575 393956871
1200.7C93956871j189575j071129j043167j332741j251488o49910l74832p45849m27132
$$ 393956871 392767296 391696167 390653000 389320259 388068771 387418861 387044029 386298180 385871048
1209.4C85871048k58675q25843p49703k13966n65110r73968o53915l02849j55297o02264
$$ 385871048 385612373 384786530 384036827 383822861 383257751 382283783 381629868 381327019 381171722 380569458
1219C80569458k45590K96211n55801q36945n30891r12209j059952o52847r08432q41789
$$ 380569458 380323868 380620079 380064278 379227333 378696442 377784233 376724281 376071434 375163002 374321213
1228.6C74321213q47206j121521j87035k92053o87294n12352j100502r56383l81393
$$ 374321213 373474007 372352486 372165451 371873398 371186104 370673752 369573250 368616867 368235474
1237.3C68235474j02501l29552m37698j25084j03455j28784m34036k90947l84026o03943
$$ 368235474 368132973 367803421 367365723 367240639 367137184 367008400 366574364 366283417 365899391 365295448
1247C65295448m24118n45082l86505m26865o8092K13318m8370j26114j99204R690l27530
$$ 365295448 364871330 364326248 363939743 363512878 363444786 363658104 363609734 363483620 363284416 363294106 362966576
1257.6C62966576l37143N2604K098j59683J106Q97713R06105L31955L59078O45675
$$ 362966576 362629433 362682037 362684135 362524452 362525558 363423271 364329376 364661331 365020409 365666084
1267.2C65666084O23360O74019N50804L18031R36165J241684J308441J001892R77402
$$ 365666084 366289444 366963463 367514267 367832298 368768463 370010147 371318588 372320480 373297882
1275.9C73297882J302452J166382J304855P87621L30849Q74862J530571J379853J481437
$$ 373297882 374600334 375766716 377071571 377859192 378190041 379064903 380595474 381975327 383456764
1284.6C83456764J925202J674270J499901J524658J589699R93424P59620N33982M31365
$$ 383456764 385381966 387056236 388556137 390080795 391670494 392663918 393423538 393957520 394388885
1293.3C94388885P50046R65538J127396M18892Q01201P91740K10419K65465L16391
$$ 394388885 395138931 396104469 397231865 397650757 398451958 399243698 399454117 399719582 400035973
1301.9D00035973L33862l36990j99967l94707j84593L3722n40810m89921q53958n90515
$$ 400035973 400369835 400032845 399832878 399438171 399253578 399287300 398746490 398256569 397402611 396812096
1311.6C96812096n41535q75625r88083m98810K6894j47782L51868N23605J200218J234093
$$ 396812096 396270561 395394936 394406853 393908043 393934937 393787155 394139023 394662628 395862846 397096939
1321.2C97096939Q49915Q39691K66647O34346M94270K83127K47307M52843K14119p09992
$$ 397096939 397946854 398786545 399053192 399687538 400181808 400464935 400712242 401165085 401379204 400669212
1330.9D00669212q88977j008224k52991j46255n48783p55882o5651J143036K28729
$$ 400669212 399780235 398772011 398519020 398372765 397823982 397068100 397002449 398145485 398374214
1339.6C98374214K73323P49474O41098P62977J140213R99070K44445P29294M55513
$$ 398374214 398647537 399397011 400038109 400801086 401941299 402940369 403184814 403914108 404369621
1348.2D04369621L85056j25618l18260O2141l69263k15835o83747k91748k15721m68864
$$ 404369621 404754677 404629059 404310799 404372940 404003677 403787842 403104095 402812347 402596626 402127762
1357.9D02127762o92291p48978l64571o91452j67579q12836J47400J42975j087761
$$ 402127762 401435471 400686493 400321922 399630470 399462891 398650055 398797455 398940430 397852669
1366.6C97852669o38428j305160q65288k57645j52016j19819n44815o20537m6501P76519
$$ 397852669 397214241 395909081 395043793 394786148 394634132 394514313 393969498 393348961 393302460 394078979
1376.2C94078979l61099m28619o18172q23097k00348o96068j000862j531067j348038
$$ 394078979 393717880 393289261 392671089 391847992 391647644 390951576 389950714 388419647 387071609
1384.9C87071609j538391j485824j714554j529617j062241k124748j873322j923904
$$ 387071609 385533218 384047394 382332840 380803223 379740982 377616234 375742912 373819008
1392.6C73819008k090340l026390k841911j041336j896591j705056l119087k823410
$$ 373819008 371728668 368702278 365860367 364819031 362922440 361217384 358098297 355274887
1400.3C55274887j441421k154694k066956k058715k162209k256508j932449j906128
$$ 355274887 353833466 351678772 349611816 347553101 345390892 343134384 341201935 339295807
1408C39295807j898117j240425j533585j286964j719361j501503r02786j559524j075631
$$ 339295807 337397690 336157265 334623680 333336716 331617355 330115852 329213066 327653542 326577911
1416.7C26577911r47914J39656j138992p76253R58863k26632K27127q8958N78727Q37861
$$ 326577911 325629997 325769653 324630661 323854408 324813271 324586639 324813766 324724808 325303535 326141396
1426.3C26141396L92341Q35915L64151J532211J042633J665039J641350J299591J913338
$$ 326141396 326533737 327369652 327733803 329266014 330308647 331973686 333615036 334914627 336827965
1435C36827965Q95729K117386K077255K671432J962929J614990K104073J707306K115364
$$ 336827965 337723694 339841080 341918335 344589767 346552696 348167686 350271759 351979065 354094429
1443.7C54094429J262665K166939J409721J136780J614494J432991K181931J023368
$$ 354094429 355357094 357524033 358933754 360070534 361685028 363118019 365299950 366323318
1451.4C66323318J557732R28955J766930K064361R51958J679535m22134L830604J985817
$$ 366323318 367881050 368810005 370576935 372641296 373593254 375272789 374850655 378681259 380667076
1460.1C80667076K124901J812019J568680K210274J004791L144264K234116L076553
$$ 380667076 382791977 384603996 386172676 388382950 389387741 392532005 394766121 397842674
1467.8C97842674K640953K050400K577782J176224K302169L561135M785347L269462
$$ 397842674 400483627 402534027 405111809 406288033 408590202 412151337 416936684 420206146
1475.5D20206146L064804L064041K617684K698021J763267J942520J959534K059670
$$ 420206146 423270950 426334991 428952675 431650696 433413963 435356483 437316017 439375687
1483.2D39375687J577491J390229J718139R48906J023026R38148M15955J102905J049271
$$ 439375687 440953178 442343407 444061546 445010452 446033478 446971626 447387581 448490486 449539757
1491.9D49539757M43344n36308q52700p63015k722016l03192l75748j590538n59387
$$ 449539757 449983101 449446793 448594093 447831078 445109062 444805870 444430122 442839584 442280197
1500.6D42280197p46574j179276j300621j46484k16828j970977k064476k78435R03778
$$ 442280197 441533623 440354347 439053726 438907242 438690414 436719437 434654961 434376526 435280304
1509.3D35280304m9934L95355o70319q42743j95808j412277j189461j690025N3787
$$ 435280304 435230370 435625725 434955406 434112663 433916855 432504578 431315117 429625092 429678879
1518D29678879J319580N63393j122017j12534J102333N78079J002007O9542R18808
$$ 429678879 430998459 431561852 430439835 430327301 431429634 432007713 433009720 433079262 433998070
1526.6D33998070R18197M58794Q97446O55746L12119O0806L84636J65596J486397Q68454
$$ 433998070 434916267 435375061 436272507 436928253 437240372 437301178 437685814 437851410 439337807 440206261
1536.3D40206261J05438K12440l030815j80816J162338P72972J033821J682015Q47816
$$ 440206261 440311699 440524139 437493324 437312508 438474846 439247818 440281639 441963654 442811470
1545D42811470o97136J058235l77693k89841k04811J7014N67894J24740J072388j649589
$$ 442811470 442114334 443172569 442794876 442505035 442300224 442317238 442885132 443009872 444082260 442432671
1554.6D42432671m72451j24321p08618J28327m290123p81174j162224O27365j339836
$$ 442432671 441960220 441835899 441127281 441255608 436965485 436184311 435022087 435649452 434309616
1563.3D34309616j618805k557144k737236j641007k950973j293221o687698k377548
$$ 434309616 432690811 430133667 427396431 425755424 422804451 421511230 414823532 412445984
1571D12445984k439804l805390l157997l872108k470780j0552597q43582k990036m470253
$$ 412445984 410006180 406200790 403042793 399170685 396699905 386147308 385303726 382313690 377843437
1579.7C77843437m546280n880890l535843n785560l589668m990731m245872m131890
$$ 377843437 373297157 367416267 363880424 358094864 354505196 349514465 345268593 341136703
1587.4C41136703n185661l452148n903588l198051n448952l613891m247170m991798
$$ 341136703 335951042 332498894 326595306 323397255 317948303 314334412 310087242 305095444
1595.1C05095444k556172m560013j973915m751339k480545l261757l003616k031860
$$ 305095444 302539272 297979259 296005344 291254005 288773460 285511703 282508087 280476227
1602.8B80476227m205170j299534l677749j025601k775364j410999j181927k616348
$$ 280476227 276271057 274971523 271293774 270268173 267492809 266081810 264899883 262283535
1610.5B62283535J42937k868195j75762k160149J240m18472l952599K029019j129132
$$ 262283535 262426472 259558277 259382515 257222366 257223606 256805134 252852535 254881554 253752422
1619.2B53752422J401768j569462Q63762k34699r78928J997376p05700K018528j170178
$$ 253752422 255154190 253584728 254448490 254213791 253234863 255232239 254526539 256545067 255374889
1627.9B55374889J623383P69997J144104J523723Q0128K158871j134777K839431K88906
$$ 255374889 256998272 257768269 258912373 260436096 260516224 262675095 261540318 264379749 264668655
1636.6B64668655K767849J863213R44309K766876O47049K769337O68259K124214J621437
$$ 264668655 267436504 269299717 270244026 273010902 273657951 276427288 277095547 279219761 280841198
1645.3B80841198L73974K832012n86548M347496J135731K923412J703167j850662K966843
$$ 280841198 281215172 284047184 283460636 287808132 288943863 291867275 293570442 291719780 294686623
1653.9B94686623J343898M656201J212406K650166J511516K520123K859325J810265
$$ 294686623 296030521 300686722 301899128 304549294 306060810 308580933 311440258 313250523
1661.6C13250523L262519J306897M094200K095489K648354K873802K848320L772125
$$ 313250523 316513042 317819939 321914139 324009628 326657982 329531784 332380104 336152229
1669.4C36152229J583100N169449K779502M183884L596916M055138M719276L135758
$$ 336152229 337735329 342904778 345684280 349868164 353465080 357520218 362239494 365375252
1677.1C65375252M678612K772598M399795L722802M221229M558411J470794P013092
$$ 365375252 370053864 372826462 377226257 380949059 385170288 389728699 391199493 398212585
1684.8C98212585M286347N990028M291802M717521N219765M334145M600372M238510
$$ 398212585 402498932 408488960 412780762 417498283 422718048 427052193 431652565 435891075
1692.5D35891075N228233M738007N233612L872376M977913N252723M712944M348717
$$ 435891075 441119308 445857315 451090927 454963303 459941216 465193939 469906883 474255600
1700.2D74255600J496124O457978M770851L705330L177337L692284L802147L572273
$$ 474255600 475751724 482209702 486980553 490685883 493863220 497555504 501357651 504929924
1707.9E04929924L843308K652397K532730K297020K291450K690125J108284P07969
$$ 504929924 508773232 511425629 513958359 516255379 518546829 521236954 522345238 523053207
1715.6E23053207K725258K157135j449890L639755L351708J712875J161347J097793
$$ 523053207 525778465 527935600 526485710 530125465 533477173 535190048 536351395 537449188
1723.4E37449188J376038J470527J321068J129914J463737J877747P80449J028862
$$ 537449188 538825226 540295753 541616821 542746735 544210472 546088219 546868668 547897530
1731.1E47897530K908172K290077j705741j034775M321174L903237J875038K274055
$$ 547897530 550805702 553095779 551390038 550355263 554676437 558579674 560454712 562728767
1738.8E62728767J176796j57852L900490L404503K158089K419242L462983L116493
$$ 562728767 563905563 563747711 567648201 571052704 573210793 575630035 579093018 582209511
1746.5E82209511K422981L280525K282830L865547K096901K243728M929734L427963
$$ 582209511 584632492 587913017 590195847 594061394 596158295 598402023 603331757 606759720
1754.2F06759720K970161K642861J303291K581215L266220K280693K616425P62748
$$ 606759720 609729881 612372742 613676033 616257248 619523468 621804161 624420586 625183334
1761.9F25183334R54247L254928J889649J945190K017212J600647m60396J826325L082352
$$ 625183334 626137581 629392509 631282158 633227348 635244560 636845207 636384811 638211136 641293488
1770.6F41293488j64566j11847l17765L178635J987686l3798K340546J035766J391831
$$ 641293488 641128922 641017075 640699310 643877945 645865631 645831833 648172379 649208145 650599976
1779.3F50599976P85446O3934R09042J317826J679611k77634L4027J236573J396179
$$ 650599976 651385422 651449356 652358398 653676224 655355835 655078201 655112228 656348801 657744980
1788F57744980N34286J017228J141128O64444n95779k49939K718887N51529K10266
$$ 657744980 658279266 659296494 660437622 661102066 660506287 660256348 662975235 663526764 663737030
1796.7F63737030J503677J165314O62308l3798K017212J78985P42340J677704M87671
$$ 663737030 665240707 666406021 667068329 667034531 669051743 669230728 669973068 671650772 672138443
1805.3F72138443L77121J29852O53992P28989J275634n33905L59040J734085J097793
$$ 672138443 672515564 672645416 673299408 674028397 675304031 674770126 675129166 676863251 677961044
1814F77961044J298065o7443M76532p7515M94003J083222R6283Q02688N4245J131745
$$ 677961044 679259109 679191666 679668198 679590683 680084686 681167908 681264191 682066879 682121124 683252869
1823.7F83252869J071319q58688J74637J226883J135635n14145j631317O50253J981583
$$ 683252869 684324188 683465500 683640137 684867020 686002655 685488510 683857193 684507446 686489029
1832.3F86489029O15921M73480N93186N21087N58396m32663P06634K7390N05600n8289
$$ 686489029 687104950 687578430 688171616 688692703 689251099 688818436 689525070 689552460 690058060 689999771
1842F89999771J86997J434555j870499J868591J374893o1035k26211L15246Q00782
$$ 689999771 690186768 691621323 689750824 691619415 692994308 692933273 692707062 693022308 693823090
1850.7F93823090j74637P15408p7591L04718M65698L48664O32782m40445J74103j17035
$$ 693823090 693648453 694363861 694286270 694590988 695056686 695405350 696038132 695597687 695771790 695654755
1860.3F95654755M14199J42899J02234L24707J44577O61545l64456L99627p24106m31213
$$ 695654755 696068954 696211853 696314087 696638794 696783371 697444916 697080460 697480087 696755981 696324768
1869.9F96324768J122437R79690O49338J831P39670j17111M27093L84140m3182K16827
$$ 696324768 697447205 698426895 699076233 699078064 699817734 699700623 700127716 700511856 700468674 700685501
1879.6G00685501l03879K54288m96979M15116L70636K11486L92838k05383Q09097l61252
$$ 700685501 700381622 700635910 700138931 700554047 700924683 701136169 701529007 701323624 702132721 701771469
1889.2G01771469n94253K20947M79507O7902j70822k7695m76227R21555M45328O73065
$$ 701771469 701177216 701398163 701877670 701945572 701774750 701747055 701270828 702192383 702637711 703310776
1898.9G03310776M13666p7744M9515q03223q2092n61524L52097P50122M53110O08368
$$ 703310776 703724442 703646698 703696213 702892990 702810898 702249374 702601471 703351593 703804703 704413071
1908.5G04413071J26724M15192k96555J98746n45426m70047k94418q2016R42078j277161
$$ 704413071 704539795 704954987 704658432 704857178 704311752 703841705 703547287 703465271 704407349 703130188
1918.2G03130188J65787J132049Q10929L53088q45337l34167J07421M99802m61502
$$ 703130188 703295975 704428024 705238953 705592041 704746704 704412537 704519958 705019760 704558258
1926.8G04558258k11945Q9875N62057P04270j13144L90472m29687j9837l92227n31311
$$ 704558258 704346313 704436188 704998245 705702515 705589371 705979843 705550156 705530319 705138092 704606781
1936.5G04606781j86768n65795L72009J78528P90481l4256l99170N49851O1264k21863
$$ 704606781 704420013 703854218 704226227 704404755 705195236 705160980 704761810 705311661 705372925 705151062
1946.1G05151062p55920o8131l03497M120J35498L18298P36466Q4152L15628n90744
$$ 705151062 704395142 704327011 704023514 704027634 704163132 704481430 705217896 705302048 705617676 705026932
1955.8G05026932m10080l99475j69678M8218m12598L99246J7166L63694l8300K91824
$$ 705026932 704616852 704217377 704047699 704095917 703683319 704082565 704099731 704463425 704425125 704716949
1965.4G04716949K69013j161957m29535k03857L30124j50757p2174J03760N4092O95419
$$ 704716949 704985962 703824005 703394470 703190613 703520737 703369980 703297806 703401566 703455658 704151077
1975.1G04151077L5095P9117j90735K68784j28479o89011l07159l79181K17209K0294
$$ 704151077 704186172 704265289 704074554 704343338 704214859 703525848 703218689 702839508 703056717 703077011
1984.7G03077011N70145K14233k6321k40250o52313L36990m98047j023559n87464N25971
$$ 703077011 703647156 703861389 703835068 703594818 702942505 703279495 702781448 701757889 701170425 701696396
1994.3G01696396N96390J07498J12839m09165M79126k8915l05j21003o72989k16980
$$ 701696396 702292786 702400284 702513123 702103958 702583084 702554169 702553864 702432861 701759872 701542892
2004G01542892l72009K5253l34930K19955L08991R5215J22986o15082l07312k81983
$$ 701542892 701170883 701196136 700861206 701081161 701390152 701485367 701608353 700993271 700685959 700403976
2013.6G00403976M0131k18658l18375l21121J526L43170k22473L73230r2163j35804
$$ 700403976 700444107 700225449 699907074 699585953 699587479 699930649 699708176 700081406 699989243 699853439
2023.3F99853439m17785p41349k03094k60849K00806j03455Q621l73077J6937M86908
$$ 699853439 699435654 698694305 698491211 698230362 698431168 698327713 698336334 697963257 697980194 698467102
2032.9F98467102j96381j87072p26319j28936k3270o9428k69699l23333l7156m65240
$$ 698467102 698270721 698083649 697357330 697228394 697205124 697135696 696865997 696542664 696505508 696040268
2042.6F96040268J96686l43094J24359Q2092k57797L71017m22744k25907l59192J54725
$$ 696040268 696236954 695893860 696018219 696100311 695842514 696213531 695790787 695564880 695205688 695360413
2052.2F95360413N3863k93198j55487l53393R4070m91104J44425l0136K5253M38232
$$ 695360413 695414276 695121078 694965591 694612198 694706268 694215164 694359589 694329453 694354706 694792938
2061.9F94792938k02789p7744m30908J68839k61994L0060J33820m36402J72272k22397
$$ 694792938 694590149 694512405 694081497 694250336 693988342 694018402 694152222 693715820 693888092 693665695
2071.5F93665695K57263k80990j43738K11563l68423j71509m44412j450K2736L50418
$$ 693665695 693922958 693641968 693498230 693709793 693341370 693169861 692725449 692723999 692746735 693097153
2081.1F93097153p6905l09677K75498n8060j14365l57818o6300m46853j75247m2267
$$ 693097153 693020248 692710571 692986069 692928009 692813644 692455826 692389526 691942673 691767426 691725159
2090.8F91725159q5984M34266j60523J33514n16967m87137M9744M5471k08512p34634
$$ 691725159 691639175 692073441 691912918 692046432 691529465 691042328 691092072 691137543 690929031 690194397
2100.4F90194397L7537l64075R3460L39661o4011O0654L2501o3400r67484m07028n95856
$$ 690194397 690231934 689867859 689961319 690300980 690236969 690297623 690330124 690266724 689299240 688892212 688296356
2111F88296356k8000L20053k73361L77655j94626L76816Q0109q8654j13144j018219
$$ 688296356 688268356 688588409 688315048 688692703 688498077 688874893 688955002 688866348 688753204 687734985
2120.7F87734985l97567j61896K28424Q5754O00586M21219j99203L2119k44140O3781
$$ 687734985 687337418 687175522 687403946 687489700 688090286 688511505 688312302 688344421 688100281 688164062
2130.3F88164062n69229l57513l33405l06854K05612L66516O65284k12021K88772m7531
$$ 688164062 687594833 687237320 686903915 686597061 686802673 687169189 687834473 687622452 687911224 687863693
2140F87863693l24249j40228o29044n6076n8365K77481j20392J67084K90909r3994
$$ 687863693 687539444 687399216 686770172 686714096 686655731 686933212 686812820 686979904 687270813 687176819
2149.6F87176819K07901l18146O3629j32599j43966l40958p2479M73785J03302O34918
$$ 687176819 687384720 687066574 687130203 686997604 686853638 686512680 686440201 686913986 687017288 687652206
2159.3F87652206J02463l052l78646k41776K0752o00128K07519L45612N68390K3346
$$ 687652206 687754669 687751617 687372971 687131195 687151947 686551819 686759338 687104950 687673340 687696686
2168.9F87696686j39313J58844m0207K45743j51062j39542n47409L2349L31116J79138
$$ 687696686 687557373 687716217 687676010 687921753 687770691 687631149 687083740 687116089 687447205 687626343
2178.5F87626343L75595j35346N03464K07215j56098l52783k3728K61765k93274J05057
$$ 687626343 688001938 687866592 688370056 688577271 688421173 688068390 688044662 688306427 688013153 688118210
2188.2F88118210j6022K77023j21078j74332J70365N6991K39792k28577K3728l32565
$$ 688118210 688102188 688379211 688258133 688083801 688254166 688311157 688550949 688322372 688346100 688013535
2197.8F88013535J51214L12042r3307K33765J7318O67420J20392K7771j21613n60608
$$ 688013535 688164749 688476791 688383484 688617249 688634567 689301987 689422379 689450150 689328537 688767929
2207.5F88767929j64795m00162J06049K04239N37491M59747M51813K55432n98831l04871
$$ 688767929 688603134 688202972 688309021 688513260 689050751 689510498 689962311 690217743 689618912 689314041
2217.1F89314041k20947L2883l68653j3809K65274J21765N66330j6937r0256l35235
$$ 689314041 689093094 689125977 688757324 688743515 689008789 689130554 689696884 689679947 689589691 689254456
2226.8F89254456K46200J83792n65643l01437r0180K82211k50015Q8425K63595M70047
$$ 689254456 689500656 689684448 689118805 688817368 688727188 689009399 688759384 688847809 689111404 689581451
2236.4F89581451M23050l64685j42059k55051J85547k90832k39029J53198r6741J87149
$$ 689581451 690004501 689639816 689497757 689242706 689428253 689137421 688898392 689051590 688954849 689141998
2246F89141998p3394J28250k89536J96076Q7356l37372l7384m91943K34527N265K46277
$$ 689141998 689068604 689196854 688907318 689103394 689190750 688853378 688815994 688324051 688558578 688563843 688810120
2256.7F88810120K26516N036K41318l91465o485k82898l9825r2850O3172M47464n3406
$$ 688810120 689036636 689041672 689282990 688891525 688885040 688602142 688562317 688469467 688532639 688980103 688926697
2267.3F88926697J27334r8953J33286m69590l60412k42996k94114M65928k45667k5711
$$ 688926697 689054031 688955078 689088364 688618774 688258362 688015366 687721252 688187180 687941513 687915802
2276.9F87915802K63901O92901j43051o09207J55335o26755o8054r0790p7439j52053
$$ 687915802 688179703 688872604 688729553 688120346 688275681 687648926 687580872 687490082 687412643 687260590
2286.5F87260590j12763M85306n5008r5062o18592j8234M8676l01132k42539l94058
$$ 687260590 687147827 687633133 687578125 687483063 686864471 686846237 686894913 686593781 686351242 685957184
2296.2F85957184M68674K29187J75018m09470n9280L9215q04901j63880o94580k51846
$$ 685957184 686425858 686655045 686830063 686420593 686361313 686400528 685595627 685431747 684737167 684485321
2305.8F84485321p5989j26190N3101J26724N27954O3095K32010q54492n92041l93219
$$ 684485321 684409332 684283142 684336243 684462967 684990921 685054016 685286026 684431534 683839493 683446274
2315.5F83446274r69620l49350l90930P38144N34134L00827k7466j15204M3717n40162
$$ 683446274 682476654 682127304 681736374 682474518 683008652 683309479 683282013 683166809 683210526 682670364
2325.1F82670364k88772o27899L58734n48859r26514M8066L02658K40402m92401N57251
$$ 682670364 682381592 681753693 682112427 681563568 680637054 680685120 680987778 681228180 680735779 681293030
2334.8F81293030j106873r80987M5623n37033J50376M95987P57522k34222P69501o04325
$$ 681293030 680186157 679205170 679250793 678713760 678864136 679360123 680117645 679883423 680652924 680048599
2344.4F80048599r63440K35825o59714J24664j53884m93012n80826J05667l2119n43595
$$ 680048599 679085159 679320984 678661270 678785934 678632050 678139038 677558212 677663879 677631760 677088165
2354.1F77088165N4856r39865M52041L1281p07703j450272n85784J427078J96914Q18406
$$ 677088165 677143021 676203156 676655197 676686478 675978775 674528503 673942719 675369797 675566711 676385117
2363.7F76385117Q28018K11258j279068j43814n60685r12475J198349O30874Q28171
$$ 676385117 677213135 677424393 676145325 676001511 675440826 674528351 675726700 676357574 677185745
2372.4F77185745q73565m00162Q30231J525j96685n55420k76337p43103l45001m15726
$$ 677185745 676312180 675912018 676742249 676743774 676547089 675991669 675715332 674972229 674627228 674211502
2382F74211502k59247M74091K59170N13382k39257k91596m21677o07757o10962q59757
$$ 674211502 673952255 674426346 674685516 675198898 674959641 674668045 674246368 673638611 673027649 672167892
2391.7F72167892j35498k44445K38723K64588Q1177j99509l73993r003q70743l17535
$$ 672167892 672032394 671787949 672026672 672291260 672372437 672172928 671798935 671789932 670919189 670601654
2401.3F70601654l84903n14374k26745l95279L06625L08533L89862l14026n84869o54145
$$ 670601654 670216751 669702377 669475632 669080353 669386978 669695511 670085373 669771347 669186478 668532333
2410.9F68532333r38568p44171p47757K29p3242N5313K2583l281M0360l87268l48130
$$ 668532333 667593765 666849594 666101837 666102066 666028824 666084137 666106720 666103439 666143799 665756531 665408401
2421.6F65408401r69924o71616n67398l36151r1248L8910O32248q1863N5084l99094
$$ 665408401 664438477 663766861 663199463 662863312 662772064 662810974 663443222 663361359 663416443 663017349
2431.2F63017349r41696q32214q83789m84696l90243j0758j51977J61972J76010j0452
$$ 663017349 662075653 661243439 660359650 659874954 659484711 659473953 659321976 659483948 659659958 659649506
2440.8F59649506l67737o55289j32065j352462j208420m21143k15301J91192J44043
$$ 659649506 659281769 658626480 658494415 657141953 655933533 655512390 655297089 655488281 655632324
2449.5F55632324K96173k70767q2168m21067q27102p57142q36105n06363n27801j5183
$$ 655632324 655928497 655657730 655575562 655154495 654327393 653570251 652734146 652227783 651699982 651684799
2459.2F51684799k37274L21503O21872l83225n65796o59637p89414j370391o78483
$$ 651684799 651447525 651769028 652390900 652007675 651441879 650782242 649992828 648622437 647943954
2467.8F47943954j69067j44577J54343r4910l4790n76172m68597o90384q24661n84107
$$ 647943954 647774887 647630310 647784653 647689743 647654953 647078781 646610184 645919800 645095139 644511032
2477.5F44511032n86700l04871p47299k05689j19934q5525q39n02015m83780o53152
$$ 644511032 643924332 643619461 642872162 642666473 642546539 642461014 642460175 641958160 641474380 640821228
2487.1F40821228l25546r69506r18846j65443k11525r0103k9183R7084n53779o92253
$$ 640821228 640495682 639526176 638607330 638441887 638230362 638140259 638111076 638208160 637654381 636962128
2496.8F36962128q68378p72285n31159p45239k39334n10979k77367m8294k37503m41055
$$ 636962128 636093750 635321465 634790306 634045067 633805733 633294754 633017387 632969093 632731590 632290535
2506.4F32290535n11436m70009j079293o21795o98510p05146j74256n6419P858j26190
$$ 632290535 631779099 631309090 630229797 629608002 628909492 628204346 628030090 627973671 627981529 627855339
2516.1F27855339P0419o82182q81004o21224n47867p17926q80775p0457q1406K13203
$$ 627855339 627925758 627243576 626362572 625741348 625193481 624475555 623594780 623524323 623442917 623656120
2525.7F23656120J5335n31692n98030n76821k86140r32770q40912o09321j78948J51482
$$ 623656120 623671455 623139763 622541733 621964912 621678772 620746002 619905090 619295769 619116821 619268303
2535.4F19268303o8855K7809m67453l74031o04744q72689o87599o61697p74231m51317
$$ 619268303 619199448 619227257 618759804 618385773 617781029 616908340 616220741 615559044 614784813 614333496
2545F14333496M84428K08512L0861k98195m67873n18646r41620o26945p13730n15900
$$ 614333496 614817924 615026436 615057297 614759102 614291229 613772583 612830963 612204018 611490288 610974388
2554.6F10974388n64918j47667K33955q7242k4719n36614n28869n06592l38898o19087
$$ 610974388 610409470 610261803 610495758 610408516 610383797 609847183 609318314 608811722 608472824 607853737
2564.3F07853737j019783o25115k42538K68402l76396j00365J37062m43268m64820
$$ 607853737 606833954 606208839 605966301 606234703 605858307 605757942 605895004 605451736 604986916
2573F04986916q97789o47774o28014p09533l28408J85242n8136k82669J15662m61426
$$ 604986916 604089127 603441353 602813339 602103806 601775398 601960640 601902504 601619835 601735497 601274071
2582.6F01274071o41785q88061p02439o13441p71981k3078m4213r3231m10309n09872
$$ 601274071 600632286 599744225 599041786 598428345 597656364 597633286 597589073 597495842 597085533 596575661
2592.2E96575661m43955m70466m12712o81725o16913p35626l22800l47519j89323j91803
$$ 596575661 596131706 595661240 595248528 594566803 593949890 593214264 592891464 592543945 592354622 592162819
2601.9E92162819o82983r7733m32701o64139q71696q09288o20347j010169n61486k23999
$$ 592162819 591479836 591382103 590949402 590285263 589413567 588604279 587983932 586973763 586412277 586188278
2611.5E86188278K51198M8523j04370l18604r70459p50312p65229p10029r30558p72972
$$ 586188278 586439476 586487999 586383629 586065025 585094566 584344254 583579025 582868996 581938438 581165466
2621.2E81165466n81741n12657K1095m9705l49846o88668n05714q62198q98704l37639
$$ 581165466 580583725 580071068 580092163 580042458 579692612 579003944 578498230 577636032 576737328 576399689
2630.8E76399689m14696l43971n17121n52520o07300p8125k10266q88024o50901o26793
$$ 576399689 575984993 575641022 575123901 574571381 573964081 573885956 573675690 572787666 572136765 571509972
2640.5E71509972k75689o61926o61201l64533n75790l71895o09093m11606m94041q17146
$$ 571509972 571234283 570572357 569911156 569546623 568970833 568598938 567989845 567578239 567084198 566267052
2650.1E66267052o33545j02883m03862r30938k48795k91176k76756m94385o02875q5792
$$ 566267052 565633507 565530624 565126762 564195824 563947029 563655853 563379097 562884712 562281837 562196045
2659.8E62196045k62261m21943o74553m59900j38054k31247p64541n73655j30462m81644
$$ 562196045 561933784 561511841 560837288 560377388 560239334 560008087 559243546 558669891 558539429 558057785
2669.4E58057785j53809m82101m98543l56750p09267m78821l46641K80189J4458o29730
$$ 558057785 557903976 557421875 556923332 556566582 555857315 555378494 555031853 555312042 555326500 554696770
2679E54696770n10941l76167m81300p46766n81092l58124j24054k82135l54500n06935
$$ 554696770 554185829 553809662 553328362 552581596 552000504 551642380 551518326 551236191 550881691 550374756
2688.7E50374756n05753j54228l98559m70582o27098m12712l41415k83623J12763j65825
$$ 550374756 549869003 549714775 549316216 548845634 548218536 547805824 547464409 547180786 547293549 547127724
2698.3E47127724k91519m23546k75307j67046k50930p45011j116180n00336k15111
$$ 547127724 546836205 546412659 546137352 545970306 545719376 544974365 543858185 543357849 543142738
2707E43142738l1318k61116k4834J57814n65186q64143p56645j26190k09885m06113
$$ 543142738 543111420 542850304 542825470 542983284 542418098 541553955 540797310 540671120 540461235 540055122
2716.6E40055122l77311k98767r5253r92L34015l44506n02815l45497o01540n80520
$$ 540055122 539677811 539379044 539283791 539282799 539616814 539272308 538769493 538423996 537822456 537241936
2726.3E37241936n81551l97186l74794P5416j41105n5962J83067m44526l84026n23758
$$ 537241936 536660385 536263199 535888405 535963821 535822716 535766754 535949821 535505295 535121269 534597511
2735.9E34597511m52385o17065l83415P6103j55487L04146K48565r7618m46052n52330
$$ 534597511 534145126 533528061 533144646 533220749 533065262 533369408 533617973 533520355 533074303 532521973
2745.6E32521973l05291k86636l30696k57950m8332m93622k38266Q7433l03383l53928
$$ 532521973 532216682 531930046 531599350 531341400 531293068 530799446 530561180 530648613 530345230 529991302
2755.2E29991302k99644l13911n55268l04603j11924j95922l61138l05900k32582l58582
$$ 529991302 529691658 529377747 528822479 528517876 528405952 528210030 527848892 527542992 527310410 526951828
2764.9E26951828J17493m3679l62129p44133o78711j40800k95258n722j16882m52042
$$ 526951828 527069321 527025642 526663513 525919380 525240669 525099869 524804611 524798889 524682007 524229965
2774.5E24229965p15751m83704j81465o48499n09071m27017l94860n95207m59633j68342
$$ 524229965 523514214 523030510 522849045 522200546 521691475 521264458 520869598 520274391 519814758 519646416
2784.2E19646416m79622m01116n46455m55322l47901n86586o46095m44870n33905l47404
$$ 519646416 519166794 518765678 518219223 517763901 517416000 516829414 516183319 515738449 515204544 514857140
2793.8E14857140J8997q29239p96356o11573p63702p75375j084404m87595k65961m56199
$$ 514857140 514876137 514046898 513250542 512638969 511875267 511099892 510015488 509527893 509261932 508805733
2803.4E08805733o35643l92723m77448r42497o83479p19376p64084j191444q22792
$$ 508805733 508170090 507777367 507299919 506357422 505673943 504954567 504190483 502999039 502176247
2812.1E02176247l64037l90701m85726j325874o23894j62925n48668j222649j591453
$$ 502176247 501812210 501421509 500935783 499609909 498986015 498823090 498274422 497051773 495460320
2820.8D95460320q18406q95156p55349n95016n22576p82623j001091o43577j165734
$$ 495460320 494641914 493746758 492991409 492396393 491873817 491091194 490090103 489446526 488280792
2829.5D88280792j028213q01926r81712j115685j011314p29294r21593q10013j094779
$$ 488280792 487252579 486450653 485468941 484353256 483341942 482612648 481691055 480881042 479786263
2838.2D79786263j388741j389313j594658k010574j936302j650276k012444j654549
$$ 479786263 478397522 477008209 475413551 473402977 471466675 469816399 467803955 466149406
2845.9D66149406j641197j900825j512757j531372j940536j835098j411744j565628
$$ 466149406 464508209 462607384 461094627 459563255 457622719 455787621 454375877 452810249
2853.6D52810249r71260k90870n8022K6665j84403k17018k55089j26381n92422o65207
$$ 452810249 451838989 451548119 451490097 451516762 451332359 451115341 450860252 450733871 450141449 449476242
2863.2D49476242n75027n30167p24602j479912q28018r18579j028557n73845n70602
$$ 449476242 448901215 448371048 447646446 446166534 445338516 444419937 443391380 442817535 442246933
2871.9D42246933m64668r57527o83403r23119r85107n31312q58726o24084m55475n18494
$$ 442246933 441782265 440824738 440141335 439218216 438233109 437701797 436843071 436218987 435763512 435245018
2881.6D35245018j048927r40247l53508p54204j249580r86633o59981j200829j065216
$$ 435245018 434196091 433255844 432902336 432148132 430898552 429911919 429251938 428051109 426985893
2890.2D26985893j201858j135330m44489r39178r03397p01485p38182r10797j038704
$$ 426985893 425784035 424648705 424204216 423265038 422361641 421660156 420921974 420011177 418972473
2898.9D18972473o69556m77943m34685r36508q98018n90324n82581n67283r43566o63299
$$ 418972473 418302917 417824974 417390289 416453781 415555763 414965439 414382858 413815575 412872009 412208710
2908.6D12208710n42603j342697j507645j038818j052246j248779j428376j230774
$$ 412208710 411666107 410323410 408815765 407776947 406724701 405475922 404047546 402816772
2916.3D02816772q80546j237145j016540o79245j113396j055412q30460r31587m83475
$$ 402816772 401936226 400699081 399682541 399003296 397889900 396834488 396004028 395072441 394588966
2925C94588966k85110n22957k82288k89421k1629L32451L17573J46828K62909P09000
$$ 394588966 394303856 393780899 393498611 393209190 393187561 393520012 393837585 393984413 394247322 394956322
2934.6C94956322J67007J38664O21415O18019L61099M00085Q67234N99746Q10166O01082
$$ 394956322 395123329 395261993 395883408 396501427 396862526 397262611 398129845 398729591 399539757 400140839
2944.2D00140839L41568R97314P40929J67198K77634J047058Q88137R12285Q32100
$$ 400140839 400482407 401479721 402220650 402387848 402665482 403712540 404600677 405512962 406345062
2952.9D06345062J50147N96122O09475O81839M65011M07868O30836O30379J041450
$$ 406345062 406495209 407091331 407700806 408382645 408847656 409255524 409886360 410516739 411558189
2961.6D11558189M33960L33290O58265O48765N78613R21593Q40340K17132J144181
$$ 411558189 411992149 412325439 412983704 413632469 414211082 415132675 415973015 416190147 417334328
2970.3D17334328R82895M78057N78576P24411J035995N63393O96602M02793M47083
$$ 417334328 418317223 418795280 419373856 420098267 421134262 421697655 422394257 422797050 423244133
2979D23244133M83093O5460L07618R3422K69546M08402L28865J07345N01709N91850
$$ 423244133 423727226 423792686 424100304 424193726 424463272 424871674 425200539 425307884 425809593 426401443
2988.6D26401443Q8959L98560j24283l41339o09665l49007M05350J16081P515n67856
$$ 426401443 426490402 426888962 426764679 426423340 425813675 425464668 425870018 425986099 425993614 425425758
2998.2D25425758n28106m85344o85044m78477l00293l56636p26318m29802p97196m61235
$$ 425425758 424897652 424412308 423727264 423248787 422948494 422591858 421865540 421435738 420638542 420177307
3007.9D20177307k40745r08699m10538l10326n57365o36864l60413q19969q79974k99568
$$ 420177307 419936562 419027863 418617325 418306999 417749634 417112770 416752357 415932388 415052414 414752846
3017.5D14752846o69708n87311r33190p55996o16341j025314o36826k88582n07698
$$ 414752846 414083138 413495827 412562637 411806641 411190300 410164986 409528160 409239578 408731880
3026.2D08731880j361160r48525o10961n92614m49066j074982q20999p45697r78851
$$ 408731880 407370720 406422195 405811234 405218620 404769554 403694572 402873573 402127876 401149025
3034.9D01149025r10988p81021j057777r93119n41420p87887m02756m38271p23571
$$ 401149025 400238037 399457016 398399239 397406120 396864700 396076813 395674057 395235786 394512215
3043.6C94512215r11026j310997j096993j009178q48808o69098l74718m50668q52089
$$ 394512215 393601189 392290192 391193199 390184021 389335213 388666115 388291397 387840729 386988640
3052.2C86988640j134796j019936o72645j144028j057930r14383q63609m38843l57170
$$ 386988640 385853844 384833908 384161263 383017235 381959305 381044922 380181313 379742470 379385300
3060.9C79385300n46608j090470r06868n83610o05049q54874j123657q37288n11208
$$ 379385300 378838692 377748222 376841354 376257744 375652695 374797821 373674164 372836876 372325668
3069.6C72325668o10466j206550q77686l03535m66805q31451o55289n48706j015549
$$ 372325668 371715202 370508652 369630966 369327431 368860626 368029175 367373886 366825180 365809631
3078.3C65809631n91316p84874j015091p75451p39556o09817r48525n44204k98462
$$ 365809631 365218315 364433441 363418350 362642899 361903343 361293526 360345001 359800797 359502335
3087C59502335k49787r33647j499748p28684q21380m47274n57556q44917m40521o03523
$$ 359502335 359252548 358318901 356819153 356090469 355269089 354821815 354264259 353419342 352978821 352375298
3096.6C52375298n13459q52852q77075j054039j280365n84411k09923n46494q79936
$$ 352375298 351861839 351008987 350131912 349077873 347797508 347213097 347003174 346456680 345576744
3105.3C45576744n30815p88460p79953m73594q76580j013489r66110m89959m38157
$$ 345576744 345045929 344257469 343477516 343003922 342127342 341113853 340147743 339657784 339219627
3114C39219627q26339r19876r72901n57518r2087o24618j269608j109771j058236p52983
$$ 339219627 338393288 337473412 336500511 335942993 335850906 335226288 333956680 332846909 331788673 331035690
3123.6C31035690n32646q72154p58553k82669n72357j081428q42247j078377r04427
$$ 331035690 330503044 329630890 328872337 328589668 328017311 326935883 326093636 325015259 324110832
3132.3C24110832n63698q12187o23398p40280m70695n13153j020775j051903j130104
$$ 324110832 323547134 322734947 322111549 321371269 320900574 320387421 319366646 318314743 317184639
3141C17184639p98111k54173k54631r37081j181564j066170q43944n95303m52671m12731
$$ 317184639 316386528 316132355 315877724 314940643 313759079 312692909 311848965 311253662 310800991 310388260
3150.6C10388260q78563o20441o64483q49342r67064j222858o78616r05609o03352
$$ 310388260 309509697 308889256 308224773 307375431 306408367 305185509 304506893 303601284 302997932
3159.3C02997932o66751j021672l69205q49476j090927p97310l15838m96311j027107
$$ 302997932 302331181 301309509 300940304 300090828 298999901 298202591 297886753 297390442 296363335
3168B96363335o58036q88443j034889p50770m87633o04496p56321q94108j072102p75299
$$ 296363335 295705299 294816856 293781967 293031197 292543564 291939068 291182747 290288639 289216537 288441238
3177.6B88441238q50734n02281m87576q35762o42910o28586o19697q69351p52067p55806
$$ 288441238 287590504 287088223 286600647 285764885 285121975 284493389 283873692 283004341 282252274 281496468
3187.3B81496468q25406o63356p51648o07147p80468l82824k156m87537p76539j056004
$$ 281496468 280671062 280007706 279256058 278648911 277868443 277485619 277483463 276995926 276219387 275163383
3196.9B75163383r07325o02074o57062m88720m68064o89659n80044p41653p69329n03693
$$ 275163383 274256058 273653984 272996922 272508202 272040138 271350479 270770435 270028782 269259453 268755760
3206.5B68755760q09536p02476m30165n82828o38981n99899q18882q30212l71361n39665
$$ 268755760 267946224 267243748 266813583 266230755 265591774 264991875 264172993 263342781 262971420 262431755
3216.2B62431755n13191m65813o93016n39455o19297n24540p62196p53040p4921k81410
$$ 262431755 261918564 261452751 260759735 260220280 259600983 259076443 258314247 257561207 257486286 257204876
3225.8B57204876o55499n56526o29997o58894m99286q89569q34980j03302m93011r94663
$$ 257204876 256549377 255992851 255362854 254703960 254204674 253315105 252480125 252376823 251883812 250889149
3235.5B50889149p61357m23584j1654l35769q23803m31156m76132n51910l12767o57444
$$ 250889149 250127792 249704208 249692554 249356785 248532982 248101826 247625694 247073784 246761017 246103573
3245.1B46103573m38194l12863p39460n20134j27563k55242p34329r09672k17628M25815
$$ 246103573 245665379 245352516 244613056 244092922 243965359 243710117 242975788 242066116 241848488 242274303
3254.8B42274303m95414o86398o7596o39649m50096m76284q60863k57816m93946q75835
$$ 242274303 241778889 241092491 241024895 240385246 239935150 239458866 238598003 238340187 237846241 236970406
3264.4B36970406k85969J64242n35298q49590m4747j64642l69034j68895m98963l13873
$$ 236970406 236684437 236848679 236313381 235463791 235419044 235254402 234885368 234716473 234217510 233903637
3274B33903637k28176p37190j009331p66049J14670L40862L2845k48165o17638j88904
$$ 233903637 233675461 232938271 231928940 231162891 231277561 231618423 231651268 231403103 230785465 230596561
3283.7B30596561l31173q09974m42238K22034K72294q73032r17034j39084o0768k0867
$$ 230596561 230265388 229455414 229013176 229235210 229507504 228634472 227717438 227578354 227517586 227496719
3293.3B27496719k22053m85478l12538r441k09847m09546m89463l13607r7560m47007
$$ 227496719 227274666 226789188 226476650 226467209 226257362 225847816 225358353 225044746 224947186 224500179
3303B24500179k81295j02616j94187l69148m27647j34182m77161o19870l84445k97260
$$ 224500179 224218884 224116268 223922081 223552933 223125286 222991104 222513943 221894073 221509628 221212368
3312.6B21212368l21541k45914j77269m35677j93004m6349m65145q87852l94287L20129
$$ 221212368 220890827 220644913 220467644 220031967 219838963 219792614 219327469 218439617 218045330 218365459
3322.3B18365459m35638p52373k26097n61123q47931m32911p40966q48542P5932j78471
$$ 218365459 217929821 217177448 216951351 216390228 215542297 215109386 214368420 213519878 213595810 213417339
3331.9B13417339q00934o56299j20850J08929o43024o42338j68438o02093r18694j84612
$$ 213417339 212616405 211960106 211839256 211948185 211305161 210662823 210494385 209892292 208973598 208788986
3341.6B08788986J00041q85105j064969k47516L52745O0177p51896n66502n7335j40896
$$ 208788986 208889027 208003922 206938953 206691437 207044182 207104359 206352463 205785961 205728626 205587730
3351.2B05587730k60467o08025m71019n0621l26214M8694J98403k05727q6441k08874
$$ 205587730 205327263 204719238 204248219 204197598 203871384 203920078 204118481 203912754 203826313 203617439
3360.8B03617439m26903o49623j85585J34353j90887j97144n15175l20739J3733J03511
$$ 203617439 203190536 202540913 202355328 202489681 202298794 202101650 201586475 201265736 201279469 201382980
3370.5B01382980j99260o12221K4891K34985J93215k49329m70219K92244r2087m30946
$$ 201382980 201183720 200571499 200596390 200831375 201024590 200775261 200305042 200597286 200505199 200074253
3380.1B00074253P9308J71222k41298k48509Q4152n0163K50874M08210m8065m34818
$$ 200074253 200153561 200324783 200083485 199834976 199919128 199868965 200119839 200528049 200479984 200045166
3389.8B00045166m56810J64089L32031l92971o85100q9207J95580p6142K87991K12936
$$ 200045166 199588356 199752445 200084476 199691505 199006405 198917198 199112778 199036636 199324627 199537563
3399.4A99537563l24573j5335l8204R3898L71247l24822j11503L88393Q5487o5269
$$ 199537563 199212990 199197655 199159451 199253349 199624596 199299774 199188271 199576664 199662151 199596882
3409.1A99596882J30749L30486K02980L32584J86730J18809K14805k6607j04428k36416
$$ 199596882 199727631 200058117 200261097 200593681 200780411 200899220 201114025 201087418 200982990 200746574
3418.7B00746574O50959O83060k72446K23084L92876N77087M26903l10173l22171J73359
$$ 200746574 201397533 202080593 201808147 202031231 202424107 203001194 203428097 203117924 202795753 202969112
3428.3B02969112O29044N24273K56634J6861M12693N73082L3264K49138M96235M75444
$$ 202969112 203598156 204122429 204379063 204395924 204808617 205381699 205414963 205664101 206160336 206635780
3438B06635780L29571J09730N82332Q62389l4275j05019P16019O52523M12998M3106
$$ 206635780 206965351 207075081 207657413 208519802 208485527 208380508 209096527 209749050 210162048 210205154
3447.6B10205154L98598J105576J006508M97016K15664O62175N61065K58618L86181
$$ 210205154 210603752 211709328 212715836 213212852 213428516 214090691 214651756 214910374 215296555
3456.3B15296555P84206R15146J27849M8600M13437Q26377O54946M16336O83269O17619
$$ 215296555 216080761 216995907 217123756 217172356 217585793 218412170 219067116 219483452 220166721 220784340
3466B20784340J221714N53226Q7719Q89950Q84075J213074P87411K81620M95949K96058
$$ 220784340 222006054 222559280 222646999 223536949 224421024 225634098 226421509 226703129 227199078 227495136
3475.6B27495136L47004Q36182J114654Q55866R37767J134262J047726M75120M33216
$$ 227495136 227842140 228678322 229792976 230648842 231586609 232720871 233768597 234243717 234676933
3484.3B34676933R53255R19209J023178O71653L37124L69301P37228J363087R56116
$$ 234676933 235630188 236549397 237572575 238244228 238581352 238950653 239687881 241050968 242007084
3493B42007084Q85162P88479M45538P90195R90257Q57735P51057R73663J046562J033764
$$ 242007084 242892246 243680725 244126263 244916458 245906715 246764450 247515507 248489170 249535732 250569496
3502.6B50569496Q59394P33891P11822L46108J237449K118512O31599N2967J690025
$$ 250569496 251428890 252162781 252874603 253220711 254458160 256576672 257208271 257261238 258951263
3511.3B58951263J611195M85058L86276J327152J590939Q15430N65109L87955Q99887
$$ 258951263 260562458 261047516 261433792 262760944 264351883 265167313 265732422 266120377 267020264
3520B67020264J592197J449623Q01201K79808J360798J835175J345787Q11367O15348
$$ 267020264 268612461 270062084 270863285 271143093 272503891 274339066 275684853 276496220 277111568
3528.6B77111568J029950J309375J052990J302319K101269J182251P42302J049957
$$ 277111568 278141518 279450893 280503883 281806202 283907471 285089722 285832024 286881981
3536.4B86881981J309852J910058J193962J001663R95617J468334J381531Q47435J740684
$$ 286881981 288191833 290101891 291295853 292297516 293293133 294761467 296142998 296990433 298731117
3545B98731117J581307J653614P90195J411343K024765J657543K077770K50511J249905
$$ 298731117 300312424 301966038 302756233 304167576 306192341 307849884 309927654 310178165 311428070
3553.7C11428070J759930J366253J931915J451397K212620J765747J523971R40476
$$ 311428070 313188000 314554253 316486168 317937565 320150185 321915932 323439903 324380379
3561.4C24380379J381798K091293J413421L318940J809463M28734J284485J666679
$$ 324380379 325762177 327853470 329266891 332585831 334395294 334824028 336108513 337775192
3569.1C37775192L111954J464958J423035J968422K460403K241554J609803K160110
$$ 337775192 340887146 342352104 343775139 345743561 348203964 350445518 352055321 354215431
3576.9C54215431J265869K124596J767616J420937K664184K457543J810188J193695
$$ 354215431 355481300 357605896 359373512 360794449 363458633 365916176 367726364 368920059
3584.6C68920059L405419L037567R35936K760009M87862J715393L160324K933693K090035
$$ 368920059 372325478 375363045 376298981 379058990 379546852 381262245 384422569 387356262 389446297
3593.2C89446297J920051K851639J115341K740288L032455J397782L372421K154198
$$ 389446297 391366348 394217987 395333328 398073616 401106071 402503853 405876274 408030472
3601D08030472J206932K431755K333794K478447L108558K810021L61786L432083J617927
$$ 408030472 409237404 411669159 414002953 416481400 419589958 422399979 422761765 426193848 427811775
3609.6D27811775Q04138O967850K699967o24390M032173R65385L528443L839950J715012
$$ 427811775 428615913 435583763 438283730 437659340 441691513 442656898 446185341 450025291 451740303
3618.3D51740303L319931Q43659J656227M098472L685417K299729K491188K679519
$$ 451740303 455060234 455903893 457560120 461658592 465344009 467643738 470134926 472814445
3626D72814445K974320N919380L410187l822136L243103M334946M573402K255592K78626
$$ 472814445 475788765 481708145 485118332 481296196 484539299 488874245 493447647 495703239 495981865
3634.7D95981865K929459L793716L116798J551667K351150L616219L523254K475968
$$ 495981865 498911324 502705040 505821838 507373505 509724655 513340874 516864128 519340096
3642.4E19340096J639175K873306L680496N638848K020149j752510N051536K001610
$$ 519340096 520979271 523852577 527533073 533171921 535192070 533439560 538491096 540492706
3650.1E40492706m17442L02963M905014M929352L983574N750046m210282J330033N117950
$$ 540492706 540075264 540378227 545283241 550212593 554196167 559946213 555735931 557065964 562183914
3658.8E62183914J736069K380218J434212K329750J448174J650581K406616J290856
$$ 562183914 563919983 566300201 567734413 570064163 571512337 573162918 575569534 576860390
3666.5E76860390M140854J997985O93436L249855m454803J376190O902695Q345069
$$ 576860390 581001244 582999229 583692665 586942520 582487717 583863907 590766602 599111671
3674.3E99111671J718483j3839645J777000P153817M643097j489792J98860K631454
$$ 599111671 600830154 586990509 588767509 595921326 600564423 599074631 599273491 601904945
3682F01904945K191468J739044O16073K33994L095283O027947n607376l812828Q158188
$$ 601904945 604096413 605835457 606451530 606685524 609780807 615808754 610201378 606388550 614546738
3690.6F14546738j749115j578217M469681Q90732N67550N17121K79007J605453O65016
$$ 614546738 612797623 611219406 615689087 616579819 617147369 617664490 617943497 619548950 620213966
3699.3F20213966K100716L397331k459869k266464L087501J353035N12352O98929J596794
$$ 620213966 622314682 625712013 623252144 620985680 624073181 625426216 625938568 626637497 628234291
3708F28234291K748642o089058L414497P015648j0264091K051697L923759L94135M53949
$$ 628234291 630982933 624893875 628308372 635324020 625059929 627111626 631035385 631429520 631883469
3716.7F31883469J783943J556473k905808N88112N012970k032509l718338M007950
$$ 631883469 633667412 635223885 632318077 632906189 637919159 635886650 632168312 636176262
3724.4F36176262J656914p401j635475o65092K552909N38369M305954j285096o757812
$$ 636176262 637833176 637825775 636190300 635525208 638078117 638616486 642922440 641637344 634879532
3733.1F34879532P306595K238693o010246j78604Q86230L61862J347008K477188k433166
$$ 634879532 642186127 644424820 638414574 638235970 639122200 639484062 640831070 643308258 640875092
3741.8F40875092J700897R948883m187164j6573792P039986N233650N057907j198883
$$ 640875092 642575989 652524872 648337708 631763916 638803902 644037552 649095459 647896576
3749.5F47896576r667587Q056411j313934o341934M620895M093628L184128m323883
$$ 647896576 638228989 646285400 644971466 638629532 643250427 647344055 650528183 646204300
3757.2F46204300J132049N415268n574493k064896K989655M74167O5918L458099j636581
$$ 646204300 647336349 652751617 647177124 645112228 648101883 648576050 648641968 652100067 650463486
3765.9F50463486m202805K919922M596100P44476o722030J779098K799988o7520O7749
$$ 650463486 646260681 649180603 653776703 654521179 647799149 649578247 652378235 652310715 652378464
3774.5F52378464j063004P33795L21656K260742J77154o445388K302475J756134M78439
$$ 652378464 651315460 652049255 652370911 654631653 654808807 648363419 650665894 652422028 652900467
3783.2F52900467J974869j508484k06833Q40683J01471J44272k30866J11313l4943
$$ 652900467 654875336 653366852 653160019 654000702 654102173 654246445 654015579 654126892 654091949
3791.9F54091949P52488L42025J246186L478927l052673m830322J045837K973251N577164
$$ 654091949 654844437 655186462 656432648 659911575 656858902 652028580 653074417 656047668 661624832
3800.6F61624832l573303r056931K915879K027664L584518N448990n885696m371338
$$ 661624832 658051529 648994598 651910477 653938141 657522659 662971649 657085953 652714615
3808.3F52714615K709274L73459k71301Q71048K29645P63778M138565j192322j0931777
$$ 652714615 655423889 655797348 655526047 656397095 656626740 657390518 661529083 660336761 649404984
3817F49404984M236221M089203K444458M069519j2005997j210785M379730J931458
$$ 649404984 653641205 657730408 660174866 664244385 652238388 651027603 655407333 657338791
3824.7F57338791J725998p3776k771836j6098J966248K917785J095810p268295Q53424
$$ 657338791 659064789 658991013 656219177 656203079 658169327 661087112 662182922 654914627 655768051
3833.4F55768051N843582m028320r87854O806793n010986m259033O565780l090133
$$ 655768051 661611633 657583313 656595459 663402252 658391266 654132233 660698013 657607880
3841.1F57607880j763840N790253j38626l040314J030884k00959o88705J076507j170578
$$ 657607880 655844040 661634293 661495667 658455353 659486237 659285278 658596573 659673080 658502502
3849.8F58502502J107865M407959m753418L440857q787003k478256Q220673m38233
$$ 658502502 659610367 664018326 659264908 662705765 653918762 651440506 659661179 659222946
3857.5F59222946k174530R10721J771316L156128l786087p0037N699996m533615n566558
$$ 659222946 657048416 657959137 659730453 662886581 659100494 659030457 664730453 660196838 654630280
3866.2F54630280L140182L948364M318161m257660q299026K112198N033874M008103
$$ 654630280 657770462 661718826 666036987 661779327 653480301 655592499 660626373 664634476
3873.9F64634476o489106r51309K706909n72662J686020M004745l613128o121292L621521
$$ 664634476 658145370 657194061 659900970 659328308 661014328 665019073 661405945 655284653 658906174
3882.6F58906174J091385J212463L909759j0540161J58768M055634P49206L229752
$$ 658906174 659997559 661210022 665119781 654579620 654738388 658794022 659543228 662772980
3890.3F62772980K03933n965957N46722K390824j338807M53644J38397R85489K348786
$$ 662772980 662976913 657010956 657557678 659948502 658609695 659063339 659201736 660187225 662536011
3898.9F62536011o673966K996521K536087m017257L764343p92923j580505J68991k58942
$$ 662536011 655862045 658858566 661394653 657377396 661141739 660348816 658768311 658937302 658678360
3907.6F58678360R88388K67487m1199n42603m3487J89972o65207K44980K102890k210312
$$ 658678360 659666748 659934235 659893036 659350433 659306946 659496918 658831711 659076691 661179581 658969269
3917.3F58969269l360520L472672J017532k824249J220093J436615M34875j116180
$$ 658969269 655608749 659081421 660098953 657274704 658494797 659931412 660366287 659250107
3925F59250107k091217P60956J106643M33045k46277M13742K319946j746063j985092
$$ 659250107 657158890 657919846 659026489 659459534 659213257 659626999 661946945 660200882 658215790
3933.7F58215790J071014J3275m6463p20291k93503O25840J89437J279908L19137l049698
$$ 658215790 659286804 659300079 659253616 658533325 658239822 658865662 659055099 660335007 660654144 657604446
3943.3F57604446q22067J060410O79092J010285j540833O638J063919j953354J047821
$$ 657604446 656782379 657842789 658521881 659532166 657991333 657997971 659061890 657108536 658156357
3952F58156357O23627p56150J26419J4725M76379m59289K73743n04227p45392K45743
$$ 658156357 658779984 658023834 658150253 658164978 658641357 658182068 658455811 657951584 657206192 657451935
3961.6F57451935k99912Q74787L31649j87912l16696j95465O42929k17437j12839K92663
$$ 657451935 657152023 658026810 658358459 658170547 657853851 657658386 658301315 658083878 657971039 658263702
3971.3F58263702l15628n40390K41852Q18100L2425q20770n4322O34690j46027r8572
$$ 658263702 657948074 657407684 657649536 658467636 658500061 657679291 657624969 658259659 658113632 658015060
3980.9F58015060M23584k46963p81632L29972L87726n1804K12021j57471N60074k55737
$$ 658015060 658438644 658191681 657410049 657740021 658127747 658075943 658287964 658130493 658690567 658434830
3990.6F58434830j177597l10135M13894J050721J14517l09067J4038L46756L04337
$$ 658434830 657257233 656947098 657360992 658411713 658526230 658217163 658231201 658577957 658882294
3999.2F58882294L63235
$$ 658882294 659245529
4000.2F59245529
$$ 659245529
##END=$$ End of the data block
