##TITLE=$$ Begin of the data block
##JCAMP-DX=5.00 $$ ACD/SpecManager v 10.08
##SPECTROMETER/DATA SYSTEM=Varian
##DATE=14 Jan 2013 10:02:04
##DATA TYPE=INFRARED SPECTRUM
##DATA CLASS=XYDATA
##ORIGIN=
##OWNER=
##NPOINTS=3735
##FIRSTX=399.26403809
##LASTX=4000.35498047
##MAXX=4000.35498047
##MINX=399.26403809
##MAXY=70.95695496
##MINY=20.15749550
##XFACTOR=1.0000000000
##YFACTOR=0.000000100000000
##FIRSTY=41.57898712
##DELTAX=0.96440572
##XUNITS=1/CM
##YUNITS=TRANSMITTANCE
##XYDATA=(X++(Y..Y))
$$ plain form
399.3 415789871 419882240 421275978 412767334 407067719 413424454 420364609 416294518 411746750
407 411746750 415065689 417041016 418279114 409730873 403648911 409775276 413510933 417974434 416474915
415.7 416474915 415803413 417849693 412620544 410803909 408588371 412019424 411206093 404058189 400557632
424.3 400557632 403007393 408640671 409715271 412140236 407530365 404111290 407062149 404042587
432.1 404042587 405231056 407216454 403270454 404910088 409369812 405767555 404482422 407469482
439.8 407469482 407694130 404614983 402792053 405574837 405407486 405854874 406197433 405355606 406555405
448.4 406555405 406196518 410151901 414234581 413398247 411114502 408732605 407308769 404508629 400363808
457.1 400363808 399013939 403189697 404859886 405257492 402789001 399202003 400199432 402217445 403474655
$$ packed form
399.3D15789871M092369J393738q508644n699615O356735O940155m070091m547768
407D11746750L318939J975327J238098q548241o081962O126365L735657M463501j499519
415.7D16474915o71502K046280n229149j816635k215538L431053q13331p147904l500557
424.3D00557632K449761N633278J074600K424965m609871l419075K950859l019562
432.1D04042587J188469J985398l946000J639634M459724l602257j285133K987060
439.8D07469482K24648l079147j822930K782784j67351M47388L42559q41827J199799
448.4D06555405l58887L955383M082680q36334k283745k381897j423836k800140m144821
457.1D00363808j349869M175758J670189L97606k468491l586998R97429K018013J257210
$$ plain form
465.8 403474655 400073586 395747299 394527016 396031799 400948944 401179619 396581459 394273033 397218285
474.5 397218285 399677124 397479439 397648354 394930534 389100304 388833466 391372261 390262222 387623978
483.2 387623978 387903328 388577080 388292847 389033699 388889160 388309021 389137421 390504074 392043343
491.8 392043343 390158539 388278008 387987976 385909042 384002304 381589851 383486176 388412132 388660736
500.5 388660736 386049690 383124008 382376366 382645454 381981201 378938484 378086128 380885887 383301964
509.2 383301964 385711174 386436729 385304680 381878929 380021553 379974289 378806953 377465591 377025757
517.9 377025757 377758217 375432510 374264565 374439201 374365578 375206070 375194893 376018066 373690910 372902641
527.5 372902641 374163589 373460655 371798325 369992943 371948128 372537384 371132660 371374321 371928329
$$ packed form
465.8D03474655l401069m326287j220283J504783M917145K30675m598160k308426K945252
474.5C97218285K458839k197685J68915k717820n830230k66838K538795j110039k638244
483.2C87623978K79350O73752k84233P40852j44539n80139Q28400J366653J539269
491.8C92043343j884804j880531k90032k078934j906738k412453J896325M925956K48604
500.5C88660736k611046k925682p47642K69088o64253l042717q52356K799759K416077
509.2C83301964K409210P25555j132049l425751j857376m7264j167336j341362m39834
517.9C77025757P32460k325707j167945J74636p3623Q40492j1177Q23173k327156p88269
527.5C72902641J260948p02934j662330j805382J955185N89256j404724K41661N54008
$$ plain form
536.2 371928329 371663132 369936714 370106583 370958862 370172348 368607826 369165497 370179787 368450966
544.9 368450966 366018982 364494095 364864731 364799805 365964279 365535011 362791786 364046822 364537468
553.6 364537468 361737595 359634247 361023407 361311760 359686737 358932457 357954941 359764137 361832352
562.3 361832352 363036728 362635574 361225052 361151733 360732880 361281395 360688019 359843597 359737625 359742317
571.9 359742317 359784164 359881096 361261864 360867310 359918633 358791161 357471466 357181664 358040504 359696388
581.5 359696388 359792328 361096802 361655884 360338211 358500252 357399788 359073029 360163116 360436516
590.2 360436516 359640617 359841537 361606293 362139969 362676582 363469315 364392395 364073715 362766190
598.9 362766190 360946350 360626335 361966400 362245865 362473450 362440071 361780815 359715996 358157196
$$ packed form
536.2C71928329k65197j726418J69869Q52279p86514j564522N57671J014290j728821
544.9C68450966k431984j524887L70636o4926J164474m29268k743225J255036M90646
553.6C64537468k799873k103348J389160K88353j625023p54280r77516J809196K068215
562.3C61832352J204376m01154j410522p3319m18853N48515n93376q44422j05972M692
571.9C59742317M1847R6932J380768l94554r48677j127472j319695k89802Q58840J655884
581.5C59696388R5940J304474N59082j317673j837959j100464J673241J090087K73400
590.2C60436516p95899K00920J764756N33676N36613P92733R23080l18680j307525
598.9C62766190j819840l20015J340065K79465K27585l3379o59256k064819j558800
$$ plain form
607.6 358157196 358323402 358316498 357985573 356567307 355369911 355255661 356105843 356193924 356263123 357291183
617.2 357291183 357033730 356596184 356397820 356744156 356407166 356014938 356142235 356922989 359261246 359694061
626.9 359694061 360797920 363164635 364717216 365393333 365141182 366028214 367461319 369594231 371682777
635.5 371682777 373344002 375024605 376083183 376745491 377464142 379171028 379906158 380267754 380540009
644.2 380540009 380737724 383172455 385717545 387481155 388105164 388116379 388482590 389059067 390084038
652.9 390084038 390056686 389920616 389798927 389731216 390358963 391345749 392696724 391597710 389315681 388404922
662.5 388404922 387553596 387090416 387880898 389133301 389883537 388945694 389992638 391782112 391987228
671.2 391987228 390854225 390808105 392790680 394798775 395289307 395911865 396435547 397792015 400613861
$$ packed form
607.6C58157196J66206o904l30925j418266j197396j14250Q50182Q8081O9199J028060
617.2C57291183k57453m37546j98364L46336l36990l92228J27297P80754K338257M32815
626.9C59694061J103859K366715J552581O76117k52151Q87032J433105K132912K088546
635.5C71682777J661225J680603J058578O62308P18651J706886P35130L61596K72255
644.2C80540009J97715K434731K545090J763610O24009J1215L66211N76477J024971
652.9C90084038k7352j36070j21689o7711O27747R86786J350975j099014k282029r10759
662.5C88404922q51326m63180P90482J252403P50236r37843J046944J789474K05116
671.2C91987228j133003m6120J982575K008095M90532O22558N23682J356468K821846
$$ plain form
679.9 400613861 402365265 403667831 405166855 406566277 407018776 406141739 406637611 408348389 409557343
688.6 409557343 410877113 412157593 413045692 413860054 413909187 413075714 413584328 415165482 415687714
697.3 415687714 416463928 417821045 419246216 421000519 420936852 419790649 419898071 420613747 421413956
705.9 421413956 422344971 423434601 424042816 424653397 425853653 426830025 428107872 428989983 428902397
714.6 428902397 429102974 429377594 429678879 430463524 431694527 433046875 434138680 435042152 435452766
723.3 435452766 435575867 436450195 437268562 437192688 437693863 439067001 441079102 443001595 444241409
732 444241409 445885201 446523170 446233215 446954041 447694626 447426529 447377777 448640900 449031105 448666382
741.6 448666382 448960800 450308571 452880669 454280548 454441185 453641891 453006744 453897018 454631157
$$ packed form
679.9D00613861J751404J302566J499024J399422M52499q77037M95872J710778J208954
688.6D09557343J319770J280480Q88099Q14362M9133q33473N08614J581154N22232
697.3D15687714P76214J357117J425171J754303o3667j146203J07422P15676Q00209
705.9D21413956R31015J089630O08215O10581J200256R76372J277847Q82111q7586
714.6D28902397K00577K74620L01285P84645J231003J352348J091805R03472M10614
723.3D35452766J23101Q74328Q18367p5874N01175J373138K012101J922493J239814
732D44241409J643792O37969k89955P20826P40585k68097m8752J263123L90205l64723
741.6D48666382K94418J347771K572098J399879J60637p99294o35147Q90274P34139
$$ plain form
750.3 454631157 455596352 456896439 457090111 456427383 457685738 460238380 461554260 462495003 463346024
759 463346024 464725571 465910149 466790085 468192825 469509773 470657272 471051941 471831894 472604446
767.7 472604446 472535057 472376823 472396584 472580032 472394447 472388306 472615089 473686104 474393463 473555603
777.3 473555603 473127251 473500900 474044647 473610420 473236847 474249344 475392418 475910873 476133957
786 476133957 476527176 476782913 476869469 476909370 477144127 477442589 477759819 477882919 477855072 478035851 478072357
796.6 478072357 477892342 476902885 476104393 474825401 473241386 472537460 471259041 470445366 469534721
805.3 469534721 468161201 466650352 465333519 464039879 461837654 459811516 457675934 456973801 456223068
814 456223068 454596901 453801994 452621765 452344666 452049484 451475067 451756248 452004852 452255402 453134499
$$ packed form
750.3D54631157R65195J300087J93672o62728J258355K552642J315880R40743Q51021
759D63346024J379547J184578Q79936J402740J316948J147499L94669P79953P72552
767.7D72604446o9389j58234J9761J83448j85585o141K26783J071015P07359q37860
777.3D73555603m28352L73649N43747m34227l73573J012497J143074N18455K23084
786D76133957L93219K55737Q6556L9901K34757K98462L17230J23100k7847J80779L6506
796.6D78072357j80015r89457p98492j278992j584015p03926j278419q13675r10645
805.3D69534721j373520j510849j316833j293640k202225k026138k135582p02133p50733
814D56223068j626167p94907j180229k77099k95182n74417K81181K48604K50550Q79097
$$ plain form
823.6 453134499 454497032 456071587 459854889 463993340 466923409 469714241 472364693 475036926
831.3 475036926 476312447 478376846 481301994 484364471 487120895 488907127 492381516 495089645
839 495089645 496678963 498003464 499482231 501015778 501330986 502167549 503000374 504529343 506118279
847.7 506118279 507742882 509122047 509913788 511759415 512407761 513144684 514380035 515677910 517245903
856.4 517245903 518129120 519815712 521727562 522585793 523588257 525540886 526083794 525786133 524636497
865.1 524636497 523858948 524487495 523322525 522611351 521091957 518300209 515844154 513642387 512282715
873.8 512282715 509604836 507250175 506031876 504942474 504755516 505799103 505512238 504213371 504402161
882.4 504402161 503666954 503132668 502944756 502493629 501918068 501038170 501538658 501751442 501565323 501169205
$$ packed form
823.6D53134499J362533J574555L783302M138451K930069K790832K650452K672233
831.3D75036926J275521K064399K925148L062477K756424J786232L474389K708129
839D95089645J589318J324501J478767J533547L15208Q36563Q32825J528969J588936
847.7E06118279J624603J379165P91741J845627O48346P36923J235351J297875J567993
856.4E17245903Q83217J686592J911850Q58231J002464J952629N42908k97661j149636
865.1E24636497p77549O28547j164970p11174j519394k791748k456055k201767j359672
873.8E12282715k677879k354661j218299j089402j86958J043587k86865j298867J88790
882.4E04402161p35207n34286j87912m51127n75561q79898N00488K12784j86119l96118
$$ plain form
892.1 501169205 501182060 501466713 501368599 501515388 501237373 501593513 502363167 503139267 502321091 501287575
901.7 501287575 501313744 500851974 502045364 503981323 506806717 509717293 511723137 514002800 515806313
910.4 515806313 517265015 517016563 516876755 517133408 516391678 514212646 511221924 509099541 506693573
919.1 506693573 504491615 501841164 499631348 497401123 494130020 491000404 487084427 483292809
926.8 483292809 478952599 474718895 471749306 469104538 466677361 464923134 463469772 461300507
934.5 461300507 459944458 459209290 458141632 456659164 455373154 454337959 453080635 452953758 452000313
943.2 452000313 450472069 449725571 448934326 448015900 447111855 447387848 447526131 447624245 447390251 446360931
952.8 446360931 446086044 445321541 443905869 442278595 440890656 439365387 437274628 434801216 432337456
$$ packed form
892.1E01169205J2855K84653r8114J46789k78015L56140P69654P76100q18176j033516
901.7E01287575K6169m61770J193390J935959K825394K910576K005844K279663J803513
910.4E15806313J458702k48452j39808K56653p41730k179032k990722k122383k405968
919.1E06693573k201958k650451k209816k230225l271103l129616l915977l791618
926.8D83292809m340210m233704k969589k644768k427177j754227j453362k169265
934.5D61300507j356049p35168j067658j482468j286010j035195j257324j26877r53445
943.2D52000313j528244p46498p91245r18426r04045K75993J38283R8114k33994j029320
952.8D46360931k74887p64503j415672j627274j387939j525269k090759k473412k463760
$$ plain form
961.5 432337456 430467186 428181343 425829010 423535500 421837158 420200119 418158112 416690979
969.2 416690979 414339027 412107162 410350380 407988663 405217323 401579285 397993813 394372139
976.9 394372139 390002975 385955505 382338791 377992516 373108253 368288612 363202019 357673645
984.7 357673645 352552452 348024635 343496094 338764114 334412575 330305214 325899963 322577057
992.4 322577057 319654102 316466961 313112030 309494324 306298256 303368778 300526485 297592773
1000.1 297592773 295167923 292192211 289349937 286868744 283873882 281691895 279640179 278436260
1007.8 278436260 276865559 274852772 273101578 271017685 269046230 266614628 265158844 263222752
1015.5 263222752 261208954 258748417 255643368 253842163 251499958 250111427 248213291 245931988
$$ packed form
961.5D32337456j870270k285843k352333k293510j698342j637039k042007j467133
969.2D16690979k351952k231865j756782k361717k771340l638038l585472l621674
976.9C94372139m369164m047470l616714m346275m884263m819641n086593n528374
984.7C57673645n121193m527817m528541m731980m351539m107361m405251l322906
992.4C22577057k922955l187141l354931l617706l196068k929478k842293k933712
1000.1B97592773k424850k975712k842274k481193k994862k181987k051716j203919
1007.8B78436260j570701k012787j751194k083893j971455k431602j455784j936092
1015.5B63222752k013798k460537l105049j801205k342205j388531j898136k281303
$$ plain form
1023.2 245931988 244315758 242713547 241520042 240043697 239816322 238732643 237516994 236699829 235639496
1031.9 235639496 234658222 233280354 233048000 233217354 235071449 237149677 238836555 240398827 241712894
1040.6 241712894 243248062 243795910 245044994 245427380 246113529 246507664 245491772 244933681 243722134
1049.3 243722134 243292294 242277641 241167755 239655819 237942028 237016296 235555420 235161037 234475441
1058 234475441 234728622 235607738 236902924 238329773 239846115 241943913 242559795 244458408 245700245
1066.6 245700245 246898785 248895035 250395699 251297283 250627213 251757240 252357559 252746582 253850651
1075.3 253850651 254547462 254703960 253818626 254732246 255357285 255873489 256832275 258266869 259640522
1084 259640522 260007095 261630802 263226986 264619541 265726948 267596626 269293728 270444183 271570759
$$ packed form
1023.2B45931988j616230j602211j193505j476345k27375j083679j215649q17165j060333
1031.9B35639496r81274j377868k32354J69354J854095K078228J686878J562272J314067
1040.6B41712894J535168N47848J249084L82386O86149L94135j015892n58091j211547
1049.3B43722134m29840j014653j109886j511936j713791r25732j460876l94383o85596
1058B34475441K53181Q79116J295186J426849J516342K097798O15882J898613J241837
1066.6B45700245J198540J996250J500664R01584o70070J130027O00319L89023J104069
1075.3B53850651O96811J56498q85334R13620O25039N16204R58786J434594J373653
1084B59640522L66573J623707J596184J392555J107407J869678J697102J150455J126576
$$ plain form
1092.7 271570759 272243919 274765987 276437283 277713318 279377117 281030216 282517109 283247547 285138531
1101.4 285138531 286359520 287739544 289163170 290855179 293152294 294244614 294937305 295113049 296100807
1110 296100807 296895351 297999954 299720936 300587902 301803493 303072205 304402294 304599934 304448566
1118.7 304448566 304423542 304306202 304693794 304944630 305681000 306166897 306913967 307429523 308071213 309588356
1128.4 309588356 311148033 313069744 314762726 316933956 318794594 321147804 324551010 327618561
1136.1 327618561 330040054 331864433 334077721 335851173 337691307 339142952 339889946 341159515
1143.8 341159515 342053108 342781982 343892174 345296783 345535545 345190849 345646591 345862122 345943375
1152.5 345943375 345533409 344927292 344590530 344536095 344703293 343911972 342983093 342849426 342441177 341595879
$$ packed form
1092.7B71570759O73160K522068J671296J276035J663799J653099J486893P30438J890984
1101.4B85138531J220989J380024J423626J692009K297115J092320O92691J75744R87758
1110B96100807P94544J104603J720982Q66966J215591J268712J330089J97640j51368
1118.7C04448566k5024j17340L87592K50836P36370M85897P47070N15556O41690J517143
1128.4C09588356J559677J921711J692982K171230J860638K353210L403206L067551
1136.1C27618561K421493J824379K213288J773452J840134J451645P46994J269569
1143.8C41159515Q93593P28874J110192J404609K38762l44696M55742K15531Q1253
1152.5C45943375m09966o06117l36762n4435J67198p91321r28879j33667m08249q45298
$$ plain form
1162.1 341595879 341040535 340747871 341981506 344255638 346211128 348692513 351173439 354227257 357705956
1170.8 357705956 360299110 362401009 365333748 368921852 372373924 375384178 377875786 380614586
1178.5 380614586 383167343 386089630 389165421 391869698 394260025 395770416 397298470 399014893
1186.2 399014893 400241203 400863876 401590385 402030907 401972122 401916962 401909561 401624413 400649643 399790802
1195.9 399790802 399124374 398318710 397202339 396108284 395049820 393872147 392667732 391071091 390015678
1204.5 390015678 388847733 387642441 387251816 386614418 386465759 386293488 385621643 385090752 384206581
1213.2 384206581 383498993 383103790 382607155 381892662 381598053 381197624 380300255 380327110 380254059 379475899
1222.9 379475899 378729935 378075027 377369690 376033821 374740295 374122009 373923836 373491859 372745247
$$ packed form
1162.1C41595879n55344k92664J233635K274132J955490K481385K480926L053818L478699
1170.8C57705956K593154K101899K932739L588104L452072L010254K491608K738800
1178.5C80614586K552757K922287L075791K704277K390327J510391J528054J716423
1186.2C99014893J226310O22673P26509M40522n8785n5160p401k85148r74770q58841
1195.9C99790802o66428q05664j116371j094055j058464j177673j204415j596641j055413
1204.5C90015678j167945j205292l90625o37398j48659j72271o71845n30891q84171
1213.2C84206581p07588l95203m96635p14493k94609m00429q97369K6855p3051p78160
1222.9C79475899p45964o54908p05337j335869j293526o18286j98173m31977p46612
$$ plain form
1231.5 372745247 372315063 371732025 370868454 370022812 369263420 368566055 368393326 368792648 368682709 368184700
1241.2 368184700 367735786 367435608 367349472 367332268 366864433 366081123 365599289 364863739 364158630 364036331
1250.8 364036331 364223099 364235878 364194527 364306488 364183311 364340019 364091034 363254776 362714806 362309494
1260.5 362309494 362530937 363210258 363775253 364188957 364867935 365948372 366912651 367481194 367830544
1269.2 367830544 367924805 368428726 369786339 370868416 371786118 372722778 373799400 375029449 376139030
1277.8 376139030 377405853 378296890 378959160 379888725 381414871 383182487 384779739 386226883 387730789
1286.5 387730789 389460945 390824318 392303200 393514099 394389076 395078354 395454826 395923004 396627541
1295.2 396627541 397688141 398273277 398915787 399882736 400687485 400753136 400329590 400630341 400861893 400728989
$$ packed form
1231.5C72745247m30184n83038q63571q45642p59392o97365j72729L99322j09939m98009
1241.2C68184700m48914l00178q6136j7204m67835p83310m81834p35550p05109j22299
1250.8C64036331J86768J2779m1351J11961j23177J56708k48985q36258n39970m05312
1260.5C62309494K21443O79321N64995M13704O78978J080437R64279N68543L49350
1269.2C67830544R4261N03921J357613J082077R17702R36660J076622J230049J109581
1277.8C76139030J266823Q91037O62270R29565J526146J767616J597252J447144J503906
1286.5C87730789J730156J363373J478882J210899Q74977O89278L76472M68178P04537
1295.2C96627541J060600N85136O42510R66949Q04749O5651m23546L00751K31552j32904
$$ plain form
1304.8 400728989 400362091 400252647 400167580 399721756 399049187 398106270 397439690 396618271 396030960 395485573
1314.5 395485573 395343437 395584373 395298538 395470581 395866356 396862907 397812119 398506813 399488258 400115089
1324.1 400115089 400707970 400890388 401402130 401895676 401807289 401383476 400904884 400525131 399827538 399659157
1333.8 399659157 399176674 398663788 398450012 398374252 398805962 398731728 399456711 400536880 401500397 402142181
1343.4 402142181 402843132 403747330 403939552 404748306 405076103 405356255 405868149 406016350 405761032 404712029
1353.1 404712029 404211807 403755112 403646812 403428993 402980995 402509155 402059631 401803017 400613632
1361.7 400613632 400136948 399686089 399545326 399522324 398603973 397642174 396362915 396076164 396114693 396079483
1371.4 396079483 395698586 395003624 394821434 394594917 394828110 394442062 394027328 393310432 392828636 392811203
$$ packed form
1304.8D00728989l66898j09444q5067m45824o72569r42917o66580q21419n87311n45387
1314.5C95485573j42136K40936k85835J72043L95775R96551R49212O94694R81445O26831
1324.1D00115089N92881J82418N11742M93546q8387m23813m78592l79753o97593j68381
1333.8C99659157m82483n12886k13776p5760M31710p4234P24983J080169R63517O41784
1343.4D02142181P00951R04198J92222Q08754L27797K80152N11894J48201k55318j049003
1353.1D04712029n00222m56695j08300k17819m47998m71840m49524k56614j189385
1361.7D00613632m76684m50859j40763k3002r18351r61799j279259k86751L8529l5210
1371.4C96079483l80897o94962j82190k26517K33193l86048m14734p16896m81796j7433
$$ plain form
1381 392811203 391842957 390642662 389069672 387978210 386768608 385488167 383741493 381764336 380673828
1389.7 380673828 378589172 376109734 373900948 372362938 370096893 367108803 365844650 364288521
1397.4 364288521 362517357 358985901 356225052 354584236 352411270 350417137 347999268 345778160
1405.1 345778160 343975372 342355309 340707436 338815956 337157555 335363731 334306183 332945251
1412.8 332945251 331299057 329967422 328811874 328082199 326576653 326074600 324770889 324636116 325664673
1421.5 325664673 325657883 326008835 325588188 326308670 327060928 327339363 328178749 328467865 329990807 331152611
1431.2 331152611 333039093 334743958 336038284 337779083 338761559 341251106 342989159 345411148
1438.9 345411148 347107887 348886795 351006737 352626152 355010300 356372185 358477783 359832458
$$ packed form
1381C92811203r68246j200295j572990j091462j209602j280441j746674j977157j090508
1389.7C80673828k084656k479438k208786j538010k266045k988090j264153j556129
1397.4C64288521j771164l531456k760849j640816k172966j994133k417869k221108
1405.1C45778160j802788j620063j647873j891480j658401j793824j057548j360932
1412.8C32945251j646194j331635j155548p29675j505546n02053j303711j34773J028557
1421.5C25664673o790L50952m20647P20482P52258K78435Q39386K89116J522942J161804
1431.2C31152611J886482J704865J294326J740799R82476K489547J738053K421989
1438.9C45411148J696739J778908K119942J619415K384148J361885K105598J354675
$$ plain form
1446.6 359832458 361181564 362865829 364215927 366269226 367197838 368959961 369724007 371211929 372826271
1455.3 372826271 373230934 375430794 375952606 379955139 381832581 384049568 385669594 386917725 388859634
1464 388859634 389889717 393734016 396141853 399158325 401464500 403470955 406228485 407683258 410900002
1472.6 410900002 414253616 418231430 420616951 423351212 427000694 430072708 432903252 434239197
1480.3 434239197 436537323 438798027 440859756 442771721 443873940 445270042 446402702 447437172
1488.1 447437172 448063316 448327599 449306297 450355110 451124077 450778427 450128403 449205894 445857697
1496.7 445857697 445780334 445125504 443638573 443616562 442648354 441189003 440134201 439760704 438548088
1505.4 438548088 436505241 435986328 435562630 436509018 436317329 436459656 436165619 435258484 434762039
$$ packed form
1446.6C59832458J349106J684265J350098K053299R28612J762123P64046J487922J614342
1455.3C72826271M04663K199860N21812M002533J877442K216987J620026J248131J941909
1464C88859634J030083L844299K407837L016472K306175K006455K757530J454773L216744
1472.6D10900002L353614L977814K385521K734261L649482L072014K830544J335945
1480.3D34239197K298126K260704K061729J911965J102219J396102J132660J034470
1488.1D47437172O26144K64283R78698J048813P68967l45650o50024r22509l348197
1496.7D45857697p7363o54830j486931k2011r68208j459351j054802l73497j212616
1505.4D38548088k042847n18913m23698R46388j91689J42327k94037r07135m96445
$$ plain form
1514.1 434762039 433955498 432990799 430849457 431041336 432443886 433186111 431513443 430454979 432661667
1522.8 432661667 433994751 435414886 435719948 435883560 436193008 437206650 438528214 439256935 440036888
1531.5 440036888 440518188 440925102 440294876 441642761 442533340 441994591 441982803 439366608 438186874
1540.1 438186874 440720367 441296158 441979332 443714485 444191780 444021530 445275497 445285873 445410233
1548.8 445410233 444925346 444917603 445817184 445896912 446556969 445193520 444829712 444629364 444390755 442475586
1558.5 442475586 436609116 438656158 437581711 437921181 436513519 435299339 432970505 430094185
1566.2 430094185 428499947 425635986 424185181 417005844 414715538 412251701 408273735 405131416
1573.9 405131416 401471329 399645615 388944740 387236099 384200439 380034027 375877266 370330276
$$ packed form
1514.1D34762039q06541r64699k141342J91879J402550P42225j672668j058464K206688
1522.8D32661667J333084J420135L05062J63612L09448J013642J321564P28721P79953
1531.5D40036888M81300M06914o30226J347885Q90579n38749j1788k616195j179734
1540.1D38186874K533493N75791O83174J735153M77295j70250J253967J0376J24360
1548.8D45410233m84887p743Q99581P9728O60057j363449l63808k00348k38609j915169
1558.5D42475586n866470K047042j074447L39470j407662j214180k328834k876320
1566.2D30094185j594238k863961j450805p179337k290306k463837l977966l142319
1573.9D05131416l660087j825714j0700875j708641l035660m166412m156761n546990
$$ plain form
1581.6 370330276 366608315 360495491 356703339 351501083 347264900 343154373 337907028 334524384
1589.3 334524384 328597107 325196915 319617004 315938110 311612759 306809044 304264603 299177685
1597 299177685 296883335 292376328 290178394 286563263 283172073 281236076 277185955 276187134 272809944
1605.7 272809944 271904621 268836765 267032051 265850372 263271484 263658218 261076565 260774117 258279514
1614.4 258279514 258034649 257176952 252608280 255559139 254763298 256065712 254876194 255791931 255393906
1623.1 255393906 254488029 256357021 255495625 257400684 256575890 258238087 258612919 259605179 261357288
1631.7 261357288 261353493 263385906 262765884 265186234 264739704 267847614 270268307 271453667 274083576
1640.4 274083576 274498539 276977406 277715111 280160351 281929493 281948986 284627705 284493256 288983955
$$ packed form
1581.6C70330276l721961o112824l792152n202256m236183m110527n247345l382644
1589.3C34524384n927277l400192n579911l678894m325351m803715k544441n086918
1597B99177685k294350m507007k197934l615131l391190j935997m050121r98821l377190
1605.7B72809944r05323l067856j804714j181679k578888L86734k581653l02448k494603
1614.4B58279514k44865q57697m568672K950859p95841J302414j189518R15737l98025
1623.1B55393906r05877J868992q61396J905059q24794J662197L74832R92260J752109
1631.7B61357288l795K032413o20022K420350m46530L107910K420693J185360K629909
1640.4B74083576M14963K478867P37705K445240J769142J9493K678719j34449M490699
$$ plain form
1649.1 288983955 290237598 292944756 293930531 290483074 296870937 298600025 302666187 303757267
1656.8 303757267 306240864 307675018 310191574 312754173 314650745 318806286 320721321 324210281
1664.5 324210281 326067810 329035835 331738434 333869057 337081680 339352913 344916878 347686386
1672.3 347686386 351827965 355419579 358971138 363543549 367050171 371643524 374661942 379445229
1680 379445229 383046684 387071533 391242485 393724709 401936378 404785233 410688019 415304985 420039024
1688.6 420039024 424527550 428834114 434032097 438292313 443328552 448339233 454079819 457163277
1696.4 457163277 461969376 467499084 472226448 476584167 478590164 484621086 489001389 492685661
1704.1 492685661 496519928 500420952 504041977 507801895 511593208 513988419 516039314 518380699
$$ packed form
1649.1B88983955J253643K707158R85775l447457O387863J729088M066162J091080
1656.8C03757267K483597J434154K516556K562599J896572M155541J915035L488960
1664.5C24210281J857529K968025K702599K130623L212623K271233N563965K769508
1672.3C47686386M141579L591614L551559M572411L506622M593353L018418M783287
1680C79445229L601455M024849M170952K482224Q211669K848855N902786M616966M734039
1688.6D20039024M488526M306564N197983M260216N036239N010681N740586L083458
1696.4D57163277M806099N529708M727364M357719K005997O030922M380303L684272
1704.1D92685661L834267L901024L621025L759918L791313K395211K050895K341385
$$ plain form
1711.8 518380699 521021194 523325996 523827972 524967728 528898659 531523476 529079666 532617111
1719.5 532617111 535537834 537309837 538788872 539835396 540828133 542431870 544204826 545251808
1727.2 545251808 546794739 548411407 549115410 550629768 553437119 556125031 555115051 553842545
1734.9 553842545 557529221 560904198 562475357 564754639 566680984 566745796 570414200 573619499 575425835
1743.6 575425835 577539024 580905991 584162445 586353607 589486465 592374382 596696472 598916588
1751.3 598916588 600894356 605616798 609122353 612356873 615126152 616648369 619180298 622391701
1759 622391701 624523468 626598244 626948891 628095322 631675720 633680458 635545578 637614212 639355240
1767.7 639355240 639268875 641147690 644158173 643862000 643249588 642952728 646766739 649229050 648668213
$$ packed form
1711.8E18380699K640495K304802N01976J139756L930931K624817k443810L537445
1719.5E32617111K920723J772003J479035J046524R92737J603737J772956J046982
1727.2E45251808J542931J616668P04003J514358K807351K687912j009980j272506
1734.9E53842545L686676L374977J571159K279282J926345O4812L668404L205299J806336
1743.6E75425835K113189L366967L256454K191162L132858K887917M322090K220116
1751.3E98916588J977768M722442L505555L234520K769279J522217K531929L211403
1759F22391701K131767K074776L50647J146431L580398K004738J865120K068634J741028
1767.7F39355240q6365J878815L010483k96173o12412k96860L814011K462311n60837
$$ plain form
1776.4 648668213 650470734 651461563 653035049 653692093 653571320 654899139 656516571 658044434 657568207
1785.1 657568207 657920151 659236221 660369492 661081390 662273483 663257370 664193573 663940506 663364410
1793.8 663364410 666119385 666855774 666821899 668194733 669490967 669865494 669388046 671538086 672002487
1802.4 672002487 672941437 674597549 675106812 675680542 675827942 676325836 676752930 677988281 677885742
1811.1 677885742 678429489 680107040 681038513 682047729 681822586 682668457 682803040 683037796 684039383
1819.8 684039383 683949203 684528732 684786148 686229782 687227173 686119156 686333160 687516937 688439331
1828.5 688439331 688093948 687000732 687541580 689749832 690560379 690905685 691554260 691726532 691948090
1837.2 691948090 691908035 693022690 692886963 693129272 693225403 693426743 694477615 692102356 694212418
$$ packed form
1776.4F48668213J802521R90829J573486O57044j20773J327819J617432J527863m76227
1785.1F57568207L51944J316070J133271P11898J192093R83887R36203k53067n76096
1793.8F63364410K754975P36389l3875J372834J296234L74527m77448K150040M64401
1802.4F72002487R38950J656112N09263N73730J47400M97894M27094J235351j02539
1811.1F77885742N43747J677551R31473J009216k25143Q45871J34583K34756J001587
1819.8F84039383r0180N79529K57416J443634R97391j108017K14004J183777R22394
1828.5F88439331l45383j093216N40848K208252Q10547L45306O48575J72272K21558
1837.2F91948090m0055J114655j35727K42309R6131K01340J050872k375259K110062
$$ plain form
1845.8 694212418 695930405 696088486 695984726 696005707 696578522 696382217 697158813 697508240 698001251 698229599
1855.5 698229599 698478088 699237595 699161148 699424362 698978043 699376678 699494247 699537964 699936752 700184174
1865.1 700184174 701149597 700670166 701005402 700359726 699601517 700595932 701315689 701875305 701807175 702592926
1874.8 702592926 702867813 703371124 703751678 704013367 704197311 703243637 703449173 703243027 703523941 703937454
1884.4 703937454 704090042 704416046 704465256 705542068 705225372 704225464 704275970 704928436 705005264 704792404
1894.1 704792404 704930420 704356461 705315704 705905380 706320648 706489868 706311646 706515579 705981140 706086807
1903.7 706086807 705702362 706087723 706661987 706761322 707229156 707427521 707926483 707644882 707922440 707602615
1913.3 707602615 707204514 706779785 706504822 707634506 706732712 706901016 707931061 708482590 708662872
$$ packed form
1845.8F94212418J717987J58081j03760K0981N72815j96305P76596L49427M93011K28348
1855.5F98229599K48489P59507p6447K63214m46319L98635J17569M3717L98788K47422
1865.1G00184174R65423m79431L35236o45676p58209R94415P19757N59616o8130P85751
1874.8G02592926K74887N03311L80554K61689J83944r53674K05536k06146K80914M13513
1884.4G03937454J52588L26004M9210J076812l16696r99908N0506O52466P6828k12860
1894.1G04792404J38016n73959R59243N89676M15268J69220j78222K03933n34439J05667
1903.7G06086807l84445L85361N74264R9335M67834J98365M98962k81601K77558l19825
1913.3G07602615l98101m24729k74963J129684r01794J68304J030045N51529J80282
$$ plain form
1922 708662872 707806244 707408905 707295074 707737656 707362366 707464752 708147964 708616257 709104767 709115601
1931.7 709115601 709569550 709106522 708784790 708393555 707973328 707803421 707471848 707810135 707856293 708894196
1941.3 708894196 708922882 708076859 708499756 708431396 708069916 707527618 707886353 707730255 707505493 707767868
1951 707767868 708101807 708772049 709010773 709117050 708683929 708630066 707916946 707370148 707320862 706612473
1960.6 706612473 706874008 707187271 707803116 707920151 707976379 708137360 707541580 707412872 706917648 706780930
1970.2 706780930 706472473 706444321 706875381 707215729 707709503 707878418 708175201 707683945 707373199 707033920
1979.9 707033920 706681442 706316223 705746613 706185226 706236801 706631927 706863327 707019577 707153778 706829224
1989.5 706829224 707026291 706232605 705342941 705065842 705557251 706121826 706231384 706225967 705852051 706154251
$$ packed form
1922G08662872q56628l97339j13831M42582l75290J02386O83212M68293M88510J0834
1931.7G09115601M53949m63028l21732l91235m20227j69907l31573L38287M6158J037903
1941.3G08894196K8686q46023M22897o8360l61480n42298L58735j56098k24762K62375
1951G07767868L33939O70242K38724J06277m33121n3863p13120n46798m9286p08389
1960.6G06612473K61535L13263O15845J17035N6228J60981n95780j28708m95224j36718
1970.2G06780930l08457k8152M31060L40348M93774J68915K96783m91256l10746l39279
1979.9G07033920l52478l65219n69610M38613N1575L95126K31400J56250J34201l24554
1989.5G06829224J97067p93686q89664k77099M91409N64575J09558n417l73916L02200
$$ plain form
1999.2 706154251 706075897 706248016 706027603 705396118 705145416 704665985 704747086 704403152 704541550 704832535
2008.8 704832535 705144424 705233383 704441071 704219666 703936234 703859406 703481293 703201141 703167648 703181305
2018.5 703181305 703470840 703463593 703777084 703411179 703274689 703053131 702713165 702639465 702419662 702539215
2028.1 702539215 701902771 701927261 701733398 701792679 702096481 701477280 701667862 701305695 701031113 700691147
2037.7 700691147 700701141 700884476 700241623 699953232 699505539 699742813 699644775 699617386 699639816 699265671
2047.4 699265671 699511414 699397430 699337006 698926239 699073410 699258728 699075089 698913269 698436356 698564148
2057 698564148 698171082 698308105 698635406 698687973 698592148 698103790 698185959 697955551 697883377 697591171 697784958
2067.6 697784958 697933731 697556610 697630310 697453995 697966232 697919235 697561493 697214432 696887817 696964264
$$ packed form
1999.2G06154251p8354J72119k20413o31485k50702m79431Q1101l43934J38398K90985
2008.8G04832535L11889Q8959p92312k21405k83432p6828l78113k80152l3493J3657
2018.5G03181305K89535p247L13491l65905j36490k21558l39966p3700k19803J19553
2028.1G02539215o36444K4490j93863N9281L03802o19201J90582l62167k74582l39966
2037.7G00691147R994J83335o42853k88391m47693K37274r8038k7389K2430l74145
2047.4F99265671K45743j13984o0424m10767J47171J85318j83639j61820m76913J27792
2057F98564148l93066J37023L27301N2567r5825m88358Q2169k30408p2174k92206J93787
2067.6F97784958J48773l77121P3700j76315N12237m6997l57742l47061l26615P6447
$$ plain form
2077.3 696964264 696755829 697149429 697281418 697379837 696935120 696770935 697278595 696923523 696359482 695603561
2086.9 695603561 695775223 695865173 695665817 695491180 695391083 695826416 695920410 696408081 696128693 695797043
2096.6 695797043 695438309 694863892 694759521 694122620 693976364 693716354 693892059 694285812 694413452 694304886
2106.2 694304886 693997879 694110641 693364105 693119202 692741699 692399902 692497025 692446365 693045349 692948914
2115.9 692948914 692933731 692614670 692529068 692619705 692030563 691640015 691288605 691580963 691367645 691744232
2125.5 691744232 692311707 692218170 692193298 691710052 691800079 691406937 691058960 690971375 690993881 690941620 690786896
2136.1 690786896 691382828 691410141 692022552 692097092 691612778 691426086 690999527 690954514 690493164 690793381
2145.8 690793381 691026459 691227570 691392365 691201706 691435165 691124649 691388702 691223679 690811462 690746765
$$ packed form
2077.3F96964264k08435L93600J31989R8419m44717j64185N07660l55072n64041p55921
2086.9F95603561J71662Q9950j99356j74637j00097M35333R3994M87671k79388l31650
2096.6F95797043l58734n74417j04371o36901j46256k60010J75705L93753J27640j08566
2106.2F94304886l07007J12762p46536k44903l77503l41797R7123n0660N98984r6435
2115.9F92948914j5183l19061q5602R0637n89142l90548l51410K92358k13318L76587
2125.5F91744232N67475r3537k4872m83246R0027l93142l47977q7585K2506n2261j54724
2136.1F90786896N95932K7313O12411P4540m84314j86692m26559m5013m61350L00217
2145.8F90793381K33078K01111J64795j90659K33459l10516K64053j65023m12217o4697
$$ plain form
2155.4 690746765 690761719 690918350 690870590 691606674 691703033 691633072 691452332 691178741 691251755 690852585
2165 690852585 690925293 690963058 691258926 691404419 691611786 692102280 692199173 692294846 691961899 691764297 691224823
2175.6 691224823 691022720 691259384 691424866 691816101 692230835 693009644 692913284 692635040 692533569 692524185
2185.3 692524185 692526550 692211151 692191162 692081223 692475204 692587051 692670364 692580338 692494354 693036728 692758865
2195.9 692758865 692538376 692154083 692399750 692739182 692521896 692879410 693081741 693508911 693490372 693539581
2205.5 693539581 693373566 693162231 693129120 692419586 692620544 693093414 693557739 693677673 693988953 694439697
2215.2 694439697 693863297 693343658 693133621 693185654 692517776 692596664 693236923 693360214 693778458 693878021
2224.8 693878021 694278946 693958359 693698959 693567429 693047867 693132629 693049927 693243027 693182755 693279648
$$ packed form
2155.4F90746765J4954J56631m7760P36084R6359o9961j80740k73591P3014l99170
2165F90852585P2708L7765K95868J45493K07367M90494R6893R5673l32947j97602n39474
2175.6F91224823k02103K36664J65482L91235M14734P78809r6360k78244j01471r384
2185.3F92524185K365l15399j9989j09939L93981J11847Q3313r0026q5984N42374k77863
2195.9F92758865k20489l84293K45667L39432k17286L57514K02331M27170j8539M9209
2205.5F93539581j66015k11335l3111p09534K00958M72870M64325J19934L11280M50744
2215.2F94439697n76400n19639k10037N2033o67878P8888O40259J23291M18244R9563
2224.8F93878021M00925l20587k59400j31530n19562Q4762q2702J93100o0272R6893
$$ plain form
2234.5 693279648 693454590 693731689 694189911 694109268 694063950 693493729 693280792 693142090 693085403 693084793 692786331
2245.1 692786331 693094940 693320160 693610458 693759384 693967133 693543320 693061295 692897949 692343063 692855530
2254.7 692855530 693099747 693125992 692942047 692830353 693028183 692695541 692811432 692557526 692607880 692783127
2264.4 692783127 693321838 693678055 693167801 693401031 693164062 692858124 692375717 692386627 692571564 692104111
2274 692104111 692226181 692063751 692238235 692341843 692486725 692525635 692540588 692678833 692036362 691959763
2283.7 691959763 691625824 691795807 691973190 691670837 691979294 691828384 691568756 690876236 690798645 690821838
2293.3 690821838 690770416 690677261 689935989 690195618 690559540 691246643 691180496 690331573 689985580 689727783
2302.9 689727783 689912872 689427185 688812943 688210754 688422241 688915329 688783798 688990860 688903427 689045029
$$ packed form
2234.5F93279648J74942K77099M58222q0643m5318n70221k12937j38702n6687o10k98462
2245.1F92786331L08609K25220K90298J48926K07749m23813m82025j63346n54886N12467
2254.7F92855530K44217K6245j83945j11694J97830l32642J15891k53906N0354J75247
2264.4F92783127N38711L56217n10254K33230k36969l05938m82407J0910J84937m67453
2274F92104111J22070j62430J74484J03608J44882L8910J4953J38245o42471p6599
2283.7F91959763l33939J69983J77383l02353L08457j50910k59628o92520p7591K3193
2293.3F90821838n1422r3155p41272K59629L63922O87103o6147q48923l45993k57797
2302.9F89727783J85089m85687o14242o02189K11487M93088j31531K07062q7433J41602
$$ plain form
2312.6 689045029 688761368 688706131 688052826 686772385 686679993 686736603 687138977 686766891 686809616 687070160
2322.2 687070160 686620331 686564331 686672211 686628876 686202164 686697159 685695038 684608841 685552139 686030884
2331.9 686030884 685202103 684508514 685328217 684516830 683355408 682842712 682422104 682015991 681991196 683362350
2341.5 683362350 683858871 684408264 683563080 683503418 683733292 682270584 682015457 682332458 682724838 682331848
2351.2 682331848 682589188 682443161 682062683 682829285 681430359 681148148 680156708 679390717 678453751
2359.8 678453751 677488327 678368607 678811646 680507126 680306244 680716705 680878830 680594025 680268555
2368.5 680268555 678704147 678637543 678637009 679284515 679215469 679556198 680438156 680400467 680484924 680162964 680069351
2379.1 680069351 679365234 678594666 677997665 678187485 679160690 679116898 679012833 678915176 679097061 678547363
$$ packed form
2312.6F89045029k83661n5237o53305j280441r2392N6610M02374l72086M2725K60544
2322.2F87070160m49829n6000J07880m3335m26712M94995j002121j086197R43298M78745
2331.9F86030884q28781o93589Q19703q11387j161422n12696m20608m06113k4795J371154
2341.5F83362350M96521N49393q45184n9662K29874j462708k55127L17001L92380l92990
2351.2F82331848K57340j46027l80478P66602j398926k82211r91440p65991r36966
2359.8F78453751r65424Q80280M43039J695480k00882M10461J62125k84805l25470
2368.5F80268555j564408o6604n34O47506o9046L40729Q81958l7689Q4457l21960r3613
2379.1F80069351p04117p70568n97001J89820R73205m3792j04065r7657J81885n49698
$$ plain form
2388.8 678547363 677501526 677167435 676748886 676477203 675882797 675898285 675977554 675873413 675937119 675585937
2398.4 675585937 675631104 675258636 674763794 674281311 674064178 673962479 673488159 673668442 673933182 673904190
2408.1 673904190 673613281 673290863 672519989 671707840 670973206 670276337 670211487 669988785 670351715 670364609
2417.7 670364609 670313950 670553741 669989395 669453583 668415756 667655182 667110214 666772766 666696548 666689453
2427.3 666689453 667270432 667122345 666916199 666546173 665652084 664823990 664415436 664155045 663465195 663218613
2437 663218613 663032608 662999878 662967606 663221664 663174057 662315369 661927185 661073151 660295792 659628067
2446.6 659628067 659274826 659299774 659257965 659688034 659388504 659143524 658754959 658012390 657328339 656424179
2456.3 656424179 655968552 655711746 655597305 655265045 655551300 655942612 655565414 655165329 654751053 653860016
$$ packed form
2388.8F78547363j045837l34091m18549k71683n94406J5488P9269j04141O3706l51182
2398.4F75585937M5167l72468m94842m82483k17133j01699m74320J80283K64740k8992
2408.1F73904190k90909l22418p70874q12149p34634o96869o4850k22702L62930J2894
2417.7F70364609n0659K39791n64346n35812j037827p60574n44968l37448p6218p095
2427.3F66689453N80979j48087k06146l70026q94089q28094m08554k60391o89850k46582
2437F63218613j86005l2730l2272K54058m7607q58688l88184q54034p77359o67725
2446.6F59628067l53241K4948m1809M30069k99530k44980l88565p42569o84051r04160
2456.3F56424179m55627k56806j14441l32260K86255L91312l77198m00085m14276q91037
$$ plain form
2465.9 653860016 652269897 651812897 651673965 651326981 651283417 651277084 651593399 650988464 650580292 650242996
2475.6 650242996 649356995 648333435 647302780 646969833 646550369 646484222 646640549 646697235 646339188 645816727
2485.2 645816727 645512238 644791031 644255295 643247452 642644501 642486801 641938019 641663742 641506042
2493.9 641506042 641590881 641232910 640529022 639471970 638670959 638193817 637471237 637251740 636964684 636654854
2503.5 636654854 636358185 636382294 636046982 635380173 635054665 634032555 633215790 632462311 631992493 631767120
2513.2 631767120 631374588 631545944 631692619 631516151 630696182 629978447 629221573 628375130 627717552 627027626
2522.8 627027626 627001572 626965904 627069588 627267532 627235794 626707115 625888481 625142784 624122047 623630257
2532.5 623630257 623151398 623073158 623128929 622931709 622883568 622174835 621746254 621185913 620309601 619650345
$$ packed form
2465.9F53860016j590119m57000j38932l46984m3564o333L16315o04935m08172l37296
2475.6F50242996q86001j023560j030655l32947m19464o6147J56327N6686l58047n22461
2485.2F45816727l04489p21207n35736j007843o02951j57700n48782k74277j57700
2493.9F41506042Q4839l57971p03888j057052q01011m77142p22580k19497k87056l09830
2503.5F36654854k96669K4109l35312o66809l25508j022110q16765p53479m69818k25373
2513.2F31767120l92532J71356J46675j76468q19969p17735p56874q46443o57578o89926
2522.8F27027626k6054l5668J03684J97944l1738n28679q18634p45697j020737m91790
2532.5F23630257m78859p8240N5771j97220m8141p08733m28581n60341q76312o59256
$$ plain form
2542.1 619650345 619053459 618305397 617669678 617929115 618362961 618760147 618517418 617965660 617265778 616377296
2551.7 616377296 615849075 615004883 614468765 614064331 614171600 614314346 614079514 614170609 613665695 613243408
2561.4 613243408 612495842 611417160 610595627 609901237 609442825 609329681 609730377 609672203 609855385 609787712
2571 609787712 608998260 608107414 607203827 606954842 606583252 605895767 605052605 604977875 605219803 605093994
2580.7 605093994 605137672 604712372 604190636 603174858 602354774 601695862 601153488 601309052 600951614 600663376
2590.3 600663376 600329742 600204697 599965363 599408226 598940468 597939873 597143822 596350594 596012230
2599 596012230 595795174 595389786 595150146 594900208 594758606 593842125 593168259 592895966 592445831 591570473
2608.6 591570473 590569496 590125160 589755821 589927711 589866982 589636421 589069061 588195953 587623749 586610870
$$ packed form
2542.1F19650345n96886p48062o35719K59437M33846L97186k42729n51758o99882q88482
2551.7F16377296n28221q44192n36118m04434J07269J42746k34832R1095n04914m22287
2561.4F13243408p47566j078682q21533o94390m58412j13144M00696n8174J83182o7673
2571F09787712p89452q90846r03587k48985l71590o87485q43162p4730K41928j25809
2580.7F05093994M3678m25300n21736j015778q20084o58912n42374J55564l57438k88238
2590.3F00663376l33634j25045k39334n57137m67758j000595p96051p93228l38364
2599E96012230k17056m05388k39640k49938j41602r16481o73866k72293m50135q75358
2608.6E91570473j000977m44336l69339J71890o0729k30561n67360q73108n72204j012879
$$ plain form
2618.3 586610870 585903931 585069466 584382401 584097443 584022751 583928795 583393707 583256264 582724380 581939545
2627.9 581939545 580886459 580126648 579766006 579236221 579410286 578915977 578212051 577914581 577682266
2636.6 577682266 577426949 576707764 575764389 574616928 573900490 573076935 572970467 573221016 572511978
2645.3 572511978 572141304 571608276 570832596 570390549 570140457 569590569 568985062 568442497 567669182 567361641
2654.9 567361641 567070084 566797104 566400261 565828362 565356865 565118027 565024490 564533501 564174614 563456154
2664.6 563456154 562943726 562824287 562455711 562081223 561468468 561189499 560907440 560597801 559906120 559365005
2674.2 559365005 559639511 559359703 558950310 558345146 557770805 557708893 557420387 556706352 555979118 555445251
2683.9 555445251 555057602 555091286 554943733 554701920 554156914 553538361 553101463 552267799 551781044 551411247
$$ packed form
2618.3E86610870p06939q34465o87065k84958p4692r3956n35088j37443n31884p84835
2627.9E81939545j053086p59811l60642n29785J74065m94309p03926k97470k32315
2636.6E77682266k55317p19185r43375j147461p16438q23555j06468K50549p09038
2645.3E72511978l70674n33028p75680m42047k50092n49888o05507n42565p73315l07541
2654.9E67361641k91557k72980l96843n71899m71497k38838r3537m90989l58887p18460
2664.6E63456154n12428j19439l68576l74488o12755k78969k82059l09639o91681n41115
2674.2E59365005K74506k79808m09393o05164n74341o1912k88506p14035p27234n33867
2683.9E55445251l87649L3684j47553k41813n45006o18553m36898q33664m86755l69797
$$ plain form
2693.5 551411247 551345329 551095886 550545769 550347328 550328598 550519676 549964104 549328766 548923378 548655701
2703.1 548655701 547970085 546977577 546989288 546814346 546709900 546560364 546314430 546095161 545566635 545272026
2712.8 545272026 544524460 544058228 543682976 543255653 542988586 542781487 542768745 542502403 542699623 542225304
2722.4 542225304 541425285 541156845 541009560 540818291 540106392 539805946 539442101 539378014 539404297 539235764
2732.1 539235764 539418716 538945160 538572502 538093605 537473793 537038574 536763039 536801529 536770020 537192383
2741.7 537192383 537194214 536557770 535927734 535416908 535216331 535302620 535280838 535013123 534849129 534318695
2751.4 534318695 534249458 534306107 534021873 533882790 533314171 533058090 532733498 532232399 531996231 531832848
2761 531832848 531653709 531334991 531240578 530896797 530429764 529915695 529682732 529708366 529252625 528615570
$$ packed form
2693.5E51411247o5918k49443n50117j98441j8730J91078n55572o35338m05388k67677
2703.1E48655701o85616r92508J1711j74942j04446j49536k45934k19269n28526k94609
2712.8E45272026p47566m66232l75252m27323k67067k07099j2742k66342J97220m74319
2722.4E42225304q00019k68440j47285j91269p11899l00446l63845o4087K6283j68533
2732.1E39235764J82952m73556l72658m78897o19812m35219k75535L8490l1509M22363
2741.7E37192383J831o36444o30036n10826k00577Q6289k1782k67715j63994n30434
2751.4E34318695o9237N6649k84234j39083n68619k56081l24592n01099k36168j63383
2761E31832848j79139l18718r4413l43781m67033n14069k32963K5634m55741o37055
$$ plain form
2770.7 528615570 528039131 527915382 527662888 527191963 526648598 526137733 526065445 525817451 525413742 524887772
2780.3 524887772 524545593 524096489 523600998 523243980 522457199 521986923 521755791 521603775 521126442 520330048
2789.9 520330048 519936485 519407196 518637009 517848015 517356720 517300072 517245483 516388588 515162621 514262466
2799.6 514262466 513637123 513648415 513475761 512681274 511752701 511146622 510511436 509659233 509120941 508516006
2809.2 508516006 507788200 506851730 506168365 505335274 504202805 503713646 503182526 502517815 501938286
2817.9 501938286 501413422 499946823 498320045 497911644 497359314 496838722 496120415 495100784 494174194
2826.6 494174194 493188400 492638588 492066803 491035538 489710388 488846893 487806892 486489525 485781250
2835.3 485781250 484936295 484043198 483306541 482210007 480235329 478123627 476410828 474599648 472917442
$$ packed form
2770.7E28615570n76439j23749k52494m70925n43365n10865p2288k47994m03709n25970
2780.3E24887772l42179m49104m95491l57018p86781m70276k31132j52016m77333p96394
2789.9E20330048l93563n29289p70187p88994m91295n6648n4589q56895j225967r00155
2799.6E14262466o25343J1292j72654p94487r28573o06079o35186q52203n38292o04935
2809.2E08516006p27806r36470o83365q33091j132469m89159n31120o64711n79529
2817.9E01938286n24864j466599j626778m08401n52330n20592p18307j019631r26590
2826.6D94174194r85794n49812n71785j031265j325150q63495j040001j317367p08275
2835.3D85781250q44955q93097p36657j096534j974678k111702j712799j811180j682206
$$ plain form
2843.9 472917442 471251564 469516029 467667198 465726929 463948517 462553177 460907211 459048386
2851.7 459048386 457743301 456550674 455805092 455241661 454876900 454650192 454145317 454120102 454159966 454021759
2861.3 454021759 453395729 452669334 452239761 451572838 450748940 449847069 448947639 447629662 446505432
2870 446505432 445545082 444882545 444801369 444260216 443478279 442126923 441111946 440817070 440189934 439548950
2879.6 439548950 439018555 438359108 437252541 436379509 435435944 434319649 433344193 432502861 432074013
2888.3 432074013 430878525 429724045 429036713 428200684 427239113 425947151 425142136 424558144 423931999
2897 423931999 423168831 422289238 421409950 420611649 420194092 419511299 418661118 417702599 416940193 416371613
2906.6 416371613 415587502 414977264 414433441 413369446 411841736 411113968 410170517 408424301 407047958
$$ packed form
2843.9D72917442j665878j735535j848831j940269j778412j395340j645966j858825
2851.7D59048386j305085j192627p45582n63431l64761k26708n04875k5215L9864j38207
2861.3D54021759o26030p26395m29573o66923q23898r01871q99430j317977j124230
2870D46505432r60350o62537q1176n41153p81937j351356j014977k94876o27136o40984
2879.6D39548950n30395o59447j106567q73032r43565j116295r75456q41332m28848
2888.3D32074013j195488j154480o87332q36029r61571j291962q05015n83992o26145
2897D23931999p63168q79593q79288p98301m17557o82793q50181r58519p62406n68580
2906.6D16371613p84111o10238n43823j063995j527710p27768r43451j746216j376343
$$ plain form
2915.3 407047958 405615997 404208870 403264503 402622414 401465759 400256271 399234962 397965622 397357140
2924 397357140 397315636 397279358 396933823 396669731 396391792 396434937 396732025 396163979 396169281 397159424 398013382
2934.6 398013382 397891388 397626190 398390465 399278107 399849968 399932671 400287781 401343613 402644653
2943.3 402644653 403570137 403945160 404394951 404694099 405606232 406703911 407056084 407402306 408130493
2952 408130493 409037056 409464111 409805031 410517845 411467781 411995583 412348061 413268967 414106674 414486122
2961.6 414486122 414412651 414875832 415915833 416735954 417552376 418494911 419454079 420217285 420810966 421313019
2971.2 421313019 422146111 422818604 423635635 424650612 424988747 425790787 426569290 427008476 427427368
2979.9 427427368 427539482 427650414 427589264 427610092 427789307 428402443 428864021 429129601 429546700 429782791
$$ packed form
2915.3D07047958j431961j407127r44367o42089j156655j209488j021309j269340o08482
2924C97357140m1504l6278l45535k64092k77939M3145K97088n68046N302R90143Q53958
2934.6C98013382j21994k65198P64275Q87642N71861Q2703L55110J055832J301040
2943.3D02644653R25484L75023M49791K99148R12133J097679L52173L46222P28187
2952D08130493R06563M27055L40920P12814R49936N27802L52478R20906Q37707L79448
2961.6D14486122p3471M63181J040001Q20121Q16422R42535R59168P63206N93681N02053
2971.2D21313019Q33092O72493Q17031J014977L38135Q02040P78503M39186M18892
2979.9D27427368J12114J10932o1150K0828J79215O13136M61578K65580M17099K36091
$$ plain form
2989.6 429782791 430319748 430266380 429663963 429220467 429136925 429170113 429087524 429485397 429404449 428653107
2999.2 428653107 427961922 427553749 426972122 426417999 426373329 425996056 425303421 424429703 423966293 423644943
3008.8 423644943 423112106 422587776 421703339 421164703 420397301 419592018 419215851 418621674 418108597 417624283
3018.5 417624283 417029114 416547432 416223068 415235558 414117928 413257294 412339096 411800537 410923119
3027.2 410923119 409865112 409116096 408792686 408217506 407203255 406698532 406075058 405023346 404193230
3035.9 404193230 403931732 402874298 401630249 401230659 400264969 399559822 399125023 398193207 397062569
3044.5 397062569 395999832 395119019 394177055 393093719 391984940 391689987 391171188 390210152 389418373
3053.2 389418373 388332443 387832298 387422829 386512527 385417290 384445610 383511200 382474403 382043457
$$ packed form
2989.6D29782791N36957n3368o02417m43496q3542L3188q2589L97873q0948p51342
2999.2D28653107o91185m08173n81627n54123m4670l77273o92635q73718m63410l21350
3008.8D23644943n32837n24330q84437n38636p67402q05283l76167n94177n13077m84314
3018.5D17624283n95169m81682l24364r87510j117630q60634r18198n38559q77418
3027.2D10923119j058007p49016l23410n75180j014251n04723o23474j051712q30116
3035.9D04193230k61498j057434j244049l99590r65690p05147m34799r31816j130638
3044.5C97062569j062737q80813r41964j083336j108779k94953n18799r61036p91779
3053.2C89418373j085930n00145m09469r10302j095237r71680r34410j036797m30946
$$ plain form
3061.9 382043457 381753998 381158371 380215645 379306107 378614693 377856483 377129707 376335564 375298767
3070.6 375298767 374038544 373341942 372639046 371646271 371216621 370989799 370590324 369980087 369511719
3079.2 369511719 368861275 368010750 366990242 365944061 365265541 364219284 363495674 363150291 362465134
3087.9 362465134 361750259 361199188 360345192 359150200 358580933 357886276 357174034 356736412 356047859
3096.6 356047859 355524712 354566917 353717575 353209305 352044373 351118698 350994110 350426445 349700775
3105.3 349700775 349306412 348277321 347242126 346583405 346233978 345522041 343987160 343077736 342639351
3114 342639351 342022667 341141739 340476112 340146904 339338341 338229370 337260628 336567230 335824738 335049553
3123.6 335049553 334012642 332903442 332354584 331727562 331077995 330611420 330016518 329325867 328914261
$$ packed form
3061.9C82043457k89459n95627r42726r09538o91414p58210p26776p94143j036797
3070.6C75298767j260223o96602p02896r92775m29650k26822l99475o10237m68368
3079.2C69511719o50444q50525j020508j046181o78520j046257p23610l45383o85157
3087.9C62465134p14875n51071q53996j194992n69267o94657p12242m37622o88553
3096.6C56047859n23147r57795q49342n08270j164932r25675j24588n67665p25670
3105.3C49700775l94363j029091j035195o58721l49427p11937j534881r09424m38385
3114C42639351o16684q80928o65627l29208q08563j108971r68742o93398p42492p75185
3123.6C35049553j036911j109200n48858o27022o49567m66575n94902o90651m11606
$$ plain form
3132.3 328914261 328185539 326813126 325736008 324925194 324310799 323651085 323275986 322853661 321640511
3141 321640511 320774155 319985428 318885708 318207817 317712955 316896572 316085434 315182819 314132957 313558121
3150.6 313558121 312965012 312322598 311447411 310534973 309838696 308603039 307773895 307329597 306675930
3159.3 306675930 306050835 305349083 304646702 303865013 302889214 301880741 301537304 301327782 300559711
3168 300559711 299661579 298799381 297747402 296606064 295981846 295388908 294754391 293936214 292790222
3176.6 292790222 291945381 291172028 290794678 290459137 290033760 289483891 288262730 287312222 286839561
3185.3 286839561 286409035 285535603 284395123 283760147 283417473 282896729 281920490 280994396 280476456
3194 280476456 279930458 279106884 278397675 277890568 277117386 276236095 275472679 274800549 274396744 274092712
$$ packed form
3132.3C28914261p28722j372413j077118q10814o14395o59714l75099m22325j213150
3141C21640511q66356p88727j099720o77891m94862q16383q11138r02615j049862n74836
3150.6C13558121n93109o42414q75187r12438o96277j235657q29144m44298o53667
3159.3C06675930o25095p01752p02381p81689r75799j008473l43437k09522p68071
3168C00559711q98132q62198j051979j141338o24218n92938o34517q18177j145992
3176.6B92790222q44841p73353l77350l35541m25377n49869j221161r50508m72661
3185.3B86839561m30526q73432j140480o34976l42674n20744r76239r26094n17940
3194B80476456n45998q23574p09209n07107p73182q81291p63416o72130m03805l04032
$$ plain form
3203.6 274092712 273328304 272717209 272296543 271465626 270796127 270294800 269953613 269300804 268413219 267642536
3213.3 267642536 266650219 266448059 266300087 265428505 264593945 263657513 262883511 262669010 262529984 261765366
3222.9 261765366 260886040 260298214 259842834 259581051 259125805 258708305 258467751 258028412 257282619 256612206
3232.6 256612206 256252327 255508595 254363594 253445644 252844639 252463455 252110519 251809807 251661930
3241.3 251661930 251182346 250466480 249658222 248812065 248661556 248632107 248159752 247602291 247295971 246875648
3250.9 246875648 246096210 245683060 245334339 244970169 244532204 243966198 243688374 242974396 241951942
3259.6 241951942 241323738 241505260 241761475 241286774 240954266 240657291 240110455 239622421 239183960 238798695
3269.2 238798695 238293991 237680931 237244835 236914043 236670780 236682091 236207809 235243721 234619999 234464951
$$ packed form
3203.6B74092712p64408o11095m20666q30917o69499n01327l41187o52809q87585p70683
3213.3B67642536r92317k02160j47972q71582q34560r36432p74002k14501j39026p64618
3222.9B61765366q79326n87826m55380k61783m55246m17500k40554m39339p45793o70413
3232.6B56612206l59879p43732j145001r17950o01005l81184l52936l00712j47877
3241.3B51661930m79584p15866q08258q46157j50509k9449m72355n57461l06320m20323
3250.9B46875648p79438m13150l48721l64170m37965n66006k77824p13978j022454
3259.6B41951942o28204J81522K56215m74701l32508k96975n46836m88034m38461l85265
3269.2B38798695n04704o13060m36096l30792k43263J1311m74282r64088o23722j55048
$$ plain form
3278.9 234464951 234378262 233931084 233580685 233595638 233782425 233442268 232595825 232243824 232283382 232098408
3288.5 232098408 231594219 231353207 231106834 230959930 231026154 230416679 229985294 229865131 229427032 228988476
3298.2 228988476 228607960 228108921 227595329 227323952 227168713 227309742 227349224 227180557 226700802 225816555
3307.8 225816555 225624638 225411758 224865894 224662743 224450283 224266968 224152813 223793144 223073063 222507896
3317.4 222507896 221970901 221531391 221463718 221325989 221006374 220280380 219503078 218894386 218420753 217871494
3327.1 217871494 217318115 217379398 217231979 216850529 216379642 215554771 215039196 214700508 214321308 213644886
3336.7 213644886 212789688 212433453 212253838 211951313 211608505 210906048 210475540 210749054 210389347 209465790
3346.4 209465790 208906269 208869629 208744831 207973232 207709522 207836494 207567539 207288113 207047863 206961060
$$ packed form
3278.9B34464951q6689m47178l50399J4953J86787l40157q46443l52001L9558j84974
3288.5B32098408n04189k41012k46373j46904O6224o09475m31385j20163m38099m38556
3298.2B28988476l80516m99039n13592k71377j55239J41029L9482j68667m79755q84247
3307.8B25816555j91917k12880n45864k03151k12460j83315j14155l59669p20081n65167
3317.4B22507896n36995m39510o7673j37729l19615p25994p77302o08692m73633n49259
3327.1B17871494n53379O1283j47419l81450m70887q24871n15575l38688l79200o76422
3336.7B13644886q55198l56235j79615l02525l42808p02457m30508K73514l59707r23557
3346.4B09465790n59521l6640j24798p71599k63710J26972k68955k79426k40250q6803
$$ plain form
3356 206961060 206936760 206762295 206486435 206212196 206121902 205860443 205237350 205120163 205339527 205184517
3365.7 205184517 204923325 204655857 204700260 204771156 204506817 204055271 203592110 203519707 203393192 203224297
3375.3 203224297 203012657 202769337 202657890 202444477 202600784 202641163 202477894 202245102 201890602 202139893
3384.9 202139893 202448044 202369156 201951447 201574955 201687565 202093620 202268753 201868114 201857891 202168713
3394.6 202168713 202134247 202044392 202112484 202143784 201831970 201762505 201912251 201844578 201816120 201766148 201843491
3405.2 201843491 201882572 201617355 201659069 201972542 202222672 202478218 202453823 202437248 202681503 203013000
3414.8 203013000 203235283 203395271 203751183 203779507 203992329 204307308 204198589 204670868 205233440 205458832
3424.5 205458832 205332890 205216522 205506058 205568256 205970402 206836739 207551231 207957878 207846260 207366600
$$ packed form
3356B06961060k4300j74465k75860k74239r0294k61459o23093j17187K19364j55010
3365.7B05184517k61192k67468M4403P0896k64339m51546m63161p2403j26515j68895
3375.3B03224297k11640k43320j11447k13413J56307M0379j63269k32792l54500K49291
3384.9B02139893L08151p8888m17709l76492J12610M06055J75133m00639j0223L10822
3394.6B02168713l4466q9855O8092L1300l11814o9465J49746o7673k8458m9972P7343
3405.2B01843491L9081k65217M1714L13473K50130K55546k4395j6575K44255L31497
3414.8B03013000K22283J59988L55912K8324K12822L14979j08719M72279N62572K25392
3424.5B05458832j25942j16368K89536O2198M02146Q66337P14492M06647j11618m79660
$$ plain form
3434.1 207366600 207219448 207754040 208368530 208913193 209527893 210005875 210478859 210838776 210755138 211040745
3443.8 211040745 211890678 212826309 213571892 213443832 213967113 214958591 215314903 215912113 216062622 215865307
3453.4 215865307 216355629 217353668 218154907 218714180 219338264 219750919 220268097 220650692 221397018 222441730
3463.1 222441730 222929935 223449688 224048195 224734268 225093403 225695763 226802387 227524967 228035088
3471.7 228035088 228650761 229627590 230245533 230699215 231508598 232360477 233232040 233774548 234060059 234629993
3481.4 234629993 235990944 237034378 238031216 239058857 239532776 240646839 241146469 241516380 242735901
3490.1 242735901 243532028 244469490 245649567 246398067 246987076 247908230 248352165 248901882 250151997
3498.7 250151997 251379795 252719440 253849163 254403210 254102955 254827385 256487217 257174320 257934418
$$ packed form
3434.1B07366600j47152N34592O14490N44663O14700M77982M72984L59917q3638K85607
3443.8B11040745Q49933R35631P45583j28060N23281R91478L56312N97210J50509j97315
3453.4B15865307M90322R98039Q01239N59273O24084M12655N17178L82595P46326J044712
3463.1B22441730M88205N19753N98507O86073L59135O02360J106624P22580N10121
3471.7B28035088O15673R76829O17943M53682Q09383Q51879Q71563N42508K85511N69934
3481.4B34629993J360951J043434R96838J027641M73919J114063M99630L69911J219521
3490.1B42735901P96127R37462J180077P48500N89009R21154M43935N49717J250115
3498.7B50151997J227798J339645J129723N54047l00255P24430J659832O87103P60098
$$ plain form
3507.4 257934418 259258862 260260754 260838261 262297726 263909874 264791946 265471325 266273766 267690907
3516.1 267690907 268929157 269787483 270370197 271337833 272579193 273425484 274666882 275501137 276779041
3524.8 276779041 278370323 278994503 279630470 280740604 282017250 283303013 285091133 286586323 287370090
3533.5 287370090 288450584 290425720 291833248 292215691 293578625 295154743 296637611 297678185
3541.2 297678185 298587341 299866734 301646786 303878212 304773235 306257668 307747936 309211006 311111259
3549.9 311111259 312532177 314148312 314731808 316492138 318431473 319761086 321427498 322980766
3557.6 322980766 325464325 327064819 328043404 328878784 330832024 332737732 333838768 337865219 340149841
3566.2 340149841 341305923 343270721 343736801 346152649 348173714 350249214 352155113 353960495
$$ packed form
3507.4B57934418J324444J001892N77507J459465J612148Q82072O79379Q02441J417141
3516.1B67690907J238250Q58326N82714R67636J241360Q46291J241398Q34255J277904
3524.8B76779041J591282O24180O35967J110134J276646J285763J788120J495190P83767
3533.5B87370090J080494J975136J407528L82443J362934J576118J482868J040574
3541.2B97678185R09156J279393J780052K231426Q95023J484433J490268J463070J900253
3549.9C11111259J420918J616135N83496J760330J939335J329613J666412J553268
3557.6C22980766K483559J600494R78585Q35380J953240J905708J101036M026451K284622
3566.2C40149841J156082J964798M66080K415848K021065K075500J905899J805382
$$ plain form
3574 353960495 355735779 357688332 359974594 361163940 363572273 365693932 367289886 369653664 372272720
3582.6 372272720 374369583 375541420 379118156 381825104 382085075 383947182 384891891 387627182 390783730
3591.3 390783730 393785477 395538216 396905823 400467606 401889954 403873520 407145309 408882065
3599 408882065 411634827 414255867 416478424 419077988 420969353 423133698 426095505 429013252 430621529
3607.7 430621529 434734154 436517410 436426964 441841049 444140167 444858170 448894577 449003677 452670479
3616.4 452670479 456708946 458582230 462970467 464393539 465297279 468810425 472805099 475391045
3624.1 475391045 478177223 480860558 483053207 489026222 491658897 486502075 490521202 495604134
3631.8 495604134 501064377 503844223 503940277 506592255 510415764 514017830 515745811 517730522 521362076
$$ packed form
3574C53960495J775284J952553K286262J189346K408333K121659J595954K363778K619056
3582.6C72272720K096863J171837L576736K706948K59971J862107R44709K735291L156548
3591.3C90783730L001747J752739J367607L561783J422348J983566L271789J736756
3599D08882065K752762K621040K222557K599564J891365K164345K961807K917747J608277
3607.7D30621529M112625J783256r0446N414085K299118P18003M036407J09100L666802
3616.4D52670479M038467J873284M388237J423072R03740L513146L994674K585946
3624.1D75391045K786178K683335K192649N973015K632675n156822M019127N082932
3631.8D95604134N460243K779846R6054K651978L823509L602066J727981J984711L631554
$$ plain form
3640.5 521362076 524979401 527263222 529046783 531596947 534762154 539839783 540406456 539023476
3648.2 539023476 544526749 547081985 548232803 548562469 552871857 557164650 561111565 566933670
3655.9 566933670 562578926 564347839 569562035 571465836 573801689 574656982 577227783 579230194
3663.6 579230194 581213226 583882561 584807777 589098206 591384392 590404739 593104134 590579910 592164268
3672.3 592164268 598614426 606722183 608822784 594612694 595807343 603181000 608308487 607353706
3680 607353706 607171364 609016685 611040268 612547035 613424950 614329872 617441902 623700714 618393860
3688.7 618393860 615090752 623096733 620321159 618492661 622681885 624234009 625218620 625258598 625503998
3697.4 625503998 627209969 627873459 629452324 632355385 629862556 627774429 631479912 633246536
$$ packed form
3640.5E21362076L617325K283821J783561K550164L165207N077629N66673j382980
3648.2E39023476N503273K555236J150818L29666M309388M292793L946915N822105
3655.9E66933670m354744J768913N214196J903801K335853Q55293K570801K002411
3663.6E79230194J983032K669335R25216M290429K286186r79653K699395k524224J584358
3672.3E92164268O450158Q107757K100601j4210090J194649P373657N127487r54781
3680F07353706j82342J845321K023583J506767Q77915R04922L112030O258812n306854
3688.7F18393860l303108Q005981k775574j828498M189224J552124R84611L9978K45400
3697.4F25503998J705971O63490J578865K903061k492829k088127L705483J766624
$$ plain form
3705.1 633246536 633479767 633871956 635871811 639077721 632359810 635213852 642195969 632349854 634429016
3713.8 634429016 638200722 638450317 638912468 640924377 643287506 641118164 641234894 645703812 643310242
3722.5 643310242 639340172 642894211 644475021 645651627 643687286 641947479 644831238 645712509
3730.2 645712509 649677048 647992859 641302490 649004669 652123566 645944443 645329056 646623993
3737.9 646623993 647233505 649138794 652034683 648213730 649090652 659151306 654944229 639618874
3745.6 639618874 646196823 650673218 655997849 655733185 646208267 654563522 652968063 645646667
3753.3 645646667 650299454 653778915 656124802 652535172 654397812 659622192 654063950 652404099
3761 652404099 655489578 656494904 657082367 660045700 657588348 653362808 656279373 660509644 661480865
$$ packed form
3705.1F33246536K33231L92189J999855L205910o717911K854042O982117r846115K079162
3713.8F34429016L771706K49595M62151K011909K363129k169342J16730M468918k393570
3722.5F43310242l970070L554039J580810J176606j964341j739807K883759Q81271
3730.2F45712509L964539j684189o690369P702179L118897o179123o15387J294937
3737.9F46623993O09512J905289K895889l820953Q76922J0060654m207077j5325355
3745.6F39618874O577949M476395N324631k64664r524918Q355255j595459p321396
3753.3F45646667M652787L479461K345887l589630J862640N224380n558242j659851
3761F52404099L085479J005326N87463K963333k457352m225540K916565M230271R71221
$$ plain form
3769.7 661480865 654382858 655681000 659245605 659260712 659609451 659280319 659219284 659097672 662136230
3778.4 662136230 663734818 657391739 658095627 659460526 660558243 662677689 661002426 660341339 660974197
3787.1 660974197 661162415 661409836 661589890 661600189 661538467 662924118 663085861 663314896 665692215 662615967
3796.7 662615967 658952637 660278549 663255005 668903198 664096222 654376373 658493195 660945816
3804.4 660945816 664116821 669976959 665278702 659801941 662454910 664136505 664050980 664309845 664347839
3813.1 664347839 664871826 668840332 667713852 656199036 659945526 664746933 667822418 671166763
3820.8 671166763 660333633 659617081 663578644 665026855 666917725 667224579 664042969 663842010 664948654
3829.5 664948654 666977615 668072433 661588898 663283920 668647156 663677444 663204956 670245056
$$ packed form
3769.7F61480865p098007J298142L564605J5107L48739l29132o1035j21612L038558
3778.4F62136230J598588o343079P03888J364899J097717K119446j675263o61087O32858
3787.1F60974197J88218K47421J80054J0299o1722J385651J61743K29035K377319l076248
3796.7F62615967l663330J325912K976456N648193m806976r719849M116822K452621
3804.4F60945816L171005N860138m698257n476761K652969J681595q5525K58865L7994
3813.1F64347839N23987L968506j126480j1514816L746490M801407L075485L344345
3820.8F71166763j0833130p16552L961563J448211J890870L06854l181610k00959J106644
3829.5F64948654K028961J094818o483535J695022N363236m969712m72488P040100
$$ plain form
3837.2 670245056 665139008 660610199 666445465 663037415 662207565 668014145 667392044 665282211 666864166
3845.9 666864166 667064667 666569977 666967621 665333862 666625137 672264099 668750229 670883255 661442108
3854.6 661442108 658500061 666984634 666746902 664240341 665459900 666867218 669496155 666232529
3862.3 666232529 665585632 670199585 666052628 661475067 664388580 668115387 673277664 670371094
3870 670371094 661023712 662475204 667772293 671734238 664574814 663913422 667472916 667778549 669025116
3878.7 669025116 672181931 669025955 663070679 667138672 668389969 668969269 672947693 662621078
3886.4 662621078 662730713 665803680 665604782 669729919 671093216 664171677 664049530 666619720 665047836
3895.1 665047836 665603561 666488724 667854004 670088654 662556763 666325531 669410477 663980560 667732925
$$ packed form
3837.2F70245056n106048m528809N835266l408050q29850N806580o22101k109833J581955
3845.9F66864166K00501m94690L97644j633759J291275N638962l513870K133026r441147
3854.6F61442108k942047Q484573k37732k506561J219559J407318K628937l263626
3862.3F66232529o46897M613953m146957m577561K913513L726807N162277k906570
3870F70371094r347382J451492N297089L961945p159424o61392L559494L05633J246567
3878.7F69025116L156815l155976n955276M067993J251297N79300L978424j0326615
3886.4F62621078J09635L072967j98898M125137J363297o921539j22147K570190j571884
3895.1F65047836N55725Q85163J365280K234650p531891L768768L084946n429917L752365
$$ plain form
3903.8 667732925 666965179 665453339 665989609 666147156 667232971 667007751 667074356 666726074 666762009 666783447
3913.4 666783447 666328964 667468262 669460297 667232742 664430313 668119583 669044571 665760040 666655579
3922.1 666655579 667291107 667493973 666955948 664935684 665173187 665749817 666661530 666601791 665895615 667782898
3931.7 667782898 666937561 665504303 666608505 666260300 666209488 666488190 666491623 666488266 665849457 666995773
3941.4 666995773 668110504 665079880 663725739 664336090 665142212 666479187 665172272 665742264 666771240
3950.1 666771240 664722061 665440903 665954742 665649567 665548096 665775528 666555939 665727463 665711594 665561905
3959.7 665561905 665786438 666031036 664437485 664572220 665699234 666284103 665597763 664952011 665261841
3968.4 665261841 664754639 664363937 665175400 666250000 666409683 665979919 665165176 664967575 665603180
$$ packed form
3903.8F67732925p67746j511840N36270J57547J085815k25220O6605l48282L5935K1438
3913.4F66783447m54483J139298J992035k227555k802429L689270R24988l284531Q95539
3922.1F66655579O35528K02866n38025k020264K37503N76630R11713n9739p06176J887283
3931.7F67782898q45337j433258J104202l48205n0812K78702L433l357o38809J146316
3941.4F66995773J114731l030624j354141O10351Q06122J336975j306915N69992J028976
3950.1F66771240k049179P18842N13839l05175j01471K27432P80411q28476j5869j49689
3959.7F65561905K24533K44598j593551J34735J127014N84869o86340o45752L09830
3968.4F65261841n07202l90702Q11463J074600J59683m29764q14743j97601O35605
$$ plain form
3977.1 665603180 665857697 665588760 665158386 665057678 665025635 665490646 665877838 665873947 665482101 665065765
3986.7 665065765 665334625 665381622 665454712 664905396 664925003 665438766 665366592 666013947 666120300 666189270
3996.3 666189270 666095734 665821152 665974655 665851898
4000.2 665851898
$$ packed form
3977.1F65603180K54517k68937m30374j00708l2043M65011L87192l891l91846m16336
3986.7F65065765K68860M6997P3090n49316J9607N13763p2174O47355J06353O8970
3996.3F66189270r3536k74582J53503j22757
4000.2F65851898
##END=$$ End of the data block
