##TITLE=$$ Begin of the data block
##JCAMP-DX=5.00 $$ ACD/SpecManager v 10.08
##SPECTROMETER/DATA SYSTEM=Varian
##DATE=14 Jan 2013 10:11:38
##DATA TYPE=INFRARED SPECTRUM
##DATA CLASS=XYDATA
##ORIGIN=
##OWNER=
##NPOINTS=3735
##FIRSTX=399.26403809
##LASTX=4000.35498047
##MAXX=4000.35498047
##MINX=399.26403809
##MAXY=74.41224670
##MINY=21.03525734
##XFACTOR=1.0000000000
##YFACTOR=0.000000100000000
##FIRSTY=42.27726364
##DELTAX=0.96440572
##XUNITS=1/CM
##YUNITS=TRANSMITTANCE
##XYDATA=(X++(Y..Y))
$$ plain form
399.3 422772636 426043320 419955215 402140503 403106194 418399734 415443420 410884361 413246078
407 413246078 414794540 414130898 415374336 415161400 410526733 409994736 408694305 412701340 414879684
415.7 414879684 412746696 418132668 419359550 420509567 421278458 414802742 404585876 402153931
423.4 402153931 411483231 411418037 406776505 406375504 406432037 406968384 406698990 402333069 401770782 405911293
433 405911293 408461189 409720879 405129890 404048576 406990280 407988052 410407829 408008995 404886055
441.7 404886055 403367271 403245811 407585907 410393295 407797127 404583588 405671539 405035057 408786545
450.4 408786545 412624092 409337234 407526932 405141907 404234009 404064102 400597076 399728050 402456436
459.1 402456436 402720261 402339897 400966721 398298416 400440712 402822609 401556892 396630173 391338348
$$ packed form
399.3D22772636L270684o088105j7814712R65691J5293540k956314m559059K361717
407D13246078J548462o63642J243438k12936m634667n31997j300431M007035K178344
415.7D14879684k132988N385972J226882J150017P68891o475716j0216866k431945
423.4D02153931R329300o5194m641532m01001N6533N36347k69394m365921n62287M140511
433D05911293K549896J259690m590989j081314K941704R97772K419777k398834l122940
441.7D04886055j518784j21460M340096K807388k596168l213539J087951o36482L751488
450.4D08786545L837547l286858j810302k385025r07898j69907l467026q69026K728386
459.1D02456436K63825l80364j373176k668305K142296K381897j265717m926719n291825
$$ plain form
467.7 391338348 396208267 401589546 402483864 400758095 392152519 389221649 392398567 394284325 393069420
476.4 393069420 389560776 387638969 390722733 395453682 393333054 389180641 390339890 390777664 390730972
485.1 390730972 390418892 388927574 392568207 393263321 387886124 386207352 387960396 388857460 388009987
493.8 388009987 385762596 383834534 384509735 384366379 382029839 379951248 381155891 387135010 390654411
502.5 390654411 387410965 385230560 385983620 384622917 381712723 380825539 379208260 381031494 383132706
511.1 383132706 382027740 380217552 378602219 379601135 380540924 381339531 379783859 376544228 375791092
519.8 375791092 374650574 372054863 370993423 373219795 373239365 372160301 374907684 375408478 373625565
528.5 373625565 372435074 371050301 369133682 368247948 368660965 369776268 369849968 370521889 372539215
$$ packed form
467.7C91338348M869919N381279Q94318j725769q605576k930870L176918J885758j214905
476.4C93069420l508644j921807L083764M730949k120628m152413J159249M37774m6692
485.1C90730972l12080j491318L640633O95114n377197j678772J753044Q97064q47473
493.8C88009987k247391j928062O75201j43356k336540k078591J204643N979119L519401
502.5C90654411l243446k180405P53060j360703k910194q87184j617279J823234K101212
511.1C83132706j104966j810188j615333R98916R39789P98607j555672l239631p53136
519.8C75791092j140518k595711j061440K226372J9570j079064K747383N00794j782913
528.5C73625565j190491j384773j916619q85734M13017J115303P3700O71921K017326
$$ plain form
537.2 372539215 372684059 372150307 370872536 369970207 370524139 369727173 368536530 368123131 368155785 367116508
546.8 367116508 366479950 366883240 365909882 364420967 363105698 362868881 363153839 362058411 361409111
555.5 361409111 362584648 362794685 362576027 362854767 361186981 360505219 361870689 362770615 362209778
564.2 362209778 359974480 358835526 359791832 360572891 360275955 360724564 360779152 359985886 360916138 361138954
573.8 361138954 359666519 359770317 360404587 359821854 360253029 361061058 360954437 360622444 360314331 360741043
583.5 360741043 360503159 359196968 359386101 359981194 359326286 359212303 359257126 359307480 361357269 362803421
593.1 362803421 362886086 362675018 362920761 362906723 362263336 363186798 363411140 362360229 361545410 361777191
602.8 361777191 362972946 362492065 361959267 361900864 361809196 361089554 359750061 359345169 358340149 357552910
$$ packed form
537.2C72539215J44844n33752j277771r02329N53932p96966j190643m13399L2654j039277
546.8C67116508o36558M03290r73358j488915j315269k36817K84958j095428o49300
555.5C61409111J175537K10037k18658K78740j667786o81762J365470Q99926n60837
564.2C62209778k235298j138954R56306P81059k96936M48609N4588p93266R30252K22816
573.8C61138954j472435J03798O34270n82733M31175Q08029j06621l31993l08113M26712
583.5C60741043k37884j306191J89133N95093o54908j13983M4823N0354K049789J446152
593.1C62803421Q2665k11068K45743j4038o43387R23462K24342j050911q14819K31781
602.8C61777191J195755m80881n32798n8403r1668p19642j339493m04892j005020p87239
$$ plain form
612.4 357552910 357372360 357974281 357999916 356121941 356103668 357185707 357019806 356400871 356997948 358038139
622 358038139 358397293 358463211 358111496 359380646 361317558 362615433 363970833 364804001 365654449 367204323
631.7 367204323 369228172 370139503 369825935 371056290 373743935 375329361 376298866 377490044 378205566
640.4 378205566 378745499 379589691 381272583 383063240 384049606 385780334 387887611 389346275 390533981
649 390533981 390845566 391139145 391780777 391614952 391351280 392594299 394057922 393435402 391771622 391107407
658.7 391107407 390942535 390458832 391409721 392093010 390770340 389641418 389980736 392629128 399635353
667.4 399635353 410772820 402367516 397141762 395329819 394639206 395635567 397280006 397865410 398707504
676.1 398707504 399709473 400832634 402004166 403770790 405466919 406347160 407005157 407423935 408396187
$$ packed form
612.4C57552910j80550O01921K5635j877975j8273J082039j65901o18935N97077J040191
622C58038139L59154O5918l51715J269150J936912J297875J355400Q33168Q50448J549874
631.7C67204323K023849R11331l13568J230355K687645J585426R69505J191178P15522
640.4C78205566N39933Q44192J682892J790657R86366J730728K107277J458664J187706
649C90533981L11585K93579O41632j65825k63672J243019J463623o22520j663780o64215
658.7C91107407j64872m83703R50889O83289j322670j128922L39318K648392P006225
667.4C99635353J1137467q405304n225754j811943o90613R96361J644439N85404Q42094
676.1C98707504J001969J123161J171532J766624J696129Q80241O57997M18778R72252
$$ plain form
684.7 408396187 409405022 410411034 411561127 412176895 412726631 413371162 413975449 415013962 416241074
693.4 416241074 416431961 416205902 416575966 417643623 418188095 417872658 417866783 418041306 418347855 418591919
703.1 418591919 420004311 421432915 421748772 422725029 423065567 423269348 424070015 425268021 426134720
711.7 426134720 425677414 425287437 426035271 428256607 429255409 429112968 429964828 431252556 432252197
720.4 432252197 432546768 433405304 433566704 433423500 433496628 433440208 434872971 436335869 437864380 439581871
730.1 439581871 440728683 441807632 442614555 442855949 443791809 445034294 444075279 443172531 443035088
738.7 443035088 443698540 445345230 446467400 447336540 447193031 447490463 448005180 448053322 448279190 449088554
748.4 449088554 451020546 451704483 452250137 453413849 454441109 455065804 454866638 455659218 457131577
$$ packed form
684.7D08396187J008835J006012J150093O15768N49736O44531O04287J038513J227112
693.4D16241074J90887k26059L70064J067657N44472l15437n875J74523L06549K44064
703.1D18591919J412392J428604L15857R76257L40538K03781Q00667J198006Q66699
711.7D26134720m57306l89977P47834K221336R98802j42441Q51860J287728R99641
720.4D32252197K94571Q58536J61400j43204P3128n6420J432763J462898J528511J717491
730.1D39581871J146812J078949Q06923K41394R35860J242485r59015r02748j37443
738.7D43035088O63452J646690J122170Q69140j43509K97432N14717M8142K25868Q09364
748.4D49088554J931992O83937N45654J163712J027260O24695j99166P92580J472359
$$ plain form
757.1 457131577 457994347 458476334 459907074 460858040 461456566 462927361 463663177 464888611 466376534
765.7 466376534 467458344 468043480 467912369 467730942 467703133 467581711 467416382 468538704 469582443
774.4 469582443 469691734 469097595 469100533 469471245 468437958 468392487 469203987 470079079 470364799 470409813
784.1 470409813 471288681 472166595 472916451 472776794 473282356 473748817 473631706 473751488 473822784 473933258
793.7 473933258 473698502 474065170 473042107 471790619 471291504 471156502 471517296 470342979 469063301
802.4 469063301 466504211 464323273 463608284 462676010 461550674 459382515 458501015 457620735 456337128
811.1 456337128 455397224 453631020 451717949 450057297 448695564 447242775 447445183 447325096 446028557
819.7 446028557 446127472 446761208 447822075 448970184 450582275 452650414 454887924 457047958 459378090
$$ packed form
757.1D57131577Q62770M81987J430740R50966N98526J470795P35816J225434J487923
765.7D66376534J081810N85136j31111j81427k7809j21422j65329J122322J043739
774.4D69582443J09291n94139K938L70712j033287m5471Q11500Q75092K85720M5014
784.1D70409813Q78868Q77914P49856j39657N05562M66461j17111J19782P1296J10474
793.7D73933258k34756L66668j023063j251488m99115j35002L60794j174317j279678
802.4D69063301k559090k180938p14989r32274j125336k168159q81500q80280j283607
811.1D56337128r39904j766204j913071j660652j361733j452789K02408j20087j296539
819.7D46028557R8915O33736J060867J148109J612091K068139K237510K160034K330132
$$ plain form
828.4 459378090 462713127 466141739 469599724 472255630 475820808 479267006 481241455 483194427
836.1 483194427 484481926 486356354 488157959 490805588 492828712 493960381 495879059 497309418
843.9 497309418 499459534 500544853 501556473 502886353 504360428 506310959 507457123 509033203
851.6 509033203 510535469 512605171 513455582 513897667 515612373 517611732 519597168 520824890 522546120
860.3 522546120 523017235 523598824 524097099 524167519 525113640 525054970 524881325 524169846 523487358 521253548
869.9 521253548 519126854 518438530 517615051 517592087 515590363 513749657 512452469 511125984 510366592
878.6 510366592 509198914 508586006 507263145 506002617 504547386 504196892 504678802 504345741 504210396
887.3 504210396 503236237 502692947 502195091 502072334 502323990 502629814 503636360 504470901 505795135
$$ packed form
828.4D59378090L335037L428612L457985K655906L565178L446198J974449J952972
836.1D83194427J287499J874428J801605K647629K023124J131669J918678J430359
843.9D97309418K150116J085319J011620J329880J474075J950531J146164J576080
851.6E09033203J502266K069702Q50411M42085J714706J999359J985436J227722J721230
860.3E22546120M71115N81589M98275P0420R46121n8670j73645p11479o82488k233810
869.9E21253548k126694o88324q23479k2964k001724j840706j297188j326485p59392
878.6E10366592j167678o12908j322861j260528j455231l50494M81910l33061j35345
887.3E04210396r74159n43290m97856j22757K51656L05824J006546Q34541J324234
$$ plain form
895.9 505795135 506217308 506346169 506689911 507420197 508386421 508003654 507470703 507387505 508336601 510337257
905.6 510337257 513443184 515758133 517624474 519818344 520632172 521751633 521603165 520420570 519029236
914.3 519029236 518453369 518296471 515540161 513471680 512223015 510099716 507358398 504280357 500968208
922.9 500968208 497668762 494630051 491086540 488344955 485837250 482855797 479865150 477254829
930.7 477254829 474773979 471901474 469696388 468036957 466245651 464241867 463576050 463094177 461972885
939.3 461972885 461395874 460082550 459097290 458256607 457378769 456529579 455134964 454131622 453443375
948 453443375 453796272 453863602 453523903 453430099 453237839 453232460 452127380 450449257 448396721 446485367
957.7 446485367 444928741 443130531 441037407 438762665 437031860 435091476 433316765 431440010
$$ packed form
895.9E05795135M22173J28861L43742P30286R66224l82767n32951q3198R49096K000656
905.6E10337257L105927K314949J866341K193870Q13828J119461j48468j182595j391334
914.3E19029236n75867j56898k756310k068481j248665k123299k741318l078041l312149
922.9E00968208l299446l038711l543511k741585k507705k981453k990647k610321
930.7D77254829k480850k872505k205086j659431j791306k003784o65817m81873j121292
939.3D61972885n77011j313324r85260q40683q77838q49190j394615j003342o88247
948D53443375L52897O7330l39699r3804j92260n379j105080j678123k052536j911354
957.7D46485367j556626j798210k093124k274742j730805j940384j774711j876755
$$ plain form
965.4 431440010 429327774 427243423 424808159 423090706 421181717 418774872 416801186 414707718
973.1 414707718 411339874 407464867 404244232 400711479 396813889 392773933 388717422 384598732
980.8 384598732 380031204 375338364 370680122 365676193 360594826 355808754 351140747 346645813
988.5 346645813 342236938 337893944 333893013 330272484 326845284 324167442 321220856 317362614
996.2 317362614 313433208 309731083 306471329 302937737 299817295 297437267 295338936 292938080
1004 292938080 290643406 288628426 286440468 285026703 282709923 280952377 279606819 277732563 276568890
1012.6 276568890 274806366 273910122 272030792 269526348 267480259 264901009 262836933 260203953
1020.3 260203953 257964573 255646610 254078255 252950001 251098614 249447861 248034554 246749878
$$ packed form
965.4D31440010k112236k084351k435264j717453j908989k406845j973686k093468
973.1D14707718l367844l875007l220635l532753l897590m039956m056511m118690
980.8C84598732m567528m692840m658242n003929n081367m786072m668007m494934
988.5C46645813m408875m342994m000931l620529l427200k677842k946586l858242
996.2C17362614l929406l702125l259754l533592l120442k380028k098331k400856
1004B92938080k294674k014980k187958j413765k316780j757546j345558j874256j163673
1012.6B76568890j762524q96244j879330k504444k046089k579250k064076k632980
1020.3B60203953k239380k317963j568355j128254j851387j650753j413307j284676
$$ plain form
1028.1 246749878 244468899 243661957 242724171 242186546 242665443 241433868 240328979 239360962 240375767
1036.7 240375767 241681900 243209305 244756775 244852562 245965767 247045364 248519821 248815441 249016056
1045.4 249016056 249272995 248593102 248562584 247523403 246862106 246260929 245860519 245362930 245173397 245191574
1055.1 245191574 244265823 244331303 244100552 244614525 244518738 244651985 246122208 247465534 249275074
1063.7 249275074 250329704 252462902 254175053 256013508 257100410 256962471 258488483 259132767 259088173
1072.4 259088173 258757477 259765339 260744362 260852089 261426563 262184086 264170132 264814358 265284595
1081.1 265284595 265689087 267175026 269349575 269513073 270179138 271119080 273665409 276160564 277535286
1089.8 277535286 278747730 279965706 281452217 282132816 284183216 285869999 287005005 288358784
$$ packed form
1028.1B46749878k280979q06942r37786n37625M78897j231575j104889r68017J014805
1036.7B40375767J306133J527405J547470R5787J113205J079597J474457K95620K00615
1045.4B49016056K56939o79893l0518j039181o61297o01177m00410m97589j89533J8177
1055.1B45191574r25751O5480k30751N13973r5787J33247J470223J343326J809540
1063.7B49275074J054630K133198J712151J838455J086902j37939J526012O44284m4594
1072.4B59088173l30696J007862R79023J07727N74474P57523J986046O44226M70237
1081.1B65284595M04492J485939K174549J63498O66065R39942K546329K495155J374722
1089.8B77535286J212444J217976J486511O80599K050400J686783J135006J353779
$$ plain form
1097.5 288358784 289556541 291296368 292693176 294655762 296306324 298078556 299188766 299513054
1105.2 299513054 300969791 302341976 303420506 304668140 306381416 307452087 308281937 308981323 309298000
1113.9 309298000 310267296 311148796 311947613 312316284 312495060 312439003 312119389 311834221 311935272 312527771
1123.5 312527771 312263985 312709961 313897610 314863300 315580025 317000313 319153519 320687981 322796402
1132.2 322796402 324369469 326403503 328610268 330085030 332299805 333987236 336315002 338349228
1139.9 338349228 339428215 341024246 342366562 343605232 344285812 344573631 345129013 345515289 346038551
1148.6 346038551 346616859 346807098 347164230 347511520 347611504 347569771 347057114 346840591 346519470 346013718
1158.3 346013718 345871773 345409698 344672546 343830376 343601952 344033661 345118294 346592484 348223076
$$ packed form
1097.5B88358784J197757J739827J396808J962586J650562J772232J110210L24288
1105.2B99513054J456737J372185J078530J247634J713276J070671Q29850O99386L16677
1113.9C09298000R69296Q81500P98817L68671J78776n6057l19614k85168J01051N92499
1123.5C12527771k63786M45976J187649R65690P16725J420288K153206J534462K108421
1132.2C22796402J573067K034034K206765J474762K214775J687431K327766K034226
1139.9C38349228J078987J596031J342316J238670O80580K87819N55382L86276N23262
1148.6C46038551N78308J90239L57132L47290R9984m1733n12657k16523l21121n05752
1158.3C46013718j41945m62075p37152q42170k28424M31709J084633J474190J630592
$$ plain form
1166.9 348223076 350703659 353249741 355556374 357354088 359022827 361077423 363868103 366834221
1174.6 366834221 369379959 372154999 374528618 377241745 380394020 382791786 384494324 386231308
1182.4 386231308 387736855 388871307 390204544 391168060 391954727 392981682 393578720 393284111 393398781
1191 393398781 393790207 393535919 393023911 391801834 390677452 389850121 388824387 387918129 386914864
1199.7 386914864 385679550 384484406 383671379 382574387 381209831 380046959 378909454 377965546 377297897
1208.4 377297897 377164955 376860619 376303024 376064377 375843849 376098175 376274872 376183167 376106987 375840454
1218 375840454 375514984 375092850 374876099 374637413 374523125 374480553 374214973 373920670 373244553 372487411
1227.7 372487411 371937637 371502533 370781784 369840355 369036102 368132401 367523270 367007446 366576881 366389084
$$ packed form
1166.9C48223076K480583K546082K306633J797714J668739K054596K790680K966118
1174.6C66834221K545738K775040K373619K713127L152275K397766J702538J736984
1182.4C86231308J505547J134452J333237R63516P86667J026955N97038k94609J14670
1191C93398781L91426k54288n12008j222077j124382q27331j025734r06258j003265
1199.7C86914864j235314j195144q13027j096992j364556j162872j137505r43908o67649
1208.4C77297897j32942l04336n57595k38647k20528K54326J76697r1705p6180k66533
1218C75840454l25470m22134k16751k38686j14288m2572k65580k94303o76117p57142
1227.7C72487411n49774m35104p20749r41429q04253r03701o09131n15824m30565j87797
$$ plain form
1237.3 366389084 366345673 366451607 366269531 366010361 365524254 364931641 364367981 363831329 363586693 363323898
1247 363323898 363009758 362442360 361975327 361777573 361611671 361448746 361169853 361051750 360923805 360651016
1256.6 360651016 360306587 360107727 359839058 359675903 360099335 360443611 360379486 360582542 361740952 362519798
1266.3 362519798 362937813 363625259 364100571 364860725 365676727 366517754 367067261 367730331 368883133
1274.9 368883133 369873352 371031342 372508240 373936005 374973259 375997658 376978722 378038635 379234314
1283.6 379234314 380635529 382231827 383547630 385133743 386557121 387916679 389345131 390408363
1291.3 390408363 391002388 391288338 391955757 392621231 393305206 394293594 395165138 395716667 396728249
1300 396728249 397625847 397641182 397764664 397723503 397669487 397627068 397504807 397402611 397276878 397206039 396817322
$$ packed form
1237.3C66389084m3411J05934j82076k59170m86107n92613n63660n36652k44636k62795
1247C63323898l14140n67398m67033j97754j65902j62925k78893j18103j27945k72789
1256.6C60651016l44429j98860k68669j63155M23432L44276o4125K03056J158410P78846
1266.3C62519798M18015O87446M75312P60154Q16002Q41027N49507O63070J152802
1274.9C68883133R90219J157990J476898J427765J037254J024399R81064J059913J195679
1283.6C79234314J401215J596298J315803J586113J423378J359558J428452J063232
1291.3C90408363N94025K85950O67419O65474O83975R88388Q71544N51529J011582
1300C96728249Q97598J5335J23482m1161n4016m2419j22261j02196j25733p0839l88717
$$ plain form
1310.6 396817322 396743088 396658936 396215439 395744019 395364799 395246887 395153542 395374641 395989761 396975670
1320.3 396975670 397815094 398918266 400312271 401081772 401721191 402173309 402658005 402638626 402124748
1328.9 402124748 401890182 401744080 401626549 401448898 401345177 401021767 400794830 400562248 400478287 400605621
1338.6 400605621 400454178 400930481 401031799 401270256 402153969 402988434 403559341 403999329 404645996 404807167
1348.2 404807167 405084076 405160599 405065994 404818687 404070587 403836975 403577042 403387909 403232956 403080940
1357.9 403080940 402652130 402256699 401906967 401081696 401076088 400266876 399625587 399499092 399278183 399263878
1367.5 399263878 398577881 397784805 396729736 395846062 395498543 395714951 396185570 395954285 396185341
1376.2 396185341 395911064 395323296 394558411 394069138 393686066 392573586 391121483 389243279 387869720
$$ packed form
1310.6C96817322p4234q4152m43497m71420l79220j17912r3345K21099O15120R85909
1320.3C96975670Q39424J103172J394005P69501O39419M52118M84696j9379n13878
1328.9D02124748k34566j46102j17531j77651j03721l23410k26937k32582q3961J27334
1338.6D00605621j51443M76303J01318K38457Q83713Q34465N70907M39988O46667J61171
1348.2D04807167K76909P6523r4605k47307p48100k33612k59933j89133j54953j52016
1357.9D03080940m28810l95431l49732q25271n608q09212o41289j26495k20909j4305
1367.5C99263878o85997p93076j055069q83674l47519K16408M70619k31285K31056
1376.2C96185341k74277n87768p64885m89273l83072j112480j452103j878204j373559
$$ plain form
1384.9 387869720 386929932 386209450 385159836 384204865 383208237 381335411 379782028 378197441 376940269
1393.6 376940269 374434814 370624924 368965836 367592964 366141510 363047333 360873985 359696617
1401.3 359696617 357664146 355987320 354628906 352325554 349647522 348277702 346872025 344987183
1409 344987183 343919983 342920647 341999092 340807648 339748688 339349785 338447571 337591324 336951523
1417.7 336951523 336907043 335642662 335572891 336612587 337052116 338444099 338708572 339130783 340094757
1426.3 340094757 340346413 341168289 341773758 343022537 343655968 344747925 346532669 348413620 350619545
1435 350619545 352534180 354756508 355137825 356921959 358431053 359813423 361536674 362649689 364432030
1443.7 364432030 365521927 366913490 368274994 370048294 371094360 371275215 372944794 374164696
$$ packed form
1384.9C87869720r39788p20482j049614r54971r96628j872826j553383j584587j257172
1393.6C76940269k505455l809890j659088j372872j451454l094177k173348j177368
1401.3C59696617k032471j676826j358414k303352k678032j369820j405677j884842
1409C44987183j067200r99336r21555j191444j058960l98903r02214q56247o39801
1417.7C36951523m4480j264381o9771J039696M39529J391983K64473M22211R63974
1426.3C40094757K51656Q21876O05469J248779O33431J091957J784744J880951K205925
1435C50619545J914635K222328L81317J784134J509094J382370J723251J113015J782341
1443.7C64432030J089897J391563J361504J773300J046066J80855J669579J219902
$$ plain form
1451.4 374164696 375399132 376004295 377455864 378981247 379767494 382550011 383184242 385759392 386266022
1460.1 386266022 387554893 388917694 390195847 392666321 393951378 396129951 397963028 400513229
1467.8 400513229 402867775 405446625 408999939 411404572 414704781 417746315 420830765 423718681
1475.5 423718681 426477203 429141846 431758766 434349785 436488495 438932571 440747070 442288017
1483.2 442288017 444118652 445685730 447057800 448150787 449268265 451392937 452492409 451304779
1491 451304779 450958633 450690613 449798660 448869743 448379021 444440994 444225464 443683319 440211983 439433517
1500.6 439433517 438432655 436739731 434928017 434816551 434989624 433174210 430894203 429377861 429913521
1509.3 429913521 428772812 429202385 429578667 428572044 428024750 426933479 426329117 424343452 422052231
$$ packed form
1451.4C74164696J234436O05163J451569J525383P86247K782517O34231K575150N06630
1460.1C86266022J288871J362801J278153K470474J285057K178573J833077K550201
1467.8D00513229K354546K578850L553314K404633L300209L041534L084450K887916
1475.5D23718681K758522K664643K616920K591019K138710K444076J814499J540947
1483.2D42288017J830635J567078J372070J092987J117478K124672J099472j187630
1491D51304779l46146k68020q91953r28917m90722l938027k15530n42145l471336p78466
1500.6D39433517j000862j692924j811714j11466J73073j815414k280007j516342N35660
1509.3D29913521j140709M29573L76282j006623n47294j091271o04362j985665k291221
$$ plain form
1518 422052231 422967148 424311600 424095306 423196793 423305855 423849411 425558891 425154114 425127449 425742111
1527.6 425742111 425844994 426641502 427389565 428296356 429241562 430511475 429976349 431027145 431954193
1536.3 431954193 432528305 434371033 433364143 430221977 431154251 433141136 434390221 435601120 436404648
1545 436404648 435536652 436945381 437306328 438006554 438114395 437128029 437823296 437825737 439012222 438133011
1554.6 438133011 437582512 438906898 440911789 440087013 433886566 433760681 432517776 432662430 431000710
1563.3 431000710 429786720 427661209 425164146 423996849 421793213 421370392 413893929 411089249
1571 411089249 409203072 405593681 402298241 398978920 398217468 387151260 385076180 382096596 377985344
1579.7 377985344 374158745 368723602 365138817 359062462 355188560 350176163 345634270 341374588
$$ packed form
1518D22052231R14917J344452k16294q98513J09062N43556J709480m04777k6665O14662
1527.6D25742111J02883P96508P48063R06791R45206J269913n35126J050796R27048
1536.3D31954193N74112J842728j006890l142166R32274J986885J249085J210899Q03528
1545D36404648q67996J408729L60947P00226J07841r86366O95267K441J186485q79211
1554.6D38133011n50499J324386K004891q24776o200447j25885j242905J44654j661720
1563.3D31000710j213990k125511k497063j167297k203636m22821p476463k804680
1571D11089249j886177l609391l295440l319321p61452j1066208k075080k979584m111252
1579.7C77985344l826599n435143l584785o076355l873902n012397m541893m259682
$$ plain form
1587.4 341374588 336444092 333258743 327787666 324901466 319710350 316388111 312514858 307743855
1595.1 307743855 304746609 299940453 298214550 293420391 290908203 287564487 284459209 282898884
1602.8 282898884 279062939 277862358 274189949 273119392 270354748 269014168 267991886 265059376
1610.5 265059376 265061283 262426758 262517834 260586700 260934143 261233177 256642399 258367615 256980305
1619.2 256980305 258308296 257045956 258197460 259401989 258320770 259356117 258675289 260850086
1626.9 260850086 260120583 261252689 261720467 262775402 264144955 264463539 267346821 267655087 270492725
1635.6 270492725 269467106 272251244 273891811 274676571 276866741 276984730 279926910 280621929 282650146
1644.3 282650146 284753819 285253525 288256531 286874733 289027157 289225521 291826820 293965378 293820934
$$ packed form
1587.4C41374588m930496l185349n471077k886200n191116l322239l873253m771003
1595.1C07743855k997246m806156j725903m794159k512188l343716l105278j560325
1602.8B82898884l835945j200581l672409j070557k764644j340580j022282k932510
1610.5B65059376J907k634525R1076j931134L47443K99034m590778J725216j387310
1619.2B56980305J327991j262340J151504J204529j081219J035347o80828K174797
1626.9B60850086p29503J132106M67778J054935J369553L18584K883282L08266K837638
1635.6B70492725j025619K784138J640567P84760K190170J17989K942180O95019K028217
1644.3B82650146K103673M99706L003006j381798K152424J98364K601299K138558j44444
$$ plain form
1653 293820934 294613552 293460827 296477337 297050571 299040852 299491138 300723686 302481461 303835735
1661.6 303835735 307106228 307338963 310509586 312155418 314672203 317440262 320066757 323983917
1669.4 323983917 324742889 329249649 330975380 334623566 338212738 341512299 345871811 348648758
1677.1 348648758 352864571 355750732 360881004 364382973 368345413 373962631 377332191 383360062
1684.8 383360062 385078468 390645027 395054893 400042992 405536308 410241928 415610962 419866829
1692.5 419866829 424858780 429811630 435732613 440678902 445709152 451389313 457296410 465071754
1700.2 465071754 464717140 470674896 475896149 480659103 484924049 489062958 492512589 495036011
1707.9 495036011 499255829 502806587 505554199 508302498 511176949 514650269 516872902 518667221
$$ packed form
1653B93820934P92618j152725L016510N73234J990281M50286J232548J757775J354274
1661.6C03835735L270493K32735L170623J645832K516785K768059K626495L917160
1669.4C23983917P58972M506760J725731L648186L589172L299561M359512K776947
1677.1C48648758M215813K886161N130272L501969L962440N617218L369560O027871
1684.8C83360062J718406N566559M409866M988099N493316M705620N369034M255867
1692.5D19866829M991951M952850N920983M946289N030250N680161N907097P775344
1700.2D65071754l54614N957756N221253M762954M264946M138909L449631K523422
1707.9D95036011M219818L550758K747612K748299K874451L473320K222633J794319
$$ plain form
1715.6 518667221 522199516 525312843 522649574 524272995 527175446 529305000 531287651 532916451
1723.4 532916451 534393959 536152992 537536697 538674011 540570984 542938957 543695450 544073753 547144699
1732 547144699 551235542 553019867 550118713 552227669 555573196 557719688 560681000 562729645 562183838
1740.7 562183838 565553055 568877144 571091995 573453140 576749573 580160255 583552170 587686653
1748.4 587686653 590376587 595117569 597969284 599114723 603802528 607320480 610538750 614290237
1756.2 614290237 616449890 618390694 621376648 624648666 628933372 630247307 630062675 633086319
1763.9 633086319 634915276 636597519 639018974 641658096 641031036 642636337 647216263 649341354
1771.6 649341354 649669876 648134613 651294403 654126434 653668289 655173416 655836105 657504730 659117661
$$ packed form
1715.6E18667221L532295L113327k663269J623421K902451K129554J982651J628800
1723.4E32916451J477508J759033J383705J137314J896973K367973P56493L78303L070946
1732E47144699M090843J784325k901154K108956L345527K146492K961312K048645n45807
1740.7E62183838L369217L324089K214851K361145L296433L410682L391915M134483
1748.4E87686653K689934M740982K851715J145439M687805L517952L218270L751487
1756.2F14290237K159653J940804K985954L272018M284706J313935j84632L023644
1763.9F33086319J828957J682243K421455K639122o27060J605301M579926K125091
1771.6F49341354L28522j535263L159790K832031m58145J505127O62689J668625J612931
$$ plain form
1780.3 659117661 659268951 660428009 662230301 664216919 664597549 665051422 666271439 667519989 668297958
1788.9 668297958 669712067 670881577 672232361 672160034 671004944 673867950 675428238 675720749 676834564
1797.6 676834564 678872528 680259323 679284973 681161880 681540985 682000351 683390274 683899231 684849854
1806.3 684849854 685489273 686361389 687114487 688585510 688587646 689038315 690061722 690251999 691477432
1815 691477432 691757202 692601089 692881241 693363190 694434357 694838028 695891571 695796280 697011337 698479843
1824.6 698479843 697356796 697166748 698666382 700728760 701374512 699240417 699148407 700992126 701279297
1833.3 701279297 701709366 702304764 702942047 703987885 703613586 704635391 704741516 704981155 705673904
1842 705673904 706645050 707592316 704373550 706470413 708225555 708382645 708025589 707885208 709112473
$$ packed form
1780.3F59117661J51290J159058J802292J986618L80630M53873J220017J248550P77969
1788.9F68297958J414109J169510J350784p2327j155090K863006J560288K92511J113815
1797.6F76834564K037964J386795r74350J876907L79105M59366J389923N08957R50623
1806.3F84849854O39419Q72116P53098J471023K136M50669J023407J90277J225433
1815F91477432K79770Q43887K80152M81949J071167M03671J053543r5291J215057J468506
1824.6F98479843j123047j90048J499634K062378O45752k134095r2010J843719K87171
1833.3G01279297M30069N95398O37283J045838l74299J021805J06125K39639O92749
1842G05673904R71146R47266l218766K096863J755142J57090l57056j40381J227265
$$ plain form
1850.7 709112473 709344406 709774170 709606857 709815979 710174255 710433197 711036758 711194458 712145538 712207336
1860.3 712207336 712457581 712373505 712612991 713074417 713040543 713757706 713299484 714172440 714268341 713552551
1869.9 713552551 714388046 715216141 716037445 715889130 716248856 716093445 716163940 716106720 715885162 716270676
1879.6 716270676 716138000 716812286 716895676 717324829 717647247 717801666 718384171 718172302 718717880 718657303
1889.2 718657303 717533493 717251740 718158188 718675613 719142609 719799271 719516068 720355377 720288849 720119171
1898.9 720119171 719917221 719698792 719992599 719667664 720042648 719984512 720656662 721199188 721541901 721982193
1908.5 721982193 721809387 721904984 721298828 721836166 721338043 721041870 721418610 721426544 722847748 721717987
1918.2 721717987 721066132 721764526 722586136 723602600 722764664 721871338 721738968 722156677 722012634
$$ packed form
1850.7G09112473K31933M29764j67313K09122L58276K58942O03561J57700R51080O1798
1860.3G12207336K50245q4076K39486M61426l3874P17163m58222Q72956R5901p15790
1869.9G13552551Q35495Q28095Q21304j48315L59726j55411P0495n7220k21558L85514
1879.6G16270676j32676O74286Q3390M29153L22418J54419N82505k11869N45578o0577
1889.2G18657303j123810k81753R06448N17425M66996O56662k83203Q39309o6528j69678
1898.9G20119171k01950k18429K93807l24935L74984n8136O72150N42526L42713M40292
1908.5G21982193j72806R5597o06156N37338m98123k96173L76740P934J421204j129761
1918.2G21717987o51855O98394Q21610J016464q37936q93326j32370M17709j44043
$$ plain form
1926.8 722012634 722177277 722275696 722426376 723092957 723268509 723544083 722644424 722527390 722694626 722538147
1936.5 722538147 722538147 722283020 722766647 722841492 724048843 724351883 722760773 722483521 722655182 723358307
1946.1 723358307 723030777 722571259 722383575 722430878 722465210 722459717 722637329 722385864 722236328 721646194
1955.8 721646194 721789551 721822433 721634445 721863785 721774292 721989288 722109604 722443314 721884766 721763992
1965.4 721763992 722172165 721652374 721284180 720995102 721346664 721200790 721584473 722255554 722381821 722461243
1975.1 722461243 722018356 721941147 721306839 721296921 721143265 720542526 720782623 721096725 721598129 721245956
1984.7 721245956 721360321 721696167 721683121 721243896 720477219 720578537 720291595 719825516 719466324 719970169
1994.3 719970169 720521469 720818100 721004028 720313644 720218201 719965668 719856491 719203720 718728561 719069748
$$ packed form
1926.8G22012634J64643R8419J50680O66581J75552K75574q99659j17034J67236j56479
1936.5G22538147%k55127M83627P4845J207351L03040j591110k77252J71661P03125
1946.1G23358307l27530m59518j87684M7303L4332n493J77612k51465j49536n90134
1955.8G21646194J43357L2882j87988K29340q9493K14996J20316L33710n58548j20774
1965.4G21763992M08173n19791l68194k89078L51562j45874L83683O71081J26267P9422
1975.1G22461243m42887p7209o34308r918j53656o00739K40097L14102N01404l52173
1984.7G21245956J14365L35846j3046m39225p66677J01318k86942m66079l59192N03845
1994.3G19970169N51300K96631J85928o90384r5443k52533j09177o52771m75159L41187
$$ plain form
2004 719069748 718826599 719140320 719159317 719231873 718988190 718910599 719062958 718272171 717733002 717185898
2013.6 717185898 717007446 717040863 717601242 717586975 717445984 717867203 717458878 717773437 717585678 716938477
2023.3 716938477 716083679 715555344 715827408 715737534 716040726 715888519 716135101 716135330 715921860 715806808
2032.9 715806808 715277481 715413132 714872131 714716110 714619751 714389801 714379578 714331360 714528351 714164963
2042.6 714164963 714207840 713664780 713515167 713455887 712944336 713090744 712881851 713011627 712746887 712896118
2052.2 712896118 713053894 712753220 712705994 712455673 712509384 711846695 711628265 711526718 711582870 711941681
2061.9 711941681 711956100 712559357 712410355 712085495 711725082 711590881 711316299 710991669 711304550 711110001
2071.5 711110001 711412201 711463013 711583481 711561127 711354065 711583023 711221542 710859222 710127945 709937286
$$ packed form
2004G19069748k43149L13721J8997P2556k43683p7591J52359p90787n39169n47104
2013.6G17185898j78452L3417N60379j4267j40991M21219m08325L14559j87759o47201
2023.3G16938477q54798n28335K72064q9874L03192j52207K46582K29k13470j15052
2032.9G15806808n29327J35651n41001j56021r6359k29950j0223m8218J96991l63388
2042.6G14164963M2877n43060j49613n9280n11551J46408k08893J29776k64740J49231
2052.2G12896118J57776l00674m7226k50321N3711o62689k18430j01547N6152L58811
2061.9G11941681J4419O03257j49002l24860l60413j34201k74582l24630L12881j94549
2071.5G11110001L02200N0812J20468k2354k07062K28958l61481l62320p31277j90659
$$ plain form
2081.1 709937286 709904633 710132294 710399246 710056610 710184021 709886475 709798660 709416733 709338760 708982925
2090.8 708982925 708290787 708911514 709163589 709641800 709529419 709252472 709036865 708513794 708405762 707623291
2100.4 707623291 707451706 707470169 707526703 707331314 707083511 707387848 707536545 707850876 707288361 706964798
2110.1 706964798 706574936 705917740 705777588 705822830 705981827 705594940 705813065 705934372 706209869 706240692
2119.7 706240692 705517197 705194931 705052643 705346756 704917145 704766464 704672241 704743500 705091705 704789658
2129.4 704789658 705448685 705305481 704855042 704634171 704536362 704547119 703949585 704339676 704648514 704880142
2139 704880142 704809952 704809952 705068512 704693756 704590149 704334106 704334946 704264603 704627991 704884567 704581909 704702301
2150.6 704702301 704485321 704427185 704426193 704608994 704147034 703934708 704431458 704314194 704577484 704894791
$$ packed form
2081.1G09937286l2653K27661K66952l42636J27411k97546q7815l81927p7973l55835
2090.8G08982925o92138O20727K52075M78211j12381k76947k15607n23071j08032p82471
2100.4G07623291j71585J8463N6534j95389k47803L04337J48697L14331n62515l23563
2110.1G06964798l89862o57196j40152M5242J58997l86887K18125J21307K75497L0823
2119.7G06240692p23495l22266j42288K94113m29611j50681r4223P1259L48205l02047
2129.4G04789658O59027j43204m50439k20871r7809J0757n97534L90091L08838K31628
2139G04880142p0190%K58560l74756j03607k56043Q40p0343L63388K56576l02658J20392
2150.6G04702301k16980n8136r92J82801m61960k12326M96750j17264K63290L17307
$$ plain form
2160.2 704894791 705450592 705312881 704996033 704784241 704337540 704529572 704124374 704108887 704327621 704632263
2169.9 704632263 704711456 704740753 705256348 705197525 705495529 705053940 704486847 704161911 704209290 704828873
2179.5 704828873 704781036 705229568 705345612 705522308 705590897 705459366 705395279 704940033 705014496 704730988
2189.1 704730988 704975739 705073929 704993134 705455780 705843277 706245728 706099319 706292419 705746384 705200806
2198.8 705200806 705120697 704847946 704863586 704599380 705101395 705687637 706406555 706862183 706975937 706912994
2208.4 706912994 706257095 706167068 705453949 705163116 705275803 705347824 705837784 706097870 706530838 706505127
2218.1 706505127 706566467 706380997 706360703 706207809 705789871 705808868 705507889 706053009 706476212 706929169
2227.7 706929169 707092896 706839676 706888199 706280212 706125946 705644226 705459366 705557251 705632248 706107407
$$ packed form
2160.2G04894791N55801j37711l16848k11792m46701J92032m05198j5487K18734L04642
2169.9G04632263P9193K9297N15595n8823K98004m41589n67093l24936M7379O19583
2179.5G04828873m7837M48532J16044J76696O8589j31531o4087m55246P4463k83508
2189.1G04730988K44751R8190q0795M62646L87497M02451j46409J93100n46035n45578
2198.8G05200806q0109k72751J5640k64206N02015N86242P18918M55628J13754o2943
2208.4G06912994o55899r0027p13119k90833J12687P2021M89960K60086M32968k5711
2218.1G06505127O1340j85470k0294j52894m17938J8997l00979N45120M23203M52957
2227.7G06929169J63727k53220M8523o07987j54266m81720j84860R7885P4997M75159
$$ plain form
2237.4 706107407 706186981 706471634 706338120 706485748 706491852 706419907 706250076 705711746 705763016 705601044
2247 705601044 706231461 706410522 706258545 706552124 706526794 706544647 706215591 706320648 705939789 705622940
2256.7 705622940 705505981 705678024 706242905 706221390 706899872 707001724 707089615 707046432 706527252 706285400
2266.3 706285400 705780945 705973358 706006393 706298904 706521606 706729965 706891403 706549301 706446915 705848923
2275.9 705848923 705746689 704840546 704195557 704470749 704401779 704865570 704709015 704893570 705092087 705434647
2285.6 705434647 705484467 704818649 704923248 704519501 704836197 705313644 705777740 706665115 706872559 707274551
2295.2 707274551 707331238 707253036 706848907 706706619 706931610 707103958 707771225 708271255 709217529 710169296
2304.9 710169296 711094894 711848145 712265320 713243561 713758545 713736420 713539581 714074326 714584198 714044266
$$ packed form
2237.4G06107407P9574K84653j33514J47628O104p1945j69831n38330N1270j61972
2247G05601044O30417J79061j51977K93579k5330J7853l29056J05057l80859l16849
2256.7G05622940j16959J72043N64881k1515O78482J01852Q7891m3183n19180k41852
2266.3G06285400n04455J92413L3035K92511K22702K08359J61438l42102j02386n97992
2275.9G05848923j02234r06143o44989K75192o8970M63791j56555J84555J98517L42560
2285.6G05434647M9820o65818J04599m03747L16696M77447M64096Q87375K07444M01992
2295.2G07274551N6687p8202m04129j42288K24991J72348O67267N00030R46274R51767
2304.9G10169296R25598P53251M17175R78241N14984k2125j96839N34745N09872n39932
$$ plain form
2314.5 714044266 714660721 716149139 717544785 719334488 720553665 721341171 722313232 723332825 724244919
2323.2 724244919 724153214 724099197 724778519 726402130 728508072 729967499 730522690 730132599 730376358
2331.9 730376358 729620209 728666000 728925705 729639664 730715332 730265350 730107422 730839996 732579498
2340.6 732579498 733712692 733550491 732174835 729974899 728712769 724600296 719894257 715577087
2348.3 715577087 715553818 721412888 724698181 726593628 729284515 731858444 735174484 737036438 741576920
2356.9 741576920 743404617 744122467 743236694 742864456 743496552 741087418 738833160 736323929 737037430
2365.6 737037430 734653244 731152191 728752136 725894699 724158096 720436935 717767334 714937592
2373.3 714937592 712264557 709322968 705861511 704080505 701915970 699812775 697699432 696010818
$$ packed form
2314.5G14044266O16455J488418J395646J789703J219177P87506R72061J019593R12094
2323.2G24244919r1705n4017O79322J623611K105942J459427N55191l90091K43759
2331.9G30376358p56149r54209K59705P13959J075668m49982j57928P32574J739502
2340.6G32579498J133194j62201j375656k199936j262130m112473m706039m317170
2348.3G15577087k3269N859070L285293J895447K690887K573929L316040J861954M540482
2356.9G41576920J827697P17850q85773l72238O32096k409134k254258k509231P13501
2365.6G37037430k384186l501053k400055k857437j736603l721161k669601k829742
2373.3G14937592k673035k941589l461457j781006k164535k103195k113343j688614
$$ plain form
2381.1 696010818 694407654 692896042 691860809 690634766 689933777 688909912 687904205 686776276
2388.8 686776276 686046371 685771103 685245590 685370789 685349426 685901642 686110992 685685272 685108871 684293976
2398.4 684293976 684131470 683606949 683045502 682240067 681803665 681730499 681873322 682322693 681997910 681977234
2408.1 681977234 681395645 680993347 680468216 679122162 678627701 678726349 679140778 678766785 678632431 678526840
2417.7 678526840 678264465 678404007 677919693 677390747 676200027 675414734 675207062 675206223 675227585 674508057
2427.3 674508057 674369278 674479752 674439926 673858795 673338089 672811584 671907883 671262131 670660400 670591354
2437 670591354 670264816 670423813 670496521 669907227 669635010 669106598 668860321 667890778 667064133 666914368
2446.6 666914368 666377945 665865631 665611420 665900421 665812073 665545197 664972763 664438553 663960190 663063889
$$ packed form
2381.1F96010818j603164j511612j035233j226043p00989j023865j005707j127929
2388.8F86776276p29905k75268n25513J25199k1363N52216K09350m25720n76401q14895
2398.4F84293976j62506n24521n61447q05435m36402p3166J42823M49371l24783k0676
2408.1F81977234n81589m02298n25131j346054m94461R8648M14429l73993j34354j05591
2417.7F78526840k62375J39542m84314n28946j190720p85293k07672q39K1362p19528
2427.3F74508057j38779J10474l9826n81131n20706n26505r03701o45752o01731o9046
2437F70591354l26538J58997P2708n89294k72217n28412k46277r69543q26645j49765
2446.6F66914368n36423n12314k54211K89001q8348k66876n72434n34210m78363q96301
$$ plain form
2456.3 663063889 662645645 662037201 661645432 661439514 661215286 661110001 661055069 660858078 659962082 659213409
2465.9 659213409 658372879 657760773 657152023 656670837 656944885 657059631 657140274 656693192 656076279 655390778
2475.6 655390778 654620209 653866730 652740021 652104645 651762161 651485596 651428452 651694107 651292953 650472946
2485.2 650472946 650234375 649577484 648801422 648096619 647477417 646791611 646262360 646095963 645809860 645696106
2494.8 645696106 645539932 645169983 644090881 643196869 642593231 641744843 641315002 640928345 640621262
2503.5 640621262 639835777 639228325 639145355 639166679 639086151 638289413 637716789 637228508 636668015 635702858
2513.2 635702858 634864922 634634285 634482307 634487114 633849754 633591080 633286896 632539024 631941528 631150970
2522.8 631150970 630484276 629682693 629664001 629725647 629479523 629073029 628213234 627762527 627386856 627183228
$$ packed form
2456.3F63063889m18244o08444l91769k05918k24228j05285n4932j96991q95996p48673
2465.9F59213409q40530o12106o08750m81186K74048J14746Q0643m47082o16913o85501
2475.6F55390778p70569p53479j126709o35376l42484k76565n7144K65655m01154q20007
2485.2F50472946k38571o56891p76062p04803o19202o85806n29251j66397k86103j13754
2494.8F45696106j56174l69949j079102q94012o03638q48388m29841l86657l07083
2503.5F40621262p85485o07452q2970K1324q0528p96738n72624m88281n60493r65157
2513.2F35702858q37936k30637j51978M807o37360k58674l04184p47872n97496p90558
2522.8F31150970o66694q01583j8692O1646k46124m06494q59795m50707l75671k03628
$$ plain form
2532.5 627183228 626655121 626098099 625424194 624679527 624631424 624505272 624359894 623766632 623289375 622929306
2542.1 622929306 622376366 621623764 620794945 620596695 620032425 619864616 619484711 618821106 618770676 618583870
2551.7 618583870 618484840 617678757 616958771 616240158 615400620 615168800 615057144 615088310 614649773 614237976
2561.4 614237976 613675842 613222885 612915726 612144470 611563148 610960464 610596352 610258293 610159416 610020905
2571 610020905 609576035 609021454 608150635 607946434 607691956 607212524 606576538 605682755 605212555 605063362
2580.7 605063362 605132370 604847870 604390755 603810844 603306236 602833138 602242928 601802330 601059494 600447845
2590.3 600447845 600028839 599810715 599431534 599044838 599021759 598589668 598052635 597583084 596963272 595979652
2600 595979652 595390282 595173988 594611855 594016266 593615685 593348923 592486496 591953812 591639671 590977211
$$ packed form
2532.5F27183228n28107n57022o73905p44667m8103j26152j45378n93262m77257l60069
2542.1F22929306n52940p52602q28819j98250n64270j67809l79905o63605n0430j86806
2551.7F18583870r9030q06083p19986p18613q39538k31820j11656L1166m38537m11797
2561.4F14237976n62134m52957l07159p71256n81322o02684l64112l38059r8877j38511
2571F10020905m44870n54581q70819k04201k54478m79432o35986q93783m70200j49193
2580.7F05063362O9008k84500m57115n79911n04608m73098n90210m40598p42836o11649
2590.3F00447845m19006k18124l79181l86696k3079m32091n37033m69551o19812r83620
2600E95979652n89370k16294n62133n95589m00581k66762q62427n32684l14141o62460
$$ plain form
2609.6 590977211 590067406 588927994 588733635 588438377 588030586 587733803 587396088 587193069 586404724
2618.3 586404724 585841751 585311165 584717407 584020729 583380356 582722778 582104149 582181740 581515808 580700417
2627.9 580700417 580179977 579820862 579356880 578393860 578143883 577832375 577331657 576608391 575959091 575844193
2637.6 575844193 575131264 574247704 573974609 573881454 573031197 572064552 571508827 571177483 570646095 569928131
2647.2 569928131 569594650 569020653 568884506 568661652 567875290 567320480 566803589 566242943 565525551 565257950
2656.9 565257950 564721146 564180031 564107399 563709564 563258705 562607994 562209549 561904259 561546669 561044464
2666.5 561044464 560292549 559851265 559713974 559449577 558814087 558742485 558385429 557976761 557885170 557185059
2676.1 557185059 556755829 556061783 555789032 555887566 555237961 554634895 554458694 554380684 553720016 553109245
$$ packed form
2609.6E90977211r09805j139412j94359k95258m07791k96783l37715k03019p88345
2618.3E86404724n62973n30586n93758o96678o40373o57578o18629P7591o65932q15391
2627.9E80700417n20440l59115m63982r63020k49977l11508n00718p23266o49300j14898
2637.6E75844193p12929q83560k73095r3155q50257r66645n55725l31344n31388p17964
2647.2E69928131l33481n73997j36147k22854p86362n54810n16891n60646p17392k67601
2656.9E65257950n36804n41115p2632l97835m50859o50711l98445l05290l57590n02205
2666.5E61044464p51915m41284j37291k64397o35490p1602l57056m08668r1591p00111
2676.1E57185059m29230o94046k72751R8534o49605o03066j76201p8010o60668o10771
$$ plain form
2685.8 553109245 552542763 552188339 552028770 551490593 551177177 550780563 550385818 550125160 549844818 549550362
2695.4 549550362 549615173 549379921 548373566 547903519 547602501 547201309 546576233 546100044 546079178 545816536
2705.1 545816536 545602798 545534172 545434799 544972839 544546013 543723679 543249130 543459892 542846146 542489891
2714.7 542489891 542109718 541850281 541642113 541279831 541473465 540987663 540619965 540318565 539789810 539302216
2724.4 539302216 538805809 538701019 538339043 538212547 538056679 537718430 537586250 537569046 537311172 536575470
2734 536575470 535981636 535492897 535472908 535149612 534631615 534503212 534270477 534605293 534798203 534461060
2743.7 534461060 533972130 533817253 533825264 533170624 532584343 532510071 532515411 532119102 531709061 531660881 531791077
2754.3 531791077 531358719 530567780 530276375 530190544 530226288 529633141 529193268 529287376 528951874 528612900
$$ packed form
2685.8E53109245n66482l54424j59569n38177l13416l96614l94745k60658k80342k94456
2695.4E49550362O4811k35252j006355m70047l01018m01192o25076m76189k0866k62642
2705.1E45816536k13738o8626r9373m61960m26826q22334m74549K10762o13746l56255
2714.7E42489891l80173k59437k08168l62282J93634m85802l67698l01400n28755m87594
2724.4E39302216m96407j04790l61976j26496j55868l38249j32180j7204k57874p35702
2734E36575470n93834m88739j9989l23296n17997j28403k32735L34816J92910l37143
2743.7E34461060m88930j54877Q011o54640n86281p4272N340l96309m10041m8180J30196
2754.3E31791077m32358p90939k91405q5831L5744n93147m39873R4108l35502l38974
$$ plain form
2763.9 528612900 528320770 528121490 527315826 526653328 526578217 526101761 525869064 525837784 525543900 524981651
2773.5 524981651 524585190 524158745 523721924 523287773 522769127 522611542 522048302 521513710 521191101 520859184
2783.2 520859184 520511627 519882202 519480705 519198036 518891487 518154869 517430420 516642494 515890808 515651703
2792.8 515651703 514994545 514441719 513929176 513509178 513034782 512246361 511761971 511144867 510538902 509756165
2802.5 509756165 509055634 508461571 507904282 507468338 506663055 505928955 505122681 504430695 503612976 502730370
2812.1 502730370 502075005 501257782 500534401 499883156 499437981 498638687 498027611 497364922 496062469
2820.8 496062469 495468979 494928818 494118500 493145027 491897926 490691032 490024605 489949684 489185715
2829.5 489185715 488039436 487173157 486371956 485278587 484165573 483080597 481581535 480456619 479565086
$$ packed form
2763.9E28612900k92130j99280q05664o62498p5111m76456k32697l1280k93884n62249
2773.5E24981651l96461m26445m36821m34151n18646j57585n63240n34592l22609l31917
2783.2E20859184l47557o29425m01497k82669l06549p36618p24449p87926p51686k39105
2792.8E15651703o57158n52826n12543m19998m74396p88421m84390o17104o05965p82737
2802.5E09756165p00531n94063n57289m35944q05283p34100q06274o91986q17719q82606
2812.1E02730370o55365q17223p23381o51245m45175p99294o11076o62689j302453
2820.8D96062469n93490n40161q10318r73473j247101j206894o66427p4921p63969
2829.5D89185715j146279q66279q01201j093369j113014j084976j499062j124916q91533
$$ plain form
2838.2 479565086 478393822 477234726 475864334 473900299 472082253 470465355 468462181 466161880
2845.9 466161880 463886871 462420082 460497818 458241539 456626015 455093651 454105339 453147202 452602348
2854.6 452602348 452395401 452084656 451683884 451206055 451509209 451238098 450456886 450009766 449321556 448453331
2864.2 448453331 447997627 448012581 447554626 446510086 444896927 443806992 443359375 442722282 441861610
2872.9 441861610 440628510 440026588 439446564 438716583 438294296 437732010 436984367 436000099 435125580
2881.6 435125580 434006844 433292198 432791557 432050629 431451797 430491447 429970093 429544106 428459167
2890.2 428459167 427171898 426357574 425704536 424677200 424080200 423337555 422191544 421278648 420647316
2898.9 420647316 419941940 419026985 418116112 417228813 416551552 416037941 415543861 414158669 412907028
$$ packed form
2838.2D79565086j171264j159096j370392j964035j818046j616898k003174k300301
2845.9D66161880k275009j466789j922264k256279j615524j532364r88312r58137n44854
2854.6D52602348k06947l10745m00772m77829L03154k71111p81212m47120o88210q68225
2864.2D48453331m55704J4954m57955j044540j613159j089935m47617o37093q60672
2872.9D41861610j233100o01922n80024p29981m22287n62286p47643r84268q74519
2881.6D35125580j118736p14646n00641p40928n98832r60350n21354m25987j084939
2890.2D28459167j287269q14324o53038j027336n97000p42645j146011r12896o31332
2898.9D20647316p05376r14955r10873q87299o77261n13611m94080j385192j251641
$$ plain form
2907.6 412907028 412620888 411844749 410737572 409492683 408269081 406959496 405860786 404678192 402800217
2916.3 402800217 401187897 399880447 399014511 397656441 396445007 395866623 394647064 394004021 393444557
2925 393444557 392968750 393152924 393242493 393187866 393035889 392896996 392779922 392984581 392932968 392857475 393199501
2935.6 393199501 393971901 394937096 395215034 395798378 396677818 397464561 398572960 399605484 400338860
2944.2 400338860 400818138 401077042 401291008 401764488 402177963 403198204 404231339 404575119 405156670
2952.9 405156670 405460548 405988159 406474800 406622696 406928902 407126999 407874565 408859558 409649010 410487213
2962.6 410487213 411277237 411536636 411826172 412451553 412914581 413599052 414278336 415378189 416675720
2971.2 416675720 417359390 417601624 418070107 419031410 419477043 420045052 421011887 421856346 422428207 422633858
$$ packed form
2907.6D12907028k86140p76139j107177j244889j223602j309585j098710j182594j877975
2916.3D02800217j612320j307450q65936j358070j211434n78384j219559o43043n59464
2925C93444557m75807J84174Q9569n4627j51977j38893j17074K04659n1613p5493L42026
2935.6C93199501P72400R65195K77938N83344Q79440P86743J108399J032524P33376
2944.2D00338860M79278K58904K13966M73480M13475J020241J033135L43780N81551
2952.9D05156670L03878N27611M86641J47896L06206J98097P47566R84993P89452Q38203
2962.6D10487213P90024K59399K89536O25381M63028O84471O79284J099853J297531
2971.2D16675720O83670K42234M68483R61303M45633N68009R66835Q44459N71861K05651
$$ plain form
2980.9 422633858 423026657 423021851 422757378 423016396 423600578 423850327 424002419 424484711 424850502 425529404
2990.5 425529404 426097412 425780945 425146599 424636421 424350586 424608917 424626122 424019966 423807564 423596649
3000.2 423596649 423324051 422750282 422334633 422606659 422007141 420960960 420206757 419766846 419256363
3008.8 419256363 418864670 418790169 417998199 417271767 416595192 415840302 415493164 414950447 414006310 413288841
3018.5 413288841 412809906 411891785 411397285 410741768 409674187 409181252 408594513 407947655 407279015
3027.2 407279015 406445999 405321045 404474030 403876724 402937698 402370796 401801834 401068382 400164604
3035.9 400164604 399208679 398452530 397669373 396934967 396185684 395682335 394961472 393965874 393051300 392287216
3045.5 392287216 391915779 391119652 389703369 388607330 387866554 386857529 386075516 385554771 384924088
$$ packed form
2980.9D22633858L92799m806k64473K59018N84182K49749J52092M82292L65791O78902
2990.5D25529404N68008l16467o34346n10178k85835K58331J7205o06156k12402k10915
3000.2D23596649k72598n73769m15649K72026n99518j046181p54203m39911n10483
3008.8D19256363l91693p4501p91970p26432o76575p54890l47138n42717r44137p17469
3018.5D13288841m78935r18121m94500o55517j067581m92935n86739o46858o68640
3027.2D07279015q33016j124954q47015n97306r39026n66902n68962p33452r03778
3035.9D00164604r55925p56149p83157p34406p49283n03349p20863r95598r14574p64084
3045.5C92287216l71437p96127j416283j096039p40776j009025p82013n20745o30683
$$ plain form
3054.2 384924088 384344063 383644791 382622871 381393127 380823975 380049515 379013557 378647423 378067856
3062.9 378067856 377555885 376791649 375887833 375222206 374233513 373336906 372718086 372303200 371576805 370824814
3072.5 370824814 370081787 369242249 368575478 367891922 367567520 366964645 366024513 365304947 364994011 364732552
3082.1 364732552 363875008 362967873 362048683 361347122 360789070 360257607 359855385 359259224 358676071 357800102
3091.8 357800102 356905098 356256371 355681114 354998894 354262886 353928680 353492889 352732391 351673012
3100.5 351673012 350706711 350089531 349432526 348713112 347988014 347185669 346471138 346344528 345894661 345104790
3110.1 345104790 344574623 343836288 343173103 342293587 341661644 341151047 340169754 339632111 339123116 338304405
3119.8 338304405 337422066 336785812 336222878 335116920 334123230 333440094 332773018 332043266 331205368
$$ packed form
3054.2C84924088n80025o99272j021920j229744n69152p74460j035958l66134n79567
3062.9C78067856n11971p64236r03816o65627r88693q96607o18820m14886p26395p51991
3072.5C70824814p43027q39538o66771o83556l24402o02875r40132p19566l10936k61459
3082.1C64732552q57544r07135r19190p01561n58052n31463m02222n96161n83153q75969
3091.8C57800102q95004o48727n75257o82220p36008l34206m35791p60498j059379
3100.5C51673012r66301o17180o57005p19414p25098q02345p14531j26610m49867p89871
3110.1C45104790n30167p38335o63185q79516o31943n10597r81293n37643n08995q18711
3119.8C38304405q82339o36254n62934j105958r93690o83136o67076p29752q37898
$$ plain form
3128.4 331205368 330452271 329741859 329093399 328497658 327673111 326929054 326108856 325055428 324954948
3137.1 324954948 325021210 323948822 322837029 321921310 320812607 320158386 319946804 319412365 318426323
3145.8 318426323 317339764 316610031 316384621 315916424 315043011 314434624 313829498 313241158 312637157
3154.5 312637157 311326866 310359287 309806576 308765335 307848053 307144051 306705475 306136589 305143929
3163.1 305143929 304458637 303986320 303073883 302017021 301639862 301057816 300079346 299413128 298444748
3171.8 298444748 297644501 297448368 297149258 296552086 295697823 294939117 294678268 293965683 292784481
3180.5 292784481 292021713 291227951 290621090 290012264 288914623 288048763 287771378 287790451 287264423 286172142
3190.1 286172142 285261440 284805908 284128914 283231182 282752056 282358532 281891670 281018257 280313282 279791203
$$ packed form
3128.4C31205368p53097p10412o48460n95741q24547p44057q20198j053428j00480
3137.1C24954948O6262j072388j111793r15719j108703o54221k11582n34439r86042
3145.8C18426323j086559p29733k25410m68197q73413o08387o05126n88340o04001
3154.5C12637157j310291r67579n52711j041241r17282p04002m38576n68886r92660
3163.1C05143929o85292m72317r12437j056862l77159n82046r78470o66218r68380
3171.8B98444748q00247j96133k99110n97172q54263p58706k60849p12585j181202
3180.5B92784481p62768p93762o06861o08826j097641q65860k77385J9073n26028j092281
3190.1B86172142r10702m55532o76994q97732m79126l93524m66862q73413p04975n22079
$$ plain form
3199.8 279791203 278885365 278390942 278081970 277851677 277477169 276804066 276161633 275352249 274644222 274054241
3209.4 274054241 273611717 272942562 272162476 271955853 271560936 270768223 270423164 270094547 269506950 269287815
3219.1 269287815 268710480 267886047 267461395 266972084 266266136 265202942 264598370 264534225 264016705 263277740
3228.7 263277740 262978420 262889252 262531109 261965008 261268826 260974026 260575752 259969482 259504662 258751183
3238.4 258751183 258493996 258099270 257445221 257352333 257048531 256490784 255834980 255071812 254474411 254298420
3248 254298420 253746510 252748451 252615604 252788410 252401142 252017670 251893425 251587582 251194839 250278168
3257.7 250278168 249299030 249238930 249191933 249157028 248906364 248145809 247799530 247740288 247300835 246801796
3267.3 246801796 246677761 245983162 244873390 244284534 244296284 244450493 244249840 243956928 243352070 242777176
$$ packed form
3199.8B79791203r05838m94423l08972k30293l74508o73103o42433q09384p08027n89981
3209.4B74054241m42524o69155p80086k06623l94917p92713l45059l28617n87597k19135
3219.1B69287815n77335q24433m24652m89311p05948j063194o04572o4145n17520p38965
3228.7B63277740k99320q9168l58143n66101o96182k94800l98274o06270m64820p53479
3238.4B58751183k57187l94726o54049r2888l03802n57747o55804p63168n97401j75991
3248B54298420n51910r98059j32847J72806l87268l83472j24245l05843l92743r16671
3257.7B50278168r79138o0100m6997l4905k50664p60555l46279n9242m39453m99039
3267.3B46801796j24035o94599j109772n88856J1750J54209k00653k92912o04858n74894
$$ plain form
3276.9 242777176 242555084 242534103 242293968 241408157 240857525 240623112 240647831 240636845 240008240 239837894
3286.6 239837894 240051003 239778175 239452705 239479389 239206543 238481102 237917061 237737217 237373390 236968098
3296.2 236968098 237119980 236999302 236680851 236350021 235885963 235782185 235820770 235440865 234552212 234281921
3305.9 234281921 234343967 234108410 234029083 233772469 233243618 232769871 232729836 232321815 231700478 231524525
3315.5 231524525 231271782 231063175 230523396 229968033 229533825 229132748 229090347 228679981 228214054 228062744
3325.2 228062744 227693901 227035923 226512184 226069336 225569324 225175705 224459286 223683949 223544426 223572845
3334.8 223572845 223124142 222813988 222628841 222068386 221600952 221411495 221181660 220425415 219804802 219262714
3344.4 219262714 218468609 218334160 218507519 218412323 217772560 217200451 217172432 217248363 217381325 217386799
$$ packed form
3276.9B42777176k22092k0981k40135q85811n50632k34413K4719j0986o28605j70346
3286.6B39837894K13109k72828l25470K6684k72846p25441n64041j79844l63827m05292
3296.2B36968098J51882j20678l18451l30830m64058j03778L8585l79905q88653k70291
3305.9B34281921O2046k35557p9327k56614n28851m73747m0035m08021o21337j75953
3315.5B31524525k52743k08607n39779n55363m34208m01077m2401m10366m65927j51310
3325.2B28062744l68843o57978n23739m42848n00012l93619p16419p75337j39523K8419
3334.8B23572845m48703l10154j85147n60455m67434j89457k29835p56245o20613n42088
3344.4B19262714p94105j34449J73359r5196o39763n72109k8019P5931J32962N474
$$ plain form
3354.1 217386799 217139606 216361237 215664577 215415287 215652657 215836544 215040321 214282608 214087372 214655819
3363.7 214655819 214942589 214471931 214274960 213933201 213807316 213653145 213712177 213817654 213108292 212550011
3373.4 212550011 212397900 212691307 212795334 212516136 212188263 211788940 211571903 211415710 211556988 211534462
3383 211534462 211666965 211798191 211499653 211545868 211217804 210834770 210855160 211072044 211351109 211108780
3392.7 211108780 210827904 210881004 211338768 211774330 211505547 210889015 210576477 210556755 210454769 210352573
3402.3 210352573 210373268 210715771 211280880 211511574 211487732 211479454 211159039 210755367 210729027 211001492
3412 211001492 211692505 212016945 211838608 211990166 212164497 212115555 212275276 212667198 212370720 212191315
3421.6 212191315 212784672 212931767 212925091 213329716 214062405 214658966 214981232 215336590 215858974 216383076
$$ packed form
3354.1B17386799k47193p78369o96660k49290K37370J83887p96223p57713j95236N68447
3363.7B14655819K86770m70658j96971l41759j25885j54171N9032J05477p09362n58281
3373.4B12550011j52111K93407J04027k79198l27873l99323k17037j56193J41278k2526
3383B11534462J32503J31226k98538M6215l28064l83034K0390K16884K79065k42329
3392.7B11108780k80876N3100M57764M35562k68783o16532l12538j9722j01986j02196
3402.3B10352573K0695L42503N65109K30694k3842q278l20415m03672k6340K72465
3412B11001492O91013L24440j78337J51558J74331m8942J59721L91922k96478j79405
3421.6B12191315N93357J47095o676M04625P32689N96561L22266L55358N22384N24102
$$ plain form
3431.2 216383076 216128159 216043396 216711159 216894722 216788082 217048302 217514915 218281441 218821430 218653851
3440.9 218653851 218555775 218469887 218647003 219540157 220561085 221168404 221331329 222000790 222491131 222366390
3450.5 222366390 222521191 223141117 224096317 224738464 224998093 225231228 225843906 226577473 227455292 228684597
3460.2 228684597 229018192 229196301 229675426 229826565 230356388 231225014 231864223 232222595 232952309 233908100
3469.8 233908100 235012016 236054630 236697979 237229252 237506580 238310966 239391632 239877377 240230770
3478.5 240230770 240876961 241579914 242142563 242793427 243277245 244154282 245265923 246236477 247033787
3487.2 247033787 247510948 248392906 249012470 249928341 251282597 251959953 252537766 253121490 254071198
3495.8 254071198 255101986 255782757 256547222 257348366 258187771 259171753 260293884 261044788 261561050
$$ packed form
3431.2B16383076k54917q4763O67763J83563j06640K60220M66613P66526N39989j67579
3440.9B18653851r8076q5888J77116Q93154J020928O07319J62925O69461M90341j24741
3450.5B22366390J54801O19926R55200O42147K59629K33135O12678P33567Q77819J229305
3460.2B28684597L33595J78109M79125J51139N29823Q68626O39209L58372P29714R55791
3469.8B33908100J103916J042614O43349N31273K77328Q04386J080666M85745L53393
3478.5B40230770O46191P02953N62649O50864M83818Q77037J111641R70554P97310
3487.2B47033787M77161Q81958O19564R15871J354256O77356N77813N83724R49708
3495.8B54071198J030788O80771P64465Q01144Q39405R83982J122131P50904N16262
$$ plain form
3504.5 261561050 262535343 263874836 264697495 265723228 267046623 267497349 268241711 268862076 269777985
3513.2 269777985 271059952 271863289 273202076 274417496 275276585 276327667 277600155 278750057 279787903
3521.9 279787903 280797329 281537361 282787838 284106007 285234356 285967445 286940002 288242607 289211197
3530.6 289211197 290369053 291385937 292578697 293609276 295090790 296663284 297445660 298858681
3538.3 298858681 300119019 301375847 302799931 304792900 306395855 307314949 308551178 308624992 309646492
3547 309646492 311115303 313276672 315346947 316604996 318824348 319567242 320577660 321843300 323647652
3555.6 323647652 326040154 327064095 328951836 330868759 332675514 333568459 334918518 336789894
3563.4 336789894 338422737 342708664 344326706 344634972 345808868 346059303 349017525 350824013 352543755
$$ packed form
3504.5B61561050R74293J339493Q22659J025733J323395M50726P44362O20365R15909
3513.2B69777985J281967Q03337J338787J215420Q59089J051082J272488J149902J037846
3521.9B79787903J009426P40032J250477J318169J128349P33089R72557J302605R68590
3530.6B89211197J157856J016884J192760J030579J481514J572494P82376J413021
3538.3B98858681J260338J256828J424084J992969J602955R19094J236229P3814J021500
3547C09646492J468811K161369K070275J258049K219352P42894J010418J265640J804352
3555.6C23647652K392502J023941J887741J916923J806755Q92945J350059J871376
3563.4C36789894J632843M285927J618042L08266J173896K50435K958222J806488J719742
$$ plain form
3572 352543755 354983215 357272530 358486786 359637337 362064400 363384743 365449791 367690773 369584465
3580.7 369584465 371740456 374177933 376676254 378209076 381869659 384645615 385154762 386992836
3588.4 386992836 386446152 388414688 391705971 395151405 397698555 399554138 402863998 403031616 404609070
3597.1 404609070 408298721 410725288 413963547 415135384 416005478 418744736 420962906 423624535
3604.8 423624535 427282372 430626907 431384087 434498100 435631256 435724487 442236977 445333099 445135078
3613.5 445135078 448758049 448922272 452763939 458004951 460119133 462369423 462835426 464654770 468668747
3622.2 468668747 472352638 475424881 479171867 481836014 484201775 491126022 495510635 489166527
3629.9 489166527 491152191 495852356 502163620 505134659 503807793 506310387 510737305 514237900
$$ packed form
3572C52543755K439460K289315J214256J150551K427063J320343K065048K240982J893692
3580.7C69584465K155991K437477K498321J532822L660583K775956N09147J838074
3588.4C86992836n46684J968536L291283L445434K547150J855583L309860J67618J577454
3597.1D04609070L689651K426567L238259J171837Q70094K739258K218170K661629
3604.8D23624535L657837L344535P57180L114013J133156R3231O512490L096122j98021
3613.5D45135078L622971J64223L841667N241012K114182K250290M66003J819344M013977
3622.2D68668747L683891L072243L746986K664147K365761O924247M384613o344108
3629.9D89166527J985664M700165O311264K971039j326866K502594M426918L500595
$$ plain form
3637.6 514237900 515881805 517850380 520573196 523590050 526398506 528463516 531441498 535491829
3645.3 535491829 541630554 544233551 543322563 548971863 551804161 551289444 549920311 554019432 559150200
3654 559150200 563642159 569591141 564785500 565834084 571419296 573670464 575803032 577331543 580768967
3662.7 580768967 583111115 585085678 587346573 588181725 593204079 597068787 597881470 599874763 594525414
3671.4 594525414 596258049 603971977 613571815 618280067 604844360 603937416 609956894 614587097
3679.1 614587097 613363571 613612366 616246872 618479118 620350952 620918694 621267166 625598183 633743134
3687.8 633743134 628447800 623760071 631361122 627846680 626541252 631276016 632681198 634510193
3695.5 634510193 635283279 635231781 636441689 636798782 638867950 641818848 638300819 636129723 640591660
$$ packed form
3637.6E14237900J643905J968575K722816L016854K808456K065010K977982M050331
3645.3E35491829O138725K602997r10988N649300K832298n14717j369133M099121N130768
3654E59150200M491959N948982m805641J048584N585212K251168K132568J528511L437424
3662.7E80768967K342148J974563K260895Q35152N022354L864708Q12683J993293n349349
3671.4E94525414J732635P713928R599838M708252j3435707r06944O019478M630203
3679.1F14587097j223526K48795K634506K232246J871834N67742L48472M331017Q144951
3687.8F33743134n295334m687729P601051l514442j305428M734764J405182J828995
3695.5F34510193P73086n1498J209908L57093K069168K950898l518029k171096M461937
$$ plain form
3704.1 640591660 642866211 642801437 643197784 646098251 650618744 644524612 646951370 652402496 641007233
3712.8 641007233 643467789 647664185 648150101 648532867 650897064 653426514 650893707 651165390 656898651
3721.5 656898651 656101685 651712112 655626755 657200012 657086792 655352020 654949722 658323593 658962631
3730.2 658962631 663250122 661351929 654823456 662764053 664109726 657206497 656460724 657880630
3737.9 657880630 658185883 660230179 663579407 659674149 662068634 674677658 670775604 650860596
3745.6 650860596 657527771 663010178 669315109 668062515 657127914 667707596 666927872 657251740
3753.3 657251740 660701294 664603271 668498688 663612289 664357376 670412598 664440536 661132050
3761 661132050 664591980 666712036 667247620 670757370 669130249 664504166 666850891 671452560 673392487
$$ packed form
3704.1F40591660K274551o4774L96347K900467M520493o094132K426758N451126j1395263
3712.8F41007233K460556M196396M85916L82766K364197K529450k532807K71683N733261
3721.5F56898651p96966m389573L914643J573257j13220j734772m02298L373871O39038
3730.2F58962631M287491j898193o528473P940597J345673o903229p45773J419906
3737.9F57880630L05253K044296L349228l905258K394485J2609024l902054j9915008
3745.6F50860596O667175N482407O304931j252594j0934601J0579682p79724r676132
3753.3F57251740L449554L901977L895417m886399P45087O055222n972062l308486
3761F61132050L459930K120056N35584L509750j627121m626083K346725M601669J939927
$$ plain form
3769.7 673392487 664482651 664694824 668172836 668823776 669769440 669212265 669843903 670297470 673295898
3778.4 673295898 674456940 666645279 667746201 669895630 670836411 673165970 671355209 669951248
3786.1 669951248 670657349 671573563 672488174 672063065 671611938 671397705 671724396 671960220 673174667
3794.8 673174667 676821136 674813232 670382614 672155151 676255646 682672806 678504333 667194519
3802.5 667194519 669041672 671290588 676396332 682686005 674937592 669583740 673061066 674622650
3810.2 674622650 674450302 674812088 674879761 675851898 680864105 681040115 668570328 670971222 676047897
3818.9 676047897 681626205 685625458 670641327 670537338 675032578 676424866 678404617 678758545
3826.6 678758545 675030212 674136658 675767365 679252472 682044754 674635468 675451813 682336273 677686691
$$ packed form
3769.7F73392487q909836K12173L478012O50940R45664n57175O31638M53567K998428
3778.4F73295898J161042p811661J100922K149429R40781K329559j810761j403961
3786.1F69951248P06101R16214R14611m25109m51127k14233L26691K35824J214447
3794.8F73174667L646469k007904m430618J772537M100495O417160m168473j1309814
3802.5F67194519J847153K248916N105744O289673p748413n353852L477326J561584
3810.2F74622650j72348L61786O7673R72137N012207J76010j2469787K400894N076675
3818.9F76047897N578308L999253j4984131j03989M495240J392288J979751L53928
3826.6F78758545l728333q93554J630707L485107K792282p409286Q16345O884460m649582
$$ plain form
3835.3 677686691 676268463 683908463 678405380 673441238 680836487 677137299 674152374 680336838
3843 680336838 680031586 675860062 677219086 677463837 676529617 677709961 677489777 680066986 685772858
3851.7 685772858 682303543 686209793 671953125 668863754 677700348 676892776 675370560 676884918
3859.4 676884918 678495560 681235962 677022934 677105637 684362183 681464310 674040756 676332626 681348953
3868.1 681348953 688242111 683931122 672216263 673987961 679694443 683889389 674776611 673841019
3875.8 673841019 677552948 677085266 679452667 684316635 680451889 673144150 677480164 679112244
3883.5 679112244 679807053 684397278 673618088 673662033 677422714 677812805 682051468 683210373 676298218
3892.2 676298218 675317459 677742004 676874390 677950821 679050980 680067902 682711792 675418930 678445816
$$ packed form
3835.3F77686691j418228P640000n503083m964142P395249l699188k984925O184464
3843F80336838l05252m171524J359024K44751r34220J180344k20184K577209N705872
3851.7F85772858l469315L906250j4256668l089371Q836594q07572j522216J514358
3859.4F76884918J610642K740402m213028Q2703P256546k897873p423554K291870N016327
3868.1F81348953O893158m310989j1714859J771698N706482M194946r112778r35592
3875.8F73841019L711929m67682K367401M863968l864746p307739M336014J632080
3883.5F79112244O94809M590225j0779190M3945L760681L90091M238663J158905o912155
3892.2F76298218r80759K424545q67614J076431J100159J016922K643890p292862L026886
$$ plain form
3900.9 678445816 680540085 675466995 679999542 678277206 676468735 676613007 676939392 678826294 678216095
3909.6 678216095 677826920 677289581 677333374 677844467 677729187 678774567 680503159 677690659 674308395
3918.2 674308395 678551865 679459610 675360641 676843719 678437424 678843231 677440491 674686050 675757904
3926.9 675757904 677717056 678151093 676910172 677073593 679319458 677900009 676674805 678119278 677704239
3935.6 677704239 677048187 676805191 676291122 676217575 675587540 676771317 679162369 676712494 675404282
3944.3 675404282 676551743 676770248 677506104 676464767 676959610 677407379 675068130 675790558 675963745
3953 675963745 675736160 676548920 676824036 676497269 675253754 675526581 675431366 675997543 677036209 675899200
3962.6 675899200 675973282 676102524 675773010 675921631 675913239 676065369 675995026 675938873 676057434 675567551
$$ packed form
3900.9F78445816K094269n073090M532547j722336j808471J44272L26385J886902o10199
3909.6F78216095l89175n37339M3793N11093j15280J045380J728592k812500l382264
3918.2F74308395M243470R07745m098969J483078J593705M05807j402740k754441J071854
3926.9F75757904J959152M34037j240921J63421K245865j419449j225204J444473m15039
3935.6F77704239o56052k42996n14069p3547o30035J183777K391052k449875j308212
3944.3F75404282J147461K18505P35856j041337M94843M47769k339249P22428J73187
3953F75963745k27585Q12760K75116l26767j243515K72827r5215N66177J038666j137009
3962.6F75899200P4082J29242l29514J48621q392J52130p0343n6153J18561m89883
$$ plain form
3972.2 675567551 674772644 675031281 675641022 675876694 676150742 676294327 675696259 675293961 675898056 675779572
3981.9 675779572 675125809 675018311 675498657 675779800 676096954 676807861 677001266 677179947 676796570 676444626
3991.5 676444626 675984344 675501328 676044464 675730057 675635223 676344604 676753159 676302567 675483627
4000.2 675483627
$$ packed form
3972.2F75567551p94907K58637O09741K35672K74048J43585n98068m02298O04095j18484
3981.9F75779572o53763j07498M80346K81143L17154P10907J93405J78681l83377l51944
3991.5F76444626m60282m83016N43136l14407r4834P09381M08555m50592q18940
4000.2F75483627
##END=$$ End of the data block
