##TITLE=$$ Begin of the data block
##JCAMP-DX=5.00 $$ ACD/SpecManager v 10.08
##SPECTROMETER/DATA SYSTEM=Varian
##DATE=14 Jan 2013 10:11:32
##DATA TYPE=INFRARED SPECTRUM
##DATA CLASS=XYDATA
##ORIGIN=
##OWNER=
##NPOINTS=3735
##FIRSTX=399.26403809
##LASTX=4000.35498047
##MAXX=4000.35498047
##MINX=399.26403809
##MAXY=74.66613007
##MINY=21.20167923
##XFACTOR=1.0000000000
##YFACTOR=0.000000100000000
##FIRSTY=40.86589050
##DELTAX=0.96440572
##XUNITS=1/CM
##YUNITS=TRANSMITTANCE
##XYDATA=(X++(Y..Y))
399.3D08658905q014717p716332j148262M128647R315453K915115P013893k677726
407D12474976r422188l553162J963806P459221L798485l632431m665222L662758R16862
415.7D09003105J304169K111549l772964J3261451m027442n190812k396278o327896
423.4D03964882l124848N653763L747864o416588J914673K468071l283119k581139
431.1D02343559j345558j663856J04255N554962q64410P98454j829872m264564O323928
439.8D05156898K753182o40259l891258m388123n74569J889381K687798j697808N076981
448.4D06372223J229744l816452L244018Q15277l661232n285911j412582K295684K829972
457.1D02610741M42428n927696j712761K308922J963844M70925N89256q25615j421318
$$ y = [408658905, 400644188, 392927856, 391779594, 395908241, 405223694, 408138809, 415152702, 412474976, 403052788, 399499626, 401463432, 408922653, 412721138, 409088707, 404423485, 408086243, 409003105, 410307274, 412418823, 408645859, 421907310, 417879868, 412689056, 410292778, 403964882, 400840034, 406493797, 410241661, 403825073, 405739746, 408207817, 404924698, 402343559, 400998001, 399334145, 399438400, 404993362, 404128952, 404927406, 403097534, 398832970, 405156898, 407910080, 407269821, 403378563, 398990440, 398415871, 400305252, 402993050, 401295242, 406372223, 407601967, 403785515, 407029533, 407844810, 404183578, 398897667, 397485085, 399780769, 402610741, 403053169, 397125473, 395412712, 397721634, 399685478, 400156403, 400745659, 399920044, 398498726]
465.8C98498726K134895j377411m587936o65131q90884J588135N050087j760712m199410
474.5C93790359l387565j350594j61018J439590k97470j594696K59667k988816Q82035
483.2C86591492L543625m0055j393776m879799j689224J789360L676911J584053p16172
491.8C88466415j065750l361091J904792K834397q6670K0790l264809m885368j535378
500.5C79027328K517243R66263p66182L17726K497749K520829k683678n050545j542816
509.2C77803917K471619j302872l141708J012077J375618j246453j351814R05571j965866
517.9C74560089q34732J402092m95872o53840j068382l28750k60354J148949J775322
526.6C75244522j46294p49969j034851Q58765j398697l932267n00907J610107M75922
$$ y = [398498726, 400633621, 399256210, 394668274, 394003143, 393112259, 394700394, 399750481, 397989769, 393790359, 390402794, 389052200, 388891182, 390330772, 390033302, 388438606, 388698273, 385709457, 386591492, 390135117, 390095062, 388701286, 383821487, 382132263, 383921623, 387598534, 389182587, 388466415, 387400665, 384039574, 385944366, 388778763, 388692093, 388712883, 385448074, 380562706, 379027328, 381544571, 382510834, 381744652, 382062378, 384560127, 387080956, 384397278, 379346733, 377803917, 380275536, 378972664, 375830956, 376843033, 378218651, 376972198, 375620384, 376525955, 374560089, 373725357, 375127449, 374631577, 373977737, 372909355, 372580605, 372320251, 373469200, 375244522, 375098228, 374348259, 373313408, 374172173, 372773476, 368841209, 368340302, 369950409, 370426331]
535.2C70426331J62773m31710n10482L87802j568642j588097M92249O28929q82072
543.9C67117081j714630m85077J62391J389618N36881l72277n94329j398354n60989
552.6C64080315j239510o27632J52969m0474j41372k37809q3694j168404q85772o08788
562.3C59199829J271591J447563j618156j571541J22452J440620l90777m35448K085533
570.9C61551666J195565o55251j431885j363258o37169J56250p0686K21405N47065
579.6C59513702J247101O91223j419143j021881p46003J62812R31282O37016l5858
588.3C59960251l51563J236878O68907P44095J110039m88549j350860n2376J215477
597C62692299m7341K556q49266m11453J511345K78587m27551o35452P7476l12996p50923
$$ y = [370426331, 370589104, 370157394, 369646912, 370034714, 368466072, 366877975, 367370224, 367999153, 367117081, 365402451, 364917374, 365079765, 366469383, 367006264, 366633987, 366039658, 364641304, 364080315, 362840805, 362213173, 362366142, 362325668, 362184296, 361946487, 361862793, 360694389, 359808617, 359199829, 360471420, 361918983, 360300827, 358729286, 358851738, 360292358, 359901581, 359466133, 361551666, 362747231, 362091980, 360660095, 359296837, 358659668, 358815918, 358745232, 358966637, 359513702, 360760803, 361452026, 360032883, 359011002, 358264999, 358427811, 359359093, 359996109, 359960251, 359608688, 360845566, 361514473, 362258568, 363368607, 362880058, 361529198, 361476822, 362692299, 362644958, 362647514, 361798248, 361386795, 362898140, 363176727, 362749176, 362113724, 362191200, 361878204, 361127281]
607.6C61127281m77752r50661k22588j388168j071739M31022l13377p14111j66741
616.3C56253166Q15468P76787M05502n82886j341095P71714K596054O72645M20609
624.9C60787964J262054m57039M54979J796570J969948J288795L00103J305656K048340
633.6C70757370R91096k74505J485290K257157R93461R12781J416550J638565J015587
642.3C81193352J099167N28602J480332K419433J546707K372742J009750M51012P12738
651C92813835r80377j092606l31154J031456Q82988R11446O07567k7428N87731r83315
660.6C93420143j202392l21122K7619p74613r20829J856880M882278R199791n088653
669.3D01079102m145737j301766K52381R48791R82094J059761P20291J490708J648025
$$ y = [361127281, 360649529, 359698868, 359476280, 358088112, 357016373, 357447395, 357134018, 356419907, 356253166, 357068634, 357845421, 358250923, 357668037, 356326942, 357098656, 359694710, 360367355, 360787964, 362050018, 361592979, 362047958, 363844528, 365814476, 367103271, 367403374, 368709030, 370757370, 371748466, 371473961, 372959251, 375216408, 376209869, 377122650, 378539200, 380177765, 381193352, 382292519, 382821121, 384301453, 386720886, 388267593, 390640335, 391650085, 392101097, 392813835, 391833458, 390740852, 390409698, 391441154, 392324142, 393235588, 393843155, 393815727, 394403458, 393420143, 392217751, 391896629, 391924248, 391149635, 390228806, 392085686, 396967964, 406167755, 401079102, 396933365, 395631599, 395883980, 396832771, 397814865, 398874626, 399594917, 401085625, 402733650]
678D02733650J248017J442337n13840O49032J848946J019096J619988Q67844Q68873
686.7D11783943J025543O40641O90078N43518j54457k60162P26357P35931J490517
695.3D17221909Q87374j38053Q2931q01620K3651J319236J619759J063690R36318J047516
705D23262711J6517O58646J360473J003724M2266j13639N02166M28849K25181l08265
714.6D27078629Q55255J596794J716766J739197P98798R94071j09558k04162M23126
723.3D34888916k5177Q9378J78299J633416J958122J029281J180306O91605R56497
732D42580643J394767L1472N5237N72738N7526M24957k14920L48930J511689J116218
741.6D47879257J267739R00077P23381l77273q09059L60603M95796J045647P31392
$$ y = [402733650, 403981667, 405424004, 404910164, 405559196, 407408142, 408427238, 410047226, 410915070, 411783943, 412809486, 413450127, 414140205, 414683723, 414529266, 414269104, 414995461, 415731392, 417221909, 418109283, 417971230, 418054161, 417252541, 417276192, 418595428, 420215187, 421278877, 422215195, 423262711, 423279228, 423937874, 425298347, 426302071, 426344337, 426230698, 426732864, 427161713, 427386894, 427078629, 427933884, 429530678, 431247444, 432986641, 433785439, 434779510, 434669952, 434465790, 434888916, 434863739, 434953117, 435131416, 436764832, 438722954, 439752235, 440932541, 441624146, 442580643, 443975410, 444006882, 444062119, 444634857, 444692383, 445117340, 444902420, 445251350, 446763039, 447879257, 449146996, 450047073, 450770454, 450393181, 449584122, 449944725, 450440521, 451486168, 452217560]
750.3D52217560M3030J428947J957207J33743K35672J819305K093316N26085q00629
759D59654236J129074P66182O10924K570419J547127N35621M54522J283721P89872
767.7D69341698k22092J66283K67296L14140n5123L89939O64749Q70628k10571j148949
777.3D70377998k82478k09885O05469k36359p72895P33719J522254J374131M29764
786D73541718N61828M58183N07660M98772P4387m91333r07135p72286j76010J387444
795.6D74683228j40686o12450R4490j049805q36487j287002r84116j715545k548523
804.3D65603104j447602r98230n52101j016464j517181j825676j664734j137352j585198
813D53858566j621208r31778j441536k022095o16111k57569n22003N28259J212044
$$ y = [452217560, 452260590, 453689537, 455646744, 455780487, 456016159, 457835464, 459928780, 460454865, 459654236, 460783310, 461549492, 462160416, 464730835, 466277962, 466813583, 467268105, 468551826, 469341698, 469119606, 469285889, 469553185, 469867325, 469812202, 470202141, 470866890, 471737518, 471526947, 470377998, 470095520, 469885635, 470491104, 470254745, 469481850, 470215569, 471737823, 473111954, 473541718, 474103546, 474561729, 475069389, 475568161, 475642548, 475151215, 474244080, 473471794, 473295784, 474683228, 474542542, 473930092, 474024582, 472974777, 472138290, 470851288, 469867172, 468151627, 465603104, 464155502, 463157272, 462605171, 461588707, 460071526, 458245850, 456581116, 455443764, 453858566, 452237358, 451305580, 449864044, 447841949, 447225838, 446968269, 446446266, 446974525, 448186569]
821.7D48186569J002274J280250J898766J185493J828080K754898K498932L083801
829.4D63719063K517204K172165L541489L980446K995109L061066J659279M63791K261009
838.1D86370621K572098K636337J884193K015572J762085O65741J901130J848298J620330
846.8E03276405O84357J677208K042885Q61702J762733J144371J621018J029815R80835
855.4E15081329J680069J757508K397804J316337J183434J28136N30739R02137M73213
864.1E25450706R09195k26249r05991j582947m95834j305428j849670o59828r81598
872.8E18352356n98679k019844j960182p13653o77643j011009j219941j131019j007042
881.5E08013344r53217k052726m44756K44636l53775n81169j090927N52559N608l10555
$$ y = [448186569, 449188843, 450469093, 452367859, 453553352, 455381432, 458136330, 460635262, 463719063, 466236267, 468408432, 471949921, 475930367, 478925476, 481986542, 483645821, 484109612, 486370621, 488942719, 491579056, 493463249, 495478821, 497240906, 497906647, 499807777, 501656075, 503276405, 503960762, 505637970, 507680855, 508542557, 510305290, 511449661, 513070679, 514100494, 515081329, 516761398, 518518906, 520916710, 522233047, 523416481, 523544617, 524075356, 524977493, 525450706, 526359901, 526133652, 525227661, 523644714, 523148880, 521843452, 519993782, 519333954, 518352356, 517753677, 515733833, 513773651, 513059998, 512382355, 511371346, 510151405, 509020386, 508013344, 507060127, 505007401, 504562645, 504807281, 504453506, 503872337, 502781410, 503333969, 503339577, 503029022]
891.1E03029022l45001j07384J147156Q50983R07020N33982J161575M24919j87569
899.8E07414703L97835j66931K75078K43034J193047K145500K680664K651443J748925
908.5E18583298J094360K90070Q53424M20150K94571j41143j169129j721496k190590
917.2E16313515j611328k219277k437095k833939l028565k951660k923011k503167
924.9D95805473l738441l893013k863121k398606l209228l666840k675323j749306
932.6D71611595j675606k395515j920013q62961k42310j132278j682892p12738o34690
941.3D60352592p54623o23360j51519j786232k337647l05290l74718q0032L65829J86730
950.9D54491730o05927j315651q20503p46422r72023j954765j868248j695595k015076
$$ y = [503029022, 502684021, 502576637, 503723793, 504574776, 505481796, 506015778, 507177353, 507602272, 507414703, 507812538, 507645607, 507920685, 508163719, 509356766, 511502266, 514182930, 516834373, 518583298, 519677658, 519967728, 520821152, 521241302, 521535873, 521394730, 520225601, 518504105, 516313515, 514702187, 512482910, 510045815, 507211876, 504183311, 501231651, 498308640, 495805473, 492067032, 488174019, 485310898, 482912292, 479703064, 476036224, 473360901, 471611595, 469935989, 467540474, 465620461, 464757500, 464515190, 463382912, 461700020, 460987282, 460352592, 459597969, 458974609, 458823090, 457036858, 454699211, 454393921, 454019203, 453939171, 454305000, 454491730, 453885803, 452570152, 451749649, 451003227, 450031204, 448076439, 446208191, 444512596, 442497520]
959.6D42497520j791763k153587k009583j837120k014503j863289j378479k079735
967.3D27369461k545433j710205k045746k659073k610969k338944k805176l088340
975D07565575l152848l790931l922081m082604l975792m119682m819832m969177n108109
983.7C69624519n648117m955101l996124m153557m542579m737740m591637l982353
991.4C33017311k907486l683243l716736k760620l269081l421650l474598l108253
999.1C06675644l544979l193054k468300k879448k679901k246743j812820k149200
1006.8B85701199j382103j515179j743794j227874j731015j714572k283440j244679
1014.6B72858543j038150j971302k415924k688351j814156k372932k333927k136002
$$ y = [442497520, 440705757, 438552170, 436542587, 434705467, 432690964, 430827675, 429449196, 427369461, 424824028, 423113823, 421068077, 418409004, 415798035, 413459091, 410653915, 407565575, 404412727, 400621796, 396699715, 392617111, 388641319, 384521637, 379701805, 374732628, 369624519, 363976402, 359021301, 355025177, 350871620, 346329041, 341591301, 336999664, 333017311, 330109825, 326426582, 322709846, 319949226, 316680145, 313258495, 309783897, 306675644, 303130665, 299937611, 297469311, 294589863, 291909962, 289663219, 287850399, 285701199, 284319096, 282803917, 281060123, 279832249, 278101234, 276386662, 274103222, 272858543, 271820393, 269849091, 267433167, 264744816, 262930660, 260557728, 258223801, 256087799]
1022.3B56087799k236977k276878j425609j176320j970348r32236j616287r67503m19311
1031B43066330j069946j099186q77247Q7871p0133J292229K24991K51369J951561J069031
1040.6B44826870P75566O18935J850528J060582O05125O0940j317043m80996l43513
1049.3B47656994j5335o15788m99210j315231j117592L10745k73056o7349p96451Q3599
1058.9B43351326j55506N81970K171478J295815J644401J630078K111034R84516J284294
1067.6B54899406J652852O96678R39846K28615N40046N6973P01465Q35667L53870Q05645
1077.2B61711063J203652J361675m53701M32053P07855J316337J684876O60248J670360
1085.9B70294418J328717K129707J777763J460266J549664J240883J503506J051101
$$ y = [256087799, 253850822, 251573944, 250148335, 248972015, 247001667, 246069431, 244453144, 243485641, 243066330, 241996384, 240897198, 240019951, 240107822, 240037689, 241329918, 241554909, 241806278, 243757839, 244826870, 245602436, 246221371, 248071899, 249132481, 249737606, 249798546, 248481503, 248000507, 247656994, 247641659, 247025871, 246526661, 245211430, 244093838, 244404583, 244131527, 244064178, 243267727, 243351326, 243195820, 243777790, 245949268, 247245083, 248889484, 250519562, 252630596, 253615112, 254899406, 256552258, 257248936, 258188782, 258417397, 258957443, 259014416, 259715881, 260551548, 260905418, 261711063, 262914715, 264276390, 263822689, 264254742, 264962597, 266278934, 267963810, 268624058, 270294418, 271623135, 273752842, 275530605, 276990871, 278540535, 279781418, 281284924, 282336025]
1093.6B82336025K454758K152061J780854J432495N21335N80178J252327K277584J636200
1102.3B96423817K205448J457538Q71811J224270R36852R62543J32771J437969J513081
1111C07166100R08775N78003O61430J303806n9299R89227R91803l17307j23138J36623
1120.6C12236023J81293k68993J68114k55947K57167Q07095J158752J971646J449928
1129.3C17705078J517754J331024J983375K331734J541138J429138K218590K803001
1137C32860832J730881J521835K231674J725846N67093N91964J189766J343727Q16002
1145.7C44579620L33939N41763M22211P85255M97399P4920Q240L6888O48880p019l57017
1156.3C47565079r27735p64656K4948p69920o72111p62024j45874J007385J217422
$$ y = [282336025, 284790783, 286942844, 288723698, 290156193, 290677528, 291257706, 292510033, 294787617, 296423817, 298629265, 300086803, 300958614, 302182884, 303119736, 304082279, 304215050, 305653019, 307166100, 308074875, 308652878, 309314308, 310618114, 310558815, 311548042, 312539845, 312222538, 312099400, 312236023, 312417316, 312148323, 312316437, 312060490, 312317657, 313124752, 314283504, 316255150, 317705078, 319222832, 320553856, 322537231, 324868965, 326410103, 327839241, 330057831, 332860832, 334591713, 336113548, 338345222, 340071068, 340638161, 341230125, 342419891, 343763618, 344579620, 344913559, 345455322, 345877533, 346662788, 347160187, 347235107, 347243347, 347280235, 347929115, 347922096, 347565079, 346637344, 345872688, 345897636, 345127716, 344455605, 343693581, 343547707, 344555092, 345772514]
1165C45772514J079674J219902K423935K674217K168846J765595K800255K679481J675453
1173.7C64259872K712136L198509K778702J912422K073288K653427K419853J788101
1181.4C83796310J466561J794662J454315J107941R68819R22622Q86879Q26989P24792
1190.1C93949890J94702n03463p21665m08592o10390p49245q89892j288414j219940
1198.8C87752991j020966r29260j123543p79571o86570j358566j107521j249237j265793
1207.4C78231964m73900k99988m38995m73480n3177K1400J40725N9852k73132j31683
1217.1C76309586l91350l10364k19383j95160r270j84173n9815l39050q14629o01311
1226.7C73185081m91561o68488m31786k89039p52144j025124r05342q20465p43370
$$ y = [345772514, 346852188, 348072090, 350496025, 353170242, 355339088, 357104683, 359904938, 362584419, 364259872, 366972008, 370170517, 372949219, 374861641, 376934929, 379588356, 382008209, 383796310, 385262871, 387057533, 388511848, 389619789, 390588608, 391511230, 392398109, 393225098, 393949890, 394144592, 393641129, 392919464, 392510872, 391900482, 391151237, 390261345, 388972931, 387752991, 386732025, 385802765, 384679222, 383899651, 383213081, 381854515, 380746994, 379497757, 378231964, 377758064, 377458076, 377019081, 376545601, 376492424, 376513824, 376654549, 376714401, 376441269, 376309586, 375918236, 375607872, 375388489, 375193329, 375184059, 374999886, 374940071, 374601021, 373786392, 373185081, 372693520, 372025032, 371593246, 371304207, 370552063, 369526939, 368621597, 367801132, 367057762]
1235.4C67057762o4087P3395l03764j46218k16026k89040n07927o87255n41687j08529
1245C64266624j83944o63491l53050l80554m68330n64232k38762L18794q6861k13356
1254.7C61432838l32183k92664k87285l72696r8304R9563J28441J54877N50193K86980
1264.3C61269760N53055R58481P02400P11632M62570N69229N83267O31066Q85276Q77305
1274C68204041J020431J451416J427345J056328J022644P90978J137352J085090R47304
1282.7C78142929J290321J322899J821709J693306J519508J473313J045189J083335
1290.4C89392509J146012Q05321O26716M75311M51775R88693R95446O78443N23491
1299C96083717N84221P52373O45752K77672J33476M3831m14391L8681j95465k94380
$$ y = [367057762, 366993675, 367067070, 366763306, 366617088, 366401062, 366112022, 365604095, 364916840, 364375153, 364266624, 364082680, 363419189, 363066139, 362685585, 362217255, 361653023, 361414261, 361733055, 361646194, 361432838, 361100655, 360807991, 360520706, 360148010, 360049706, 360149269, 360277710, 360432587, 360982780, 361269760, 361822815, 362781296, 363483696, 364195328, 364657898, 365227127, 365810394, 366441460, 367326736, 368204041, 369224472, 370675888, 372103233, 373159561, 374182205, 374973183, 376110535, 377195625, 378142929, 379433250, 380756149, 382577858, 384271164, 385790672, 387263985, 388309174, 389392509, 390538521, 391343842, 391970558, 392445869, 392897644, 393886337, 394881783, 395560226, 396083717, 396667938, 397420311, 398066063, 398343735, 398477211, 398521042, 398106651, 398145332, 397949867, 397655487]
1308.7C97655487P0725n28222k7084J48544k49061m26293l31153j92071l58695J67655
1318.3C95929832M51546R68971R32312J131745J397056L81470N39398P33414O21529
1327D03087273J54342k80685j87645k77901q7890m44374l64113J47895j9912n06363
1336.7D01220627k97890l8566k10572K91214L94783Q81005P04002K33650O11077O95571
1346.3D04484901O98700J55754M10309j60713o09093M8523l66745k12364j02730m24003
1355.9D03922539l80173Q4915k29263n36919m89616r38149j90239o19201p06635q6250
1365.6C99831009K2812k20909q99468p80182o60400m16832n13954m61426j12076L4638
1375.2C95823212K71759k24190J54762k50320q21343j200828j276551j021232j683693
$$ y = [397655487, 397726212, 397197990, 397170906, 397319450, 397070389, 396644096, 396312943, 396120872, 395762177, 395929832, 396381378, 397350349, 398282661, 399414406, 400811462, 401192932, 401732330, 402465744, 403087273, 403241615, 402960930, 402773285, 402495384, 402407494, 401963120, 401599007, 401746902, 401726990, 401220627, 400922737, 400884171, 400673599, 400964813, 401359596, 402240601, 402944603, 403178253, 403789330, 404484901, 405183601, 405339355, 405749664, 405588951, 404979858, 405028381, 404661636, 404449272, 404346542, 403922539, 403542366, 403627281, 403398018, 402861099, 402371483, 401433334, 401243095, 400623894, 399917259, 399831009, 399853821, 399632912, 398733444, 397953262, 397292862, 396876030, 396362076, 395900650, 395788574, 395823212, 396094971, 395870781, 396025543, 395775223, 394953880, 393753052, 392476501, 391455269, 389771576]
1383.9C89771576p81365l38287q14209j693802j494140j091805k085991j951103j703873
1392.6C77817001j312866j939087l013267k103577j790390j176414k372475k325478
1400.3C61783447j661758j967774j401138j464424k615662k684593j521721j537819
1408C46928558j480903p68814r19037p60956j173439j382523q51669n91087l43781
1416.7C38656349n80864L99933j644783j007881J026420M94118R43184J83067R09958
1425.4C39379501Q96912M13513J316071O79779P49702N90363J670685J810722J606598
1434.1C49113846K387237K095452J924629M7150J781463J443062J261330J930275J194801
1442.7C63179245J479607J146011J530914J283913J753426J133232P92122J587867
$$ y = [389771576, 388990211, 388651924, 387837715, 386143913, 384649773, 383557968, 381471977, 379520874, 377817001, 376504135, 374565048, 371551781, 369448204, 367657814, 366481400, 364108925, 361783447, 360121689, 358153915, 356752777, 355288353, 352672691, 349988098, 348466377, 346928558, 345447655, 344678841, 343759804, 342998848, 341825409, 340442886, 339591217, 339000130, 338656349, 338075485, 338475418, 336830635, 335822754, 336849174, 337343292, 338286476, 338469543, 339379501, 340276413, 340689926, 342005997, 342685776, 343435478, 344025841, 345696526, 347507248, 349113846, 351501083, 353596535, 355521164, 355568314, 357349777, 358792839, 360054169, 361984444, 363179245, 364658852, 365804863, 367335777, 368619690, 370373116, 371506348, 372298470, 373886337]
1450.5C73886337M68331J592712J285477J395988J011582M41818K319679L36342L356285
1459.1C86094551Q22334J418496J479682J209603K502708J448517J717110J494369
1466.8C98187370K825928K546768K472267L396416K693138M187050K355576K952957
1474.6D21617470L164444K919693K459602K168465K299537K236824K529183J874695
1482.3D41269913J926040J682396J495858J923599P71675O37779J973419R75838q56171
1491D51800346l76205j37444r25483p85866l76282m688110k38571m16451l196030p20558
1500.6D39939346j142883j812668j836319J51406R12017j732254m418487r42230J129150
1509.3D30247078q09975M49448k10571j461296l84789p96776m25529j005936j774864
$$ y = [373886337, 374354668, 375947380, 377232857, 378628845, 379640427, 380082245, 382401924, 382738266, 386094551, 386916885, 388335381, 389815063, 391024666, 393527374, 394975891, 396693001, 398187370, 401013298, 403560066, 406032333, 409428749, 412121887, 416308937, 418664513, 421617470, 424781914, 427701607, 430161209, 432329674, 434629211, 436866035, 439395218, 441269913, 443195953, 444878349, 446374207, 448297806, 449069481, 449707260, 451680679, 452656517, 451800346, 451424141, 451286697, 450361214, 449575348, 449199066, 444510956, 444272385, 443855934, 440659904, 439939346, 438796463, 436983795, 435147476, 435298882, 436210899, 434478645, 430060158, 429117928, 430247078, 429437103, 429886551, 429675980, 428214684, 427829895, 427033119, 426607590, 425601654, 423826790]
1518D23826790J65138J496163k80610k881546J407586J015319J331520J60141J26954
1526.6D26367455N54618N13192L54728K07825R65233J209297J504517p363O98777M53262
1536.3D32821541P23038K053070q80165j278954J293373J455765m77181L98445J224328
1545D37333260n91317J010819M29420R16825K88314p19337O76079N36117J627274j842079
1554.6D39665375n09796J614189J930694m86068p537156J037713r52263k14577j975899
1563.3D32572212j226921k071190k982483j203384j998367l30887o497269l314285
1571D12947426k408486l533477k859459k718430j365967j2427482j555252k912903
1578.7C83165970m353600l896599n056762l866768o543198l609695m725876m164009
$$ y = [423826790, 423991928, 425488091, 425207481, 422325935, 423733521, 424748840, 426080360, 426240501, 426367455, 426922073, 427435265, 427789993, 427997818, 428963051, 430172348, 431676865, 431669502, 432368279, 432821541, 433544579, 435597649, 434717484, 433438530, 434731903, 436187668, 435710487, 436108932, 437333260, 436741943, 437752762, 438182182, 439099007, 439387321, 438667984, 439344063, 439880180, 441507454, 439665375, 439155579, 440769768, 442700462, 442214394, 434677238, 435714951, 434762688, 434548111, 432572212, 431345291, 429274101, 426291618, 425088234, 423089867, 422758980, 416261711, 412947426, 410538940, 407005463, 404146004, 401427574, 400061607, 387634125, 386078873, 383165970, 378812370, 374915771, 369859009, 365992241, 359449043, 355839348, 351113472, 346949463]
1586.4C46949463m240875n114556l261680n833054k776489n197106l556289l541374
1594.1C13428040m637299k825413m874191k228165m696941k366791l247414l160114
1601.9B85391712j791858l771687j363506l609753j062279k983665j218567j071530
1609.6B68518867k832221J40533k598076k5463k106476O32782P60288n007248J285153
1618.2B58768139j338310J349182j299973J240425M75464j575298J385136l38116K721481
1626.9B61388130o83346J302586L73306N58167J442737M52328K802506K72998K762261
1635.6B70671673n08423L371353J661205N58052K259541R7733K498226N74283K338219
1644.3B83521862K347031L41110K211571j344700K702179M71401K702217J488972l572426
$$ y = [346949463, 342708588, 337594032, 334332352, 328499298, 325722809, 320525703, 316969414, 313428040, 308790741, 305965328, 301091137, 298862972, 294166031, 291799240, 288551826, 285391712, 283599854, 279828167, 278464661, 274854908, 273792629, 270808964, 269590397, 268518867, 265686646, 265827179, 263229103, 263203640, 261097164, 261729946, 262490234, 257482986, 258768139, 257429829, 258779011, 257479038, 258719463, 259194927, 257619629, 259004765, 258666649, 261388130, 260704784, 262007370, 262380676, 262938843, 264381580, 264833908, 267636414, 267909412, 270671673, 270163250, 273534603, 275195808, 275753860, 278013401, 278111134, 280609360, 281183643, 283521862, 285868893, 286210003, 288421574, 287076874, 289779053, 290250454, 292952671, 294441643, 290869217]
1653B90869217K844410k06509L335076O97364K056122R15985J634446J797676J192569
1661.6C05136356K750798J18103L279323J742897K618771K780208K605114L478241
1669.4C24509811R48143M827271J900902L632202L249550K727356L887024L126678
1677.1C48808937M878655L202095N124092L486747L951989N585022M604148O623078
1684.8C86264763p3815N723000M689102M443970N029716M522095N314865M706078N370636
1693.5D25990410M856453O104622M936371M615478N866890O267662P490234o57196
1701.2D65470924O028176N257416N052490M034233M001808M086494K606926L837510
1708.9E00375977L313751K924843K781601L037147L435059J746483K254409M022637
$$ y = [290869217, 293713627, 293507118, 296842194, 297539558, 299595680, 300511665, 302146111, 303943787, 305136356, 307887154, 308005257, 311284580, 313027477, 315646248, 318426456, 321031570, 324509811, 325457954, 330285225, 332186127, 335818329, 339067879, 341795235, 345682259, 348808937, 353687592, 356889687, 362013779, 365500526, 369452515, 375037537, 379641685, 386264763, 386190948, 391913948, 396603050, 401047020, 406076736, 410598831, 415913696, 420619774, 425990410, 430846863, 436951485, 441887856, 446503334, 452370224, 458637886, 466128120, 465470924, 471499100, 476756516, 481809006, 485843239, 489845047, 493931541, 496538467, 500375977, 503689728, 506614571, 509396172, 512433319, 515868378, 517614861, 519869270, 523891907]
1716.6E23891907L882980k661362J070023K888565K086754K004700J294746R32426
1724.3E35390739J578980J566582J509666J832581K274627J010247N23986L018074
1732E48705482L598061M48189k294846K899933L393898K245827K969093J403237l51944
1740.7E63016930M021072L727570K217063K052002L378487L899155L339348L558883
1748.4E89210510K505570M629287L340264J632690M175072L225288L690834L953057
1756.2F16362572J609306K087059L056984L077469M206657J276703J9646K861900K159043
1764.8F36717339K148971J988106K563705m882J513748M031906J675873J050949j235810
1773.5F50449905K589493K276993j80969J922378R45511J578522J161880L26615J281662
$$ y = [523891907, 527774887, 525113525, 526183548, 529072113, 531158867, 533163567, 534458313, 535390739, 536969719, 538536301, 540045967, 541878548, 544153175, 545163422, 545687408, 548705482, 552303543, 552751732, 550456886, 553356819, 556750717, 558996544, 561965637, 563368874, 563016930, 567038002, 570765572, 572982635, 575034637, 578413124, 582312279, 585651627, 589210510, 591716080, 596345367, 599685631, 601318321, 605493393, 608718681, 612409515, 616362572, 617971878, 620058937, 623115921, 626193390, 630400047, 631676750, 631696396, 634558296, 636717339, 638866310, 640854416, 643418121, 643413239, 644926987, 648958893, 650634766, 651685715, 650449905, 653039398, 655316391, 655135422, 657057800, 658003311, 659581833, 660743713, 661070328, 662351990]
1782.2F62351990J705093J960907N71747P84683J310578J271057R18579J782074Q79822
1790.9F73536530O44454N4398r60770L077088J534347l8757Q87985J957932J592865
1799.5F82286072p09076K053375M04282K80685J016693L33100J018600M35715P60116
1808.2F87879562J124649K097474j35270P6523J243286K39563R85566J11389R40323
1816.9F94563065K69699P16552J255417l7079J075440J09024J227341J555023j409378
1825.6F99325104j96991J519775J950989J094894j912307n82962K011032O08673K42386
1834.3G04060593M30526N73731J175384m49447O28586L46527N83114N52674J111984
1842.9G09013672J495514l561783J519852J831970L34701l33709o8283J118164M04358
$$ y = [662351990, 664057083, 666017990, 666589737, 667374420, 668684998, 669956055, 670874634, 672656708, 673536530, 674180984, 674235382, 673274612, 676351700, 677886047, 677847290, 678735275, 680693207, 682286072, 681576996, 683630371, 684034653, 684315338, 685332031, 685665131, 686683731, 687119446, 687879562, 689004211, 691101685, 690966415, 691042938, 692286224, 692525787, 693511353, 693622742, 694563065, 694832764, 695549316, 696804733, 696767654, 697843094, 697952118, 699179459, 700734482, 699325104, 699128113, 700647888, 702598877, 703693771, 701781464, 701198502, 703209534, 703818207, 704060593, 704491119, 705064850, 706240234, 705790787, 706419373, 706765900, 707349014, 707901688, 709013672, 710509186, 706947403, 708467255, 710299225, 710633926, 710300217, 710231934, 711350098, 711754456]
1851.6G11754456O11114l18527M25339K32696j14670O93665Q2626R20334K49481N03693
1861.3G15040207J75705q5755O9581K63824R32083n22385Q73642j48849o36292P79496
1870.9G16741257O27746R06296o6910L96500k53754K27280N4321n82657J66626r2544
1880.6G18124161J051712L95660N63507M95911J6708L57666l48129M19617l54920j150818
1890.2G19571075J56784J019211N3406J87149R29794k20718R11636J67466L1814m5547
1899.8G22762070l63617J75705n87845L19214L06015O28433M50363M46320M17099k66114
1909.5G24287643K45972n01556L27682n79452m16565P5378r5978J571656p46079k87628
1919.1G23881073O96945N38025R89456p25250r12628J55411P28378l85056k48947O5460
$$ y = [711754456, 712365570, 712047043, 712472382, 712705078, 712590408, 713284073, 713366699, 714287033, 714536514, 715040207, 715215912, 715130157, 715199738, 715463562, 716395645, 715873260, 716746902, 716598053, 715961761, 716741257, 717369003, 718275299, 718208389, 718604889, 718351135, 718578415, 718632736, 718050079, 718216705, 718124161, 719175873, 719571533, 720135040, 720630951, 720647659, 721005325, 720657196, 721076813, 720721893, 719571075, 719727859, 720747070, 720800476, 720987625, 721917419, 721696701, 722608337, 722775803, 722807617, 722762070, 722398453, 722574158, 721986313, 722305527, 722611542, 723239975, 723690338, 724136658, 724553757, 724287643, 724533615, 724032059, 724359741, 723780289, 723363724, 723439102, 723343124, 724914780, 724168701, 723881073, 724578018, 725116043, 726105499, 725380249, 724467621, 724623032, 725351410, 724966354, 724717407, 724782867]
1928.8G24782867J13221M36248M5929N41230l78724k4642j25580l48587P8964k17743
1938.4G24903183K91367q0338J138458K48184j595230m119M53262M19388p29370l28141
1948.1G24716644J34735J74790J27106l3036J45417p2785p5912n08652J93939r7732
1957.7G24704514l31574K35138J31454J03913l45383J58615l20892j984J73569o65131
1967.3G23842239l94134j08490Q29849R8190P1793K55966O7063Q850n82733J12609
1977G24201202k17590k6016k97775j46409M64173M6387J66320k32696O28891J78985
1986.6G24765472k84729o34689j105194K58255N1956k94723m20227M41970K81678k34223
1996.3G22825546J99051o4697L51715n13763l22495l85132n59768k13395l53698P85827
$$ y = [724782867, 724896088, 725332336, 725378265, 725919495, 725540771, 725516129, 725390549, 725041962, 725120926, 724903183, 725194550, 725114212, 726252670, 726500854, 724905624, 724901505, 725354767, 725774155, 725044785, 724716644, 724851379, 725026169, 725153275, 725120239, 725265656, 725192871, 725116959, 724608307, 724802246, 724704514, 724372940, 724608078, 724739532, 724843445, 724498062, 724656677, 724335785, 724333801, 724507370, 723842239, 723448105, 723339615, 724169464, 724267654, 724339447, 724595413, 724662476, 724671326, 724088593, 724201202, 723983612, 723957596, 723659821, 723513412, 723977585, 724023972, 724190292, 723957596, 724586487, 724765472, 724480743, 723846054, 722740860, 722999115, 723051071, 722756348, 722336121, 722778091, 723059769, 722825546, 723024597, 722959900, 723311615, 722797852, 722475357, 722090225, 721530457, 721317062, 720963364, 721749191]
2005.9G21749191J12534j26496j35498M807M7150p51954m07104n21927n0964n2796
2015.6G19866943L68882L94744J10016K33765m89349k4720o44912n91431m50516q1787
2025.2G18691635J76239p59048J83334L72238L31192m23279l47061n3634l58735L61786
2034.9G18174667o62689k50625j2513j24664J24359J64719K61764o70166M4632m46625
2044.5G16602859m03976j02158l07312K72370k74582Q2016j13831J12458N645k57415
2054.1G15616074j78986l56979J64184o13251n3024R7122K71988M04282l23715K90451
2063.8G15318146j27487j40610n48248l62778j28021j04981L47366j10626M53644j49231
2073.4G14447174l586j03378l66058K18505m14733j70060m49524j57241j88294M02146
$$ y = [721749191, 721861725, 721735229, 721599731, 721604538, 721651688, 720899734, 720492630, 719970703, 719919739, 719866943, 720235825, 720630569, 720740585, 720974350, 720485001, 720460281, 719815369, 719223938, 718773422, 718691635, 718867874, 718108826, 718292160, 718664398, 718995590, 718572311, 718225250, 718171616, 717812881, 718174667, 717511978, 717261353, 717248840, 717124176, 717248535, 717413254, 717675018, 717004852, 717049484, 716602859, 716198883, 716096725, 715789413, 716061783, 715787201, 715869217, 715755386, 715867844, 715873489, 715616074, 715437088, 715080109, 715244293, 714631042, 714578018, 714675140, 714947128, 715351410, 715027695, 715318146, 715190659, 715050049, 714501801, 714139023, 714011002, 713906021, 714253387, 714142761, 714596405, 714447174, 714443588, 714340210, 713974152, 714192657, 713777924, 713607864, 713158340, 713001099, 712812805, 713214951]
2083.1G13214951O85653k45590K7771p45468j00708j09711l64685k11716l91616K02942
2092.7G11961823l12806L80860J23214P8431r4223p56913o7978l79791o1111n63660
2102.4G10307846l04489j78223m34646M91638M33731N17425k55050k88773l58352n94101
2112G09337006n75791l33938N50918j10779J34125o1111k4567J77002l95660l20664
2121.6G08376541m56238K34986j20316j31378k05002K365L92151l38440M32434k6016
2131.3G08161087k29416j32370j45416j06964m44489L01285K8839L33634J83258J13601
2140.9G08063049p248m09393j1444o44379L3188K24610K24304j31150k07366O90231
2150.6G07824402j39084j95160j83945J28251j79139O6758N10330m92707J24512J67236
$$ y = [713214951, 713900604, 713655014, 713682785, 712937317, 712836609, 712726898, 712362213, 712150497, 711758881, 711961823, 711649017, 712029877, 712153091, 712231522, 712137299, 711380386, 711312408, 710932617, 710871506, 710307846, 710003357, 709825134, 709390488, 709882126, 710315857, 710833282, 710578232, 710289459, 709931107, 709337006, 708761215, 708427277, 708978195, 708867416, 709001541, 708940430, 708915863, 709092865, 708697205, 708376541, 707920303, 708155289, 708034973, 707903595, 707698593, 707700958, 708093109, 707754669, 708187103, 708161087, 707931671, 707799301, 707653885, 707546921, 707102432, 707403717, 707432556, 707766190, 707949448, 708063049, 708055801, 707646408, 707634964, 706990585, 707023773, 707248383, 707472687, 707341537, 707134171, 707824402, 707685318, 707490158, 707306213, 707434464, 707255325, 707322083, 707832413, 707339706, 707464218, 707631454]
2160.2G07631454M47541N417k74125j7166m26635K60772l64685o7672L41415J13907
2169.9G07650223k7924J14365M54407k35825K57797l76663k73972K42081k6474J36871
2179.5G07914886n17730M58984P02744M05731J60828k13089k52762n22919j04980l76664
2189.1G07655029J09711J83640J99737K92816J85089N96238j69831k2583k78168o8817
2198.8G08682861j58386n84259L16925N7221L48815K16523L25165K12478R3842M91333
2208.4G10002518m89273m30375m45556j22833O561l5935L40271L68805O82145N1116
2218.1G09927444j2207j20849l0136j55945m81262k61460l30429N88303M24805K88543
2227.7G09836807J09482J95084K00424q10471l06625l47977K05918J13144r4147M56009
$$ y = [707631454, 708078995, 708084412, 707810287, 707793121, 707366486, 707627258, 707262573, 707194901, 707536316, 707650223, 707622299, 707736664, 708191071, 707955246, 708213043, 707836380, 707562408, 707804489, 707778015, 707914886, 707397156, 707856140, 708558884, 708964615, 709125443, 708912354, 708659592, 708136673, 708031693, 707655029, 707764740, 707948380, 708148117, 708440933, 708626022, 709222260, 709052429, 709029846, 708751678, 708682861, 708524475, 707940216, 708257141, 708314362, 708663177, 708879700, 709204865, 709417343, 709511185, 710002518, 709513245, 709082870, 708637314, 708514481, 708521042, 708485107, 708825378, 709194183, 709876328, 709927444, 709915237, 709794388, 709764252, 709608307, 709127045, 708865585, 708535156, 709123459, 709548264, 709836807, 709946289, 710141373, 710341797, 709531326, 709224701, 708876724, 709082642, 709195786, 709101639, 709557648]
2237.4G09557648R0637M7531n05676J69754K8305j02692J6175m32663J02157k03628
2247G08767548M87823K99378J94397J33819l30353K72370k61460j91803m34875J57547
2256.7G09094391R7504k45133K96326k58789P00226L31954J43052O9656n51758k21710
2266.3G09455719m64630J01471o4087J79748J85242J79443L0060l17535L69949n70450
2275.9G09084930l49197m63181l57971O4621j24511N87310n84411l15247L68500M76074
2285.6G08386917n2185q58993J67160K9144L81317J90811M70429J107101J64871K92588
2295.2G10279160J53808K97241k3117J0987M1504l62244M76456L89251P93610J088486
2304.9G13145142J241073R64737J45188Q75930M38233k7848L20282O31333K18201o66123
$$ y = [709557648, 709648285, 709695816, 709190140, 709359894, 709388199, 709285507, 709301682, 708869019, 708971176, 708767548, 709255371, 709554749, 709749146, 709882965, 709552612, 709824982, 709563522, 709371719, 708936844, 709094391, 709191895, 708946762, 709243088, 708984299, 709684525, 710016479, 710159531, 710229187, 709677429, 709455719, 708991089, 709092560, 709028473, 709208221, 709393463, 709572906, 709602966, 709285431, 709655380, 709084930, 708735733, 708272552, 707914581, 707979202, 707854691, 708442001, 707857590, 707542343, 707910843, 708386917, 708334732, 707475739, 707642899, 707672043, 708053360, 708244171, 708714600, 709821701, 709986572, 710279160, 710432968, 710730209, 710707092, 710718079, 710759583, 710397339, 710873795, 711263046, 712056656, 713145142, 714386215, 715350952, 715496140, 716372070, 716810303, 716782455, 717102737, 717734070, 717952271, 717286148]
2314.5G17286148P87430J597290J268539J523819J018677J098862Q77456N99366R32846
2323.2G26990433K0523N68085J681747J783981J046830J18255P57523O28051p43026
2331.9G32852402j222840L30429K80228k1057M97208m85077R31091J888428J222687
2340.6G36273499n37491r03626q78982j362610q75702l797608m736404m608917k2202
2349.2G18549957N851517L660660K771377L176422J881104J795044j32294K732926
2356.9G40286713K551193K653808J064377J05210m04587j719132p51571k237854r96933
2365.6G40551224l255997k923965k787400l231430k196579l867264k179870k798538
2373.3G17310181k413330j970826k770538k207107l097687k454605k087250j557465
$$ y = [717286148, 718073578, 719670868, 720939407, 722463226, 723481903, 724580765, 725458221, 726057587, 726990433, 727010956, 727579041, 729260788, 731044769, 732091599, 732209854, 732967377, 733595428, 732852402, 731629562, 731959991, 732240219, 732219162, 732716370, 732231293, 733162384, 735050812, 736273499, 735736008, 734832382, 733953400, 732590790, 731715088, 727917480, 723181076, 718572159, 718549957, 724401474, 728062134, 730833511, 734009933, 735891037, 737686081, 737553787, 740286713, 742837906, 745491714, 746556091, 746661301, 746256714, 744537582, 743786011, 741548157, 740551224, 737295227, 734371262, 731583862, 728352432, 726155853, 722288589, 720108719, 717310181, 714896851, 712926025, 710155487, 707948380, 704850693, 702396088, 700308838, 698751373]
2381.1F98751373j191253j421738j448212j641540q67539r03473q09707j087113q23135
2389.7F88557663K9678o4087L50113l5019L2196L8758j82343o92520j190872l58734
2399.4F86484833l53928l69797l46450O4926O3476p8506J67236m15344k13318k76794
2409F84726334m37470j109466j205597m16642k5711M85993l38135k22092N5542j43280
2418.7F81369476l67126p52106k58255o47964q69065q92639j29700K52686k40021K2049
2428.3F77487335j61590k3423l89709o69098r73740p06329j71814q11310l57132M9897
2438F73273087K30636l09753l42102k5254o43692n01632j016770r77401p65000j76239
2447.6F68745880M29306j16882k64359l88641J4496m03214o41403p74765r67102m31519
$$ y = [698751373, 697560120, 696138382, 694690170, 693048630, 692181091, 691277618, 690467911, 689380798, 688557663, 688587341, 688523254, 688873367, 688838348, 688870544, 688909302, 688726959, 688034439, 686843567, 686484833, 686130905, 685761108, 685414658, 685479584, 685543060, 685464554, 685631790, 685216446, 685003128, 684726334, 684288864, 683179398, 681973801, 681557159, 681531448, 682017441, 681679306, 681457214, 681512756, 681369476, 681002350, 680250244, 679991989, 679344025, 678474960, 677582321, 677452621, 677705307, 677465286, 677487335, 677325745, 677302322, 676912613, 676243515, 675269775, 674563446, 674391632, 673580322, 673223190, 673273087, 673503723, 673193970, 672851868, 672826614, 672182922, 671681290, 670664520, 669687119, 668922119, 668745880, 669175186, 669058304, 668793945, 668405304, 668419800, 668016586, 667375183, 666600418, 665633316, 665201797]
2457.2F65201797m37088j30538m76151j3123r1095p64236k05917l92151n11322q18939
2466.9F61361237o97251p83920k55737J73263n34134J85395J4343l12882o62765r85489
2476.5F57502060p06787j049576n58319j48697m20761o62079q011k19650n95398n6381
2486.2F53076401p83234q76312o64292n96237m65164m53110m87823n62286j17417j47018
2495.8F47923508j85776p62405p31278l72391p81173q50983q94012k14997l13339m10156
2505.5F42406998k61917n08347k93503n43823m44565o20537q20770p84149n68466l01132
2515.1F37259789j78223J5144m88853k90108l89595l76740m64553j134911o53953n80750
2524.7F32717247m75769l25356q6937j23291m64706m59366m35638k97928r95636n49278
$$ y = [665201797, 664764709, 664634171, 664158020, 664144897, 664053802, 663289566, 663083649, 662691498, 662180176, 661361237, 660663986, 659880066, 659624329, 659797592, 659263458, 659448853, 659463196, 659150314, 658487549, 657502060, 656795273, 655745697, 655187378, 655038681, 654617920, 653955841, 653947830, 653728180, 653132782, 653076401, 652293167, 651416855, 650752563, 650156326, 649691162, 649238052, 648750229, 648187943, 648070526, 647923508, 647737732, 646975327, 646244049, 645871658, 645090485, 644239502, 643345490, 643130493, 642817154, 642406998, 642145081, 641636734, 641343231, 640799408, 640354843, 639734306, 638913536, 638129387, 637560921, 637259789, 637081566, 637096710, 636607857, 636317749, 635928154, 635551414, 635086861, 633951950, 633297997, 632717247, 632241478, 631916122, 631829185, 631705894, 631241188, 630781822, 630346184, 630048256, 629052620, 628503342]
2534.4F28503342k43492n47944l66249m71458k31819o94885l83149k81830l87191o05316
2544F24290009j278763k43759j47057l49655k53220l06740k60009k46926j93023q27675
2553.7F20183182m85878n82123o50711l00255k17056n5199o39839n25703o71654l28903
2563.3F15725861j56594q38508o57959o34575m11148l36609l79563n51414j54953%
2573F11604538n49927k82707n22079o32630o52313m96178m47655m60319j51291n12619
2582.6F06896820n31845n35927p1564m15191p57675j77460n79262n93147m99573l10326
2592.2F02424850o43157m46396p9842n00565j17111n69458o78520o95305o34346m74129
2601.9E97586021p85064k61879k99874l86085n35545l47786l65639q18291j061973
$$ y = [628503342, 628259850, 627711906, 627345657, 626874199, 626642380, 625947495, 625564346, 625282516, 624895325, 624290009, 623011246, 622767487, 622620430, 622270775, 622017555, 621710815, 621450806, 621203880, 621010857, 620183182, 619697304, 619115181, 618464470, 618164215, 617947159, 617891960, 617252121, 616726418, 616054764, 615725861, 615569267, 614730759, 614072800, 613438225, 613027077, 612690468, 612310905, 611759491, 611604538, 611604538, 611054611, 610771904, 610249825, 609617195, 608964882, 608468704, 608021049, 607560730, 607409439, 606896820, 606364975, 605829048, 605757484, 605342293, 604584618, 604407158, 603827896, 603234749, 602735176, 602424850, 601781693, 601335297, 601255455, 600754890, 600637779, 600068321, 599389801, 598694496, 598060150, 597586021, 596800957, 596539078, 596239204, 595853119, 595317574, 594969788, 594604149, 593785858, 592723885]
2610.6E92723885j154175l95928m51545m2649l13072n05600J01929r09081q50334o56013
2620.2E87547417m76189o20918r25217n35889m48951N3100o46095q61130n17654m80423
2629.9E82088051m02756p15675m19426o34918m45633l99018q78372o13327k31781n25589
2639.5E76821556n62286j8883p62672o60325o03637r96170n84565n19752j94511o32363
2649.1E71286392l58925j8692m16069n17349p82204p34596r31587l09143j40267l25355
2658.8E66752205J6861k60201p28302j033935m70925k12173p629l49884n88112k76108
2668.4E62841797o86951m59289o91452m18015j76659l37677j80244n42717l28941o37589
2678.1E58382263k22244J04980m50363n80902m52080J08147l00407k97356m49371q39425
$$ y = [592723885, 591569710, 591173782, 590722237, 590679588, 590366516, 589860916, 589962845, 589053764, 588203430, 587547417, 587071228, 586450310, 585525093, 584989204, 584540253, 584593353, 583947258, 583086128, 582568474, 582088051, 581685295, 580969620, 580550194, 579915276, 579469643, 579070625, 578192253, 577578926, 577347145, 576821556, 576259270, 576240387, 575477715, 574817390, 574213753, 573217583, 572633018, 572113266, 571918755, 571286392, 570927467, 570908775, 570492706, 569975357, 569193153, 568458557, 567526970, 567217827, 567077560, 566752205, 566769066, 566508865, 565780563, 564746628, 564275703, 564063530, 564055901, 563706017, 563117905, 562841797, 562154846, 561695557, 561004105, 560586090, 560409431, 560071754, 559891510, 559348793, 559019852, 558382263, 558160019, 558264999, 557814636, 557233734, 556781654, 556889801, 556589394, 556292038, 555842667, 555003242]
2687.7E55003242p04002p16820j92413k39029k97050l11242j86309q9341k57110m46320
2697.4E51563606o82373k33040o00319o82869j99966j74828m25376m46434p2670m61541
2707E47584190k27546j81771m06341o96335p37114l1548n15174l21312m6158k75955
2716.6E44144936l51220k19497j7624n17426k65808o75201o39496j42860l06435O1569
2726.3E41070938j53808k75193l35617J7662o2599m08096k41394o43997m27971l06168
2735.9E38233757l82538o32515p0953N27572m00772m54063l05557j9417J36375m46167
2745.6E36185722p84607m81872Q1596j71127j05171n5161l64113j75819R7427m09584
2755.2E33817291p38029l01399k37732O6604n17235p19108j4229k20528j88064k70806
$$ y = [555003242, 554299240, 553582420, 553390007, 553150978, 552853928, 552542686, 552356377, 552267036, 552009926, 551563606, 550881233, 550648193, 550047874, 549365005, 549165039, 548990211, 548564835, 548118401, 548045731, 547584190, 547356644, 547174873, 546768532, 546072197, 545335083, 545303535, 544788361, 544467049, 544420891, 544144936, 543793716, 543574219, 543556595, 543039169, 542773361, 542098160, 541458664, 541315804, 541009369, 541070938, 540917130, 540641937, 540306320, 540323982, 540261383, 539853287, 539611893, 538967896, 538539925, 538233757, 537851219, 537218704, 537147751, 537675323, 537274551, 536820488, 536514931, 536495514, 536631889, 536185722, 535401115, 534919243, 535000839, 534829712, 534724541, 534669380, 534305267, 534129448, 534226875, 533817291, 533079262, 532777863, 532540131, 532606735, 532089500, 531370392, 531356163, 531135635, 530947571, 530676765]
2764.9E30676765l08418n82695n32913k58408n68313k94380k13509j82495j19209k64473
2774.5E27351952o24886q58574p87353l76931K21024l23258o35032o85730n72014l03421
2784.2E22405777m90456k55737l21655k29569l94020p04651o74133p13234o79512q29277
2793.8E17113533l36685k37732o62041r23767o53496k26593o33506q85354r68208m85077
2803.4E11101074l46069n76477n72586q72994p21016n89637o06804r18999q33969o79207
2813.1E04383316n70679m63180r96247p30819q02765o88706q18061j191788n50842
2821.8D97570229q17490o19392o34079j045342r66797q85162m81262q75054j025429
2830.4D90220222r50813j226311j272201q85544o99234j153755j394005j396141r33037
$$ y = [530676765, 530368347, 529785652, 529252739, 528994331, 528426018, 528131638, 527918129, 527735634, 527616425, 527351952, 526727066, 525868492, 525081139, 524704208, 524925232, 524601974, 523966942, 523281212, 522709198, 522405777, 521915321, 521659584, 521337929, 521108360, 520714340, 520009689, 519335556, 518622322, 517942810, 517113533, 516776848, 516539116, 515877075, 514953308, 514299812, 514073219, 513439713, 512554359, 511586151, 511101074, 510755005, 510178528, 509605942, 508732948, 508011932, 507422295, 506815491, 505896492, 505062523, 504383316, 503812637, 503349457, 502353210, 501622391, 500819626, 500130920, 499312859, 498121071, 497570229, 496752739, 496133347, 495499268, 494453926, 493487129, 492601967, 492120705, 491245651, 490220222, 489269409, 488043098, 486770897, 485885353, 485186119, 484032364, 482638359, 481242218, 480309181]
2839.1D80309181j020088j345139j669845k063751j885147k046166j905823j948814
2846.8D66424408k131500k297287j965409j212043j597939j276436r20105p92846l51830
2855.5D53879013l58391L7918M01421R8267q32444q96187l21121j81122m33387o42701
2865.2D50751266o89468j371040j232186p30514q45184p69463o30837p94715p41883
2873.8D42945976m22706r36928q11043m72450r35822j077537p37038m46815o89202
2882.5D36416435o06460q13523q17413p00264r61304q91113j127930q15582q61969
2891.2D28820877p99599o31866r12552o52008j110802j005287p64084p62100o64291
2899.9D21518288j012650q64029p06711o06460j071167q35762l39279j003075j102715
$$ y = [480309181, 479289093, 477943954, 476274109, 474210358, 472325211, 470279045, 468373222, 466424408, 464292908, 461995621, 460030212, 458818169, 457220230, 455943794, 455023689, 454230843, 453879013, 453520622, 453558540, 453959961, 454058228, 453225784, 452329597, 452008476, 451827354, 451393967, 450751266, 450061798, 448690758, 447458572, 446728058, 445882874, 445113411, 444482574, 443687859, 442945976, 442523270, 441586342, 440775299, 440302849, 439367027, 438289490, 437552452, 437105637, 436416435, 435809975, 434996452, 434179039, 433478775, 432517471, 431626358, 430498428, 429682846, 428820877, 428021278, 427389412, 426476860, 425824852, 424714050, 423708763, 422944679, 422182579, 421518288, 420505638, 419641609, 418934898, 418328438, 417257271, 416421509, 416082230, 415079155, 413976440]
2908.6D13976440p57331q88176j439209r56612p56950j460495j590386j339645j181870
2917.2D03605766j580314j389122j571999j411362p93762q68797k64130l76243l00599
2925.9C95049438j31073j70021J08948j61247Q0948N2795P1526J13296j77841P5760
2935.6C94912529O55937Q90122O04667P60079O76613N80482Q51631J011353Q42743
2944.2D01786156L40080M14162O33697O64482L02620M10385R71718Q36563N62744O13022
2953.9D07535629Q73528K53143r6359J44348J37520O09207J015167J073418R33647
2962.6D12479248Q65364M79012L87878O64253O65779P81403O01845P26890R87168J024551
2972.2D19663391O40411O60897Q77533J58729M22211P30057M58832L35540N11971N89866
$$ y = [413976440, 413219109, 412330933, 410891724, 409935112, 409178162, 407717667, 406127281, 404787636, 403605766, 402025452, 400636330, 399064331, 397652969, 396859207, 395990410, 395726280, 395350037, 395049438, 394918365, 394748344, 394857292, 394696045, 394776993, 394829788, 394901314, 395014610, 394836769, 394912529, 395568466, 396458588, 397063255, 397823334, 398499947, 399080429, 399932060, 400943413, 401786156, 402126236, 402540398, 403174095, 403838577, 404141197, 404551582, 405523300, 406359863, 406922607, 407535629, 408409157, 408662300, 408565941, 408710289, 408847809, 409457016, 410472183, 411545601, 412479248, 413344612, 413823624, 414211502, 414875755, 415541534, 416322937, 416924782, 417651672, 418638840, 419663391, 420303802, 420964699, 421842232, 422000961, 422423172, 423153229, 423612061, 423947601, 424459572, 425049438]
2981.8D25049438j82685r8458L51830M72145M49753M94766K54593o2866O19392M03557
2991.5D27751465j01929j74370m23317m36363j7586K82021m63676n59464j95618j77536
3001.1D25483627n08117n70336N0888m69932j004982q10738l06473K6703l72162n77545
3010.8D20940933m46472n24177r71261q33206m19998n17235j006508p61413n18494
3019.5D14942169j044845n56183l51830o15959q21495p63626o95000r93194l65601
3028.1D08734436p01408q34084m99992j060524j098976p50428k93693j042824j087189
3036.8D01365318n63087q77304n36995m63181o94275q82988o74591r57832j226273
3045.5C94488792r51004j111450p96776q27674o78635n79796r28650r15489p74384
$$ y = [425049438, 424866753, 424768295, 425120125, 425592270, 426042023, 426536789, 426791382, 426728516, 427347908, 427751465, 427649536, 427475166, 427051849, 426615486, 426597900, 426879921, 426416245, 425856781, 425661163, 425483627, 424975510, 424405174, 424456062, 423986130, 422981148, 422170410, 421863937, 421890640, 421518478, 420940933, 420494461, 419970284, 418999023, 418165817, 417745819, 417228584, 416222076, 415460663, 414942169, 413897324, 413341141, 412989311, 412373352, 411551857, 410788231, 410093231, 409100037, 408734436, 408033028, 407198944, 406698952, 405638428, 404539452, 403789024, 403495331, 402452507, 401365318, 400802231, 399924927, 399387932, 398924751, 398230476, 397347488, 396672897, 395715065, 394488792, 393537788, 392426338, 391629562, 390801888, 390123253, 389543457, 388614807, 387699318, 386924934]
3054.2C86924934m57725q06275j175689j074257m24690l94211j023712p96204p00569
3062.9C80071602p29599p51648k35252l59879j031952r67407j073074o19545n25132
3071.5C73778114n45463n47486q56819q24623q21686n61676o94542m99725m96407o41479
3081.2C67288208n65224j033783q49304p09915m36935n94788r98802p35169n46646
3089.9C60817642k77824p29561p74918o73332q17070n37414o35834o28243o60324m29420
3099.5C54653702n18418j019630r12476m51126l15895q97789j021995q39844m70314
3108.2C48206215l09029p08809p27195p91016q00400p80525o91757m62685m29878m04472
3117.8C42100449p43370j281929q13256k62298j049195j006965l07885o34498j080704
$$ y = [386924934, 386467209, 385660934, 384485245, 383410988, 382986298, 382592087, 381568375, 380772171, 380071602, 379342003, 378590355, 378355103, 377995224, 376963272, 375995865, 374922791, 374303246, 373778114, 373232651, 372685165, 371828346, 371003723, 370182037, 369620361, 368925819, 368426094, 367929687, 367288208, 366722984, 365689201, 364839897, 364129982, 363693047, 363098259, 362099457, 361364288, 360817642, 360539818, 359810257, 359035339, 358362007, 357544937, 357007523, 356371689, 355743446, 355083122, 354653702, 354135284, 353115654, 352203178, 351752052, 351436157, 350538368, 349516373, 348676529, 348206215, 347897186, 347188377, 346461182, 345670166, 344869766, 344089241, 343397484, 342934799, 342504921, 342100449, 341357079, 340075150, 339261894, 338999596, 337950401, 336943436, 336635551, 336001053, 334920349]
3126.5C34920349j010437l38554l36952q15888r20639r04846p78809o77566o60096
3135.2C28476562p48100n47676p48253q51326n13916j190567j384697n27878l67355
3143.9C21596794n85747o25572o70280m29230p48901j003304l98827m25663n50212
3152.5C16159058o55594r74674j075325q59681n33695q96034r74636o53877o96698
3161.2C08838844j010494p69882l38669o39439o94313p66658o87313n18361n27629
3169.9C02886086p78676j343650j060105o49776l44620n09453o43577m93279q08849
3178.6B96254101n67398p36656p25899q04272r29298k68479p72838r10530n18914o54392
3188.2B89365425q40416q16612m25930o24237o71024m24042l50876n57366j035270
$$ y = [334920349, 333909912, 333571358, 333234406, 332418518, 331497879, 330593033, 329814224, 329136658, 328476562, 327728462, 327180786, 326432533, 325581207, 325067291, 323876724, 322492027, 321964149, 321596794, 321011047, 320385475, 319715195, 319285965, 318537064, 317533760, 317134933, 316709270, 316159058, 315503464, 314528790, 313453465, 312593784, 312060089, 311164055, 310189419, 309535542, 308838844, 307828350, 307058468, 306719799, 306080360, 305386047, 304619389, 303932076, 303413715, 302886086, 302107410, 300763760, 299703655, 299053879, 298709259, 298199806, 297556229, 297062950, 296254101, 295686703, 294950047, 294224148, 293419876, 292490578, 292222099, 291449261, 290538731, 290019817, 289365425, 288525009, 287708397, 287282467, 286658230, 285987206, 285563164, 285212288, 284654922, 283619652]
3196.9B83619652j009579o22024k39220j12534n93376j155033n04398l25947j033840
3205.6B78023701n16205l46928o58569k19860l4390n58624q69236o86798p08046p11880
3215.2B72713165n29804m09393m31862n67436q97160q35895j89877j94931n29041n05658
3224.9B67622108m47311m21009o25439j059665o81687O619r4242k63462n32494o06346
3234.5B62897072j050091r67655J95179l73287q37918l25050k91729m90875o39153
3243.2B58116493k64435k21862j43376m14848p59106l29609l96099m32968o57730o78387
3252.8B53818073m8828l06644m67034j9321n49679r74216l69034l16410l60260k33898
3262.5B50172749o29292p31792j15929J40037l72505o96373q87813k76470K76432k76528
$$ y = [283619652, 282610073, 281988049, 281748829, 281636295, 281042919, 279887886, 279383488, 279057541, 278023701, 277507496, 277160568, 276501999, 276282139, 276247749, 275689125, 274819889, 274133091, 273425045, 272713165, 272183361, 271773968, 271342106, 270774670, 269877510, 269041615, 268851738, 268656807, 268127766, 267622108, 267174797, 266753788, 266128349, 265068684, 264386997, 264393616, 264299374, 264035912, 263503418, 262897072, 261846981, 260879326, 261074505, 260701218, 259863300, 259538250, 259246521, 258755646, 258116493, 257852058, 257630196, 257486820, 257071972, 256312866, 255983257, 255587158, 255154190, 254496460, 253818073, 253769245, 253462601, 252995567, 252976246, 252426567, 251452351, 251083317, 250766907, 250406647, 250172749, 249543457, 248811665, 248695736, 248835773, 248463268, 247766895, 246879082, 246602612, 246879044, 246602516]
3272.1B46602516l17840j77689l01647m50821l84922k70386j41430j05839o65950o62403
3281.8B43123589p56493n08919J93978m81625n85270L014k02160n8575L04585p9651
3291.4B40952473m70658p37533n37586n990k86388o7482J06201m55036o88457q12569
3301B36996975k76890L62835K06757j09959p1697l52040p24029n76878o16378n06764
3310.7B34331932j48315q5831l38059q5868j7777o25648m38233k67963k88639m70181
3320.3B31565418o64768k69718j84746l09162o35738m19484m39853p78027k05688n07374
3330B27150860r23538o27480j92680J04789k16884m53434o66180m31843j75209n16452
3339.6B23051949k38190l0575n89848n09719l27282q38948m63943l0308l10325K4280
$$ y = [246602516, 246284676, 246106987, 245805340, 245354519, 244969597, 244699211, 244557781, 244451942, 243785992, 243123589, 242367096, 241858177, 242052155, 241570530, 240985260, 240988274, 240786114, 240727539, 241032124, 240952473, 240481815, 239744282, 239206696, 239200706, 238914318, 238846836, 238953037, 238498001, 237809544, 236996975, 236720085, 237082920, 237289677, 237179718, 237108021, 236755981, 236031952, 235455074, 234838696, 234331932, 234183617, 234097786, 233759727, 233673859, 233656082, 233030434, 232592201, 232324238, 232035599, 231565418, 230900650, 230630932, 230446186, 230137024, 229501286, 229081802, 228641949, 227863922, 227658234, 227150860, 226227322, 225599842, 225407162, 225511951, 225295067, 224841633, 224175453, 223743610, 223568401, 223051949, 222813759, 222783184, 222193336, 221683617, 221356335, 220517387, 220053444, 220023136, 219712811, 219737091]
3349.3B19737091O1112n76458p58324n75390l91655j60999L7441M0207j85242r8839
3358.9B17128944j00765m51736k98901l31325k59209J68037O1245n32112p73792J93558
3368.6B14803944L53927k85663k31667l95279k58636K05002M15592J831p85084r67484
3378.2B12856483k78701O06918J48640k22874R308m70066l47405r2296j93215J12248
3387.8B12129040M60129M69112j27468p0553K14348m54617k59742K20928L7956O886
3397.5B12626019J01623j27125m71229P7247L43075m8694J27906L27702J90277m30622
3407.1B12716179m88510R2830L53356L07617j34182m940M42333M84009Q6575m34742
3416.8B13420525k23675M19006O54164O9370j65825j3599K18925N55935L15189L31059
$$ y = [219737091, 219798203, 219221745, 218463421, 217888031, 217496376, 217335377, 217372818, 217413025, 217227783, 217128944, 217028179, 216576443, 216277542, 215946217, 215687008, 215855045, 215916290, 215384178, 214610386, 214803944, 215157871, 214872208, 214640541, 214245262, 213986626, 214191628, 214607220, 214609051, 213823967, 212856483, 212577782, 213184700, 213333340, 213110466, 213119774, 212649708, 212302303, 212210007, 212016792, 212129040, 212589169, 213058281, 212930813, 212860260, 213074608, 212619991, 212360249, 212581177, 212619133, 212626019, 212727642, 212600517, 212129288, 212206535, 212549610, 212500916, 212628822, 212956524, 213146801, 212716179, 212227669, 212320499, 212673855, 212981472, 212847290, 212842350, 213284683, 213768692, 213855267, 213420525, 213196850, 213615856, 214270020, 214339390, 214173565, 214159966, 214378891, 214934826, 215250015, 215581074]
3426.4B15581074K86941M30146P49530J48507l66803L3264N02415J60122K27661N22404
3436.1B18275261K64358J74695K96726L80134L98712R22566O55575M1828L52764N17941
3445.7B22280560O09722k8878P3090P27272M13494K09656K96135M82159P09800P64771
3455.3B26537781L11794M86050P61242N16891J090794Q51612K07214O93455J202965
3464B32659798P60307K1515L6735M84677P65247O43463J072674P71542k3136P48901
3473.7B37941723J021099P08504P86705O65970M54731O11610Q22811J128330J119976
3482.3B45261459L25432O98357R11102P67098P66773N93548R47532O32553O95439R03778
3492B52503071Q36792N46627O72684J264495P95575J365871R76849K71358N21507Q91629
$$ y = [215581074, 215868015, 216298161, 217047691, 217196198, 216829395, 216862659, 217365074, 217525196, 217752857, 218275261, 218539619, 218714314, 219011040, 219391174, 219789886, 220712452, 221368027, 221409855, 221762619, 222280560, 222890282, 222861404, 222934494, 223661766, 224075260, 224284916, 224581051, 225063210, 225773010, 226537781, 226849575, 227335625, 228096867, 228613758, 229704552, 230556164, 230763378, 231456833, 232659798, 233420105, 233441620, 233478355, 233963032, 234728279, 235371742, 236444416, 237215958, 237192822, 237941723, 238962822, 239671326, 240458031, 241124001, 241578732, 242190342, 243013153, 244141483, 245261459, 245586891, 246285248, 247196350, 247963448, 248730221, 249323769, 250271301, 250903854, 251599293, 252503071, 253339863, 253886490, 254559174, 255823669, 256619244, 257985115, 258961964, 259233322, 259754829, 260646458]
3501.6B60646458K072467Q15468L97053J258392Q34217K97204O27193J795521N95226
3510.3B69339199N85327J194077J155948J679974Q02517J074238J281700O32400Q11234
3519B78556614N64995N98755J456108J230125L68843J078091J605492K123050J590271
3527.7B89172344Q11844P61547N42889J020737J089897J842098J674175J425228J267262
3536.4B99608021N3577J307640J342354R62238J470547J619949J357480J162643K041492
3545C10925941J552601J125756K56042J102619K065907K039280K532844P72438J375618
3553.7C23749046J550980J410446J911011J326370K417793J772118J156883Q96416
3561.4C36191063J769066J743850J271210M124375J641082P86667J775475K87475K462731
$$ y = [260646458, 262718925, 263534393, 263931446, 265189838, 266024055, 266321259, 266948452, 268743973, 269339199, 269924526, 271118603, 272274551, 273954525, 274757042, 275831280, 277112980, 277745380, 278556614, 279121609, 279720364, 281176472, 282406597, 282775440, 283853531, 285459023, 287582073, 289172344, 289984188, 290745735, 291288624, 292309361, 293399258, 295241356, 296915531, 298340759, 299608021, 299661598, 300969238, 302311592, 303273830, 304744377, 306364326, 307721806, 308884449, 310925941, 312478542, 313604298, 313860340, 314962959, 317028866, 319068146, 321600990, 322373428, 323749046, 325300026, 326710472, 328621483, 329947853, 332365646, 334137764, 335294647, 336191063, 337960129, 339703979, 340975189, 345099564, 346740646, 347527313, 349302788, 349590263, 352052994]
3570.1C52052994J571769J651497K110329K246285J475944J784287K910728J498299
3577.8C67302132K357902J877937J639481K202683J886825J930924J459312M373055
3585.5C85030251L285903j61743J681214N38444K608376K809562L221093K435951J569633
3594.2D03018684L609734M23927K326165M005851J595688L075256J773377Q59032K297935
3602.9D22985649K424088K876320L772926L442535K30980K958946J127396K37732O532326
3611.6D46588898K830848j07917L923645P09381L364105M063492K296600L097916K58674
3620.3D67025642J874199M054871L309173K579461L442573L582192L223152O821136
3628D95912399M606896o958924K154046M447441N741767L221932l90701K965622L905334
$$ y = [352052994, 353624763, 355276260, 357386589, 359632874, 361108818, 362893105, 365803833, 367302132, 369660034, 371537971, 373177452, 375380135, 377266960, 379197884, 380657196, 385030251, 388316154, 388154411, 389835625, 390374069, 392982445, 395792007, 399013100, 401449051, 403018684, 406628418, 407052345, 409378510, 413384361, 414980049, 418055305, 419828682, 420687714, 422985649, 425409737, 428286057, 432058983, 435501518, 435732498, 438691444, 439818840, 440056572, 446588898, 449419746, 449311829, 453235474, 453944855, 457308960, 461372452, 463669052, 466766968, 467025642, 468899841, 472954712, 476263885, 478843346, 482285919, 485868111, 489091263, 495912399, 500519295, 493560371, 495714417, 500161858, 505903625, 509125557, 508734856, 511700478, 515605812]
3636.6E15605812L238716J757889K027054L443985L739815K743797J234093K391014
3644.4E36182175L914451O466446K304192j080628P844582K736549k499389j275521
3652.1E54592857M476891N028877M430504O493454n155220J148872N824776J983719
3659.8E78824730K102852J315689L345604K560959K132225K285919J030121M740944
3667.5E98339043L005829Q01353K028465m412880K459221P800942R167442K664185
3675.2F21853600j4318886O5803P326317N331154j544685q4191K500801J995507J846084
3683.9F24971504J774254O60935L786354P841186n830002l486976Q469543l655167
3691.6F34531631k987060L804665J701393K070198J087608j93939J388626J175766
$$ y = [515605812, 518844528, 520602417, 522629471, 526073456, 529813271, 532557068, 533791161, 536182175, 540096626, 546563072, 548867264, 547786636, 555631218, 558367767, 555868378, 554592857, 559069748, 564098625, 568529129, 575022583, 569867363, 571016235, 576841011, 578824730, 580927582, 582243271, 585588875, 588149834, 590282059, 592567978, 593598099, 598339043, 601344872, 602146225, 604174690, 599761810, 602221031, 610021973, 619189415, 621853600, 607534714, 607600517, 614926834, 620257988, 618713303, 618629112, 621129913, 623125420, 624971504, 626745758, 627406693, 631193047, 639034233, 633204231, 629717255, 638186798, 634531631, 631544571, 635349236, 637050629, 639120827, 640208435, 640014496, 641403122, 642578888]
3699.3F42578888K568283L195877m123230k740402M144363K498169L85208j7471K563171
3708F51052856M406891n804596L914872P017669j3009948J075515L492890O44455J118240
3716.7F53908844K441711K569580k775955L45154O051560j387864m585647L904266
3724.4F60471649J436615J56174j149750n61905K737427O67877N141220o26449p370530
3733.1F60902328P481537K508164p360230j476974J507873j88446J377411L560791
3740.8F68312454l320770K460327J2838822m017640k0196685O727523N459900O330414
3748.5F74594345j028290j0036239J0083618l006287q946838M606857M199371L705216
3756.2F74171753m895401J299972O325684o156616l329849L161163J647491K02027
$$ y = [642578888, 645147171, 648343048, 644219818, 641479416, 645623779, 648121948, 648507156, 648489685, 651052856, 655459747, 649655151, 653570023, 660587692, 647577744, 648653259, 652146149, 652790604, 653908844, 656350555, 658920135, 656144180, 656489334, 662540894, 661153030, 656567383, 660471649, 661908264, 662064438, 660914688, 660352783, 663090210, 663758087, 668899307, 668272858, 660902328, 668383865, 670892029, 663531799, 662054825, 663562698, 663374252, 664751663, 668312454, 664991684, 667452011, 680290833, 676273193, 656076508, 662804031, 668263931, 674594345, 673566055, 663529816, 673613434, 670607147, 661660309, 666267166, 670466537, 674171753, 669276352, 670576324, 676902008, 670745392, 667415543, 670576706, 672224197, 672426224]
3763.9F72426224L487167j458893m708481K407685M563293J308213q287507J203995
3771.7F70941696L069458K06299J176300n32761N01099L31802L142090J472168p772979
3780.3F72535172J033325K156219R47113K247391k047119j930008J016922J522903
3788F77481918Q63419j57852n57862o01730K68097l25317J060943M049454k395248
3796.7F79685822m373780K475739M301834O733475m670182j2256241K974854K497482
3804.4F77369003M678116O120148q388214m903946M161682J573639j46866M33502M2877
3813.1F80939941J167679M839554p58133j2441559L035660N284119N442276L889084
3820.8F91398621j5911942n64651M932937K300644K598343M32358l939285r10645K067413
$$ y = [672426224, 675913391, 674454498, 669746017, 672153702, 676716995, 678025208, 669737701, 670941696, 674011154, 674217453, 675393753, 674860992, 675362091, 675693893, 678835983, 680308151, 672535172, 673568497, 675724716, 676671829, 678919220, 676872101, 674942093, 675959015, 677481918, 678345337, 678187485, 677629623, 677027893, 677295990, 676970673, 678031616, 682081070, 679685822, 675312042, 677787781, 682089615, 688823090, 684152908, 671896667, 674871521, 677369003, 682047119, 688167267, 679779053, 674875107, 679036789, 680610428, 680463562, 680897064, 680939941, 682107620, 686947174, 686189041, 673747482, 676783142, 682067261, 687509537, 691398621, 675486679, 674922028, 679854965, 682155609, 684753952, 685186310, 681247025, 680336380, 682403793]
3829.5F82403793L452301J751786q008805R00727P004928l756637r08585P886276m823990
3838.2F85901794n443267O238327m926148k585220O732483l55988m716110J034012
3845.9F81879883J015701k99301J408386J53732K187958N879288l608475L573914j3458786
3854.6F78732300m177551R001693q53195j813583J892471J946259L225174m395981
3862.3F83557587o06766O867599k808685o362305K181244M218521O446839m150315
3870F89343719j1442337J338196N923462N204849r325943j385803L746643j54266J959991
3878.7F85208511L978730k911759o759109M079742J172714J108704P022095j0376587
3886.4F82523041j851654K422104J91955M758988K30789p860413n2185K986069j283493
$$ y = [682403793, 685856094, 687607880, 679599075, 680499802, 687504730, 683748093, 682839508, 690725784, 685901794, 680458527, 686696854, 681770706, 679185486, 685917969, 685561981, 680845871, 681879883, 682895584, 682596283, 684004669, 684158401, 686346359, 692225647, 688617172, 692191086, 678732300, 674554749, 683556442, 682703247, 680889664, 682782135, 684728394, 687953568, 683557587, 682950821, 689818420, 687009735, 680647430, 682828674, 687047195, 693494034, 689343719, 677901382, 679239578, 685163040, 690367889, 681041946, 679656143, 683402786, 683248520, 685208511, 689187241, 686275482, 679516373, 683596115, 684768829, 685877533, 692899628, 682523041, 680671387, 683093491, 683285446, 688044434, 688275223, 680414810, 680362625, 683348694, 682065201]
3895.1F82065201J181946J751098K179947K920456r152069L225861K569122m879456
3902.8F81862106L637925l122406o32172O70090N4092J822281o5994k78092j052322
3911.5F82895508l281L17154j97220J133194K018585k720260l860321L842926J008453
3920.2F84434738l386383J469650J892090R22318j532822l392715O04858K524414J388016
3928.8F84924164p41196p81021J487274j467743k045364J465835R3308l14484L26844
3937.5F82947617Q926j56708p24106J277542J585007l097915j307755J225281P49359
3946.2F82507248J396179j368103l20129P67898k151108R13926M86831o47735M36020
3954.9F82021027J26037k16751j450424J24130K7085N77774J327209j131515p0038
$$ y = [682065201, 683247147, 684998245, 687178192, 690098648, 680946579, 684172440, 686741562, 681862106, 685500031, 682377625, 681745453, 682415543, 682469635, 684291916, 684225922, 683947830, 682895508, 682892227, 683209381, 683012161, 684145355, 686163940, 683443680, 679583359, 683426285, 684434738, 681048355, 682518005, 684410095, 685332413, 683799591, 680406876, 681011734, 683536148, 684924164, 684182968, 683401947, 684889221, 683421478, 681376114, 682841949, 682935257, 682620773, 682947617, 682956543, 682799835, 682075729, 683353271, 684938278, 681840363, 680532608, 681757889, 682507248, 683903427, 682535324, 682215195, 682983093, 680831985, 681745911, 682232742, 681585007, 682021027, 682147064, 681930313, 680479889, 680604019, 680631104, 681208878, 682536087, 681404572, 681334534]
3963.6F81334534L05481l41416l4408L54232M31214k85492k4643O19659n1956j005859
3973.2F81301346L23868Q57772L00293l32794m55017M0436m26788N1574m08783l13568
3982.8F80938339L61939J373J88751R7351L99094j18103K29416J63421m12826l4332
3992.5F81814423o04935M2267n76477l90473J130677P49282m2953m91409
4000.2F81630402
$$ y = [681334534, 681640015, 681298599, 681264191, 681618423, 682049637, 681764145, 681739502, 682359161, 682307205, 681301346, 681625214, 682482986, 682783279, 682450485, 681995468, 682035904, 681609116, 681660690, 681251907, 680938339, 681300278, 681301651, 681490402, 681587753, 681986847, 681868744, 682098160, 682261581, 681848755, 681814423, 681209488, 681251755, 680675278, 680284805, 681415482, 682164764, 682121811, 681630402]
##END=$$ End of the data block
