##TITLE=$$ Begin of the data block
##JCAMP-DX=5.00 $$ ACD/SpecManager v 10.08
##SPECTROMETER/DATA SYSTEM=Varian
##DATE=14 Jan 2013 10:31:42
##DATA TYPE=INFRARED SPECTRUM
##DATA CLASS=XYDATA
##ORIGIN=
##OWNER=
##NPOINTS=3735
##FIRSTX=399.26403809
##LASTX=4000.35498047
##MAXX=4000.35498047
##MINX=399.26403809
##MAXY=77.22329712
##MINY=27.43903160
##XFACTOR=1.0000000000
##YFACTOR=0.000000100000000
##FIRSTY=49.40671539
##DELTAX=0.96440572
##XUNITS=1/CM
##YUNITS=TRANSMITTANCE
##XYDATA=(X++(Y..Y))
399.3D94067154j4455872R089012J0297890K887230K896233j370468m769936p101135
$$ 494067154 479611282 488700294 498998184 501885414 504781647 503411179 498641243 491540108
407D91540108j639710J387291L076706L569298J716499O402893P426606k313004k2702560
$$ 491540108 489900398 491287689 494364395 497933693 499650192 506053085 513479691 511166687 488464127
415.7D88464127j3915406P965660q967247K314339K8778687Q601112m101982j6351814
$$ 488464127 474548721 482514381 473547134 475861473 504640160 513241272 509139290 492787476
423.4D92787476m052658J797218j244126k810821L454590R017715J717262j390380
$$ 492787476 488734818 490532036 489287910 486477089 489931679 498949394 500666656 499276276
431.1D99276276j001778k038155m85954q28667j824722j169815Q9417J755790K906456
$$ 499276276 498274498 496236343 495750389 494921722 493097000 491927185 492016602 493772392 496678848
439.8D96678848j916237o999130j300278m00886k99301L472709j364021L434525R512787
$$ 496678848 494762611 487763481 486463203 486062317 485763016 489235725 487871704 491306229 500819016
448.4E00819016L681602p2289l028564o774635n531731p98492j413727P64580O382026
$$ 500819016 504500618 504428329 501399765 494625130 489093399 488294907 486881180 487645760 494027786
457.1D94027786K259560l578301o506309n007858k18735K87781M952926K749787M65507
$$ 494027786 496287346 492709045 486202736 481194878 480976143 481263924 486216850 488966637 489432144
465.8D89432144Q51250n40161j459770q248139n130997R87130k379380M138489Q749352
$$ 489432144 490283394 489743233 488283463 480035324 474904327 475891457 473512077 477650566 486399918
474.5D86399918K634048k329369m063072m730301j374550J1483k0447M092712J977654
$$ 486399918 489033966 486704597 482641525 477911224 476536674 476548157 476527710 480620422 482598076
483.2D82598076m449806M226112K968903p392693m891090m425812J391678O346969
$$ 482598076 478148270 482374382 485343285 477950592 473059502 468633690 470025368 476372337
490.9D76372337M041901L791389k303466l248825j167145m484863k098351J273003
$$ 476372337 480414238 484205627 481902161 478653336 477486191 473001328 470902977 472175980
498.6D72175980k136498j532860K604752P21741J636314J51443m598312j308670J65711
$$ 472175980 470039482 468506622 471111374 471833115 473469429 473620872 469022560 467713890 467879601
507.3D67879601j513329J248436L988380K752953q47282k649804k737083l444481j510277
$$ 467879601 466366272 467614708 471603088 474356041 473508759 470858955 468121872 464677391 463167114
516D63167114J245613J091614J924133J751023j506920l265534j094055r99489l094673
$$ 463167114 464412727 465504341 467428474 469179497 467672577 464407043 463312988 462313499 459218826
524.6D59218826j474609j390534J263009N367851N097389N95932m093742l315735j330414
$$ 459218826 457744217 456353683 457616692 462984543 468081932 468677864 464584122 461268387 459937973
533.3D59937973k380600k584572Q11424L422738K283134m2458j709899j462632k332153
$$ 459937973 457557373 454972801 455784225 459206963 461490097 461447639 459737740 458275108 455942955
542D55942955k018814j411133m22211J477929J600494L546219M14696k604828l108902
$$ 455942955 453924141 452513008 452090797 453568726 455169220 458715439 459130135 456525307 453416405
550.7D53416405m005661o32897J66283N16052O42204J371804J916885j341209j561928
$$ 453416405 449410744 448777847 448944130 449460182 450102386 451474190 453391075 452049866 450487938
559.4D50487938k855072l415947O9809K601128K410125P63321J570702K288551j11847
$$ 450487938 447632866 444216919 444286728 446887856 449297981 450061302 451632004 453920555 453808708
568D53808708k376709l723259k849388j83678J338082J571045J067581J746673K154503
$$ 453808708 451431999 447708740 444859352 444675674 446013756 447584801 448652382 450399055 452553558
576.7D52553558j120262k866173l447914k232742m24194P29980L727608K766113J513367
$$ 452553558 451433296 448567123 445119209 442886467 442462273 443192253 446919861 449685974 451199341
585.4D51199341N65109j333694k206803l134765k86637K101670K287979K396049K382813
$$ 451199341 451764450 450430756 448223953 445089188 444802551 446904221 449192200 451588249 453971062
594.1D53971062N54924j572037j326332k769776j736831J453285J761398O35491k2202
$$ 453971062 454525986 452953949 451627617 448857841 447121010 448574295 450335693 450971184 450948982
602.8D50948982M99192k68136k027511k517204q06771k00767o41365N81703J227608
$$ 450948982 451448174 451180038 449152527 446635323 445828552 445627785 444986420 445568123 446795731
611.4D46795731J738281L49922j491623k537804k465629j010323o47430R41620J601715
$$ 446795731 448534012 448883934 447392311 444854507 442388878 441378555 440731125 441672745 443274460
620.1D43274460K432365K368965p8849l45841j97296j050072o5918K181397K570381
$$ 443274460 445706825 448075790 447996941 447651100 447453804 446403732 446337814 448519211 451089592
628.8D51089592K837830L038101J730728N81970k86026j80778k6856J322060K531128
$$ 451089592 453927422 456965523 458696251 459278221 458992195 458811417 458784561 460106621 462637749
637.5D62637749K527389L021012J852150M14695p80105p11251J174279O89354N69000
$$ 462637749 465165138 468186150 470038300 470452995 469672890 468961639 470135918 470825272 471394272
646.2D71394272K279358L586921K958031J104660L1090j205521j528129j852799l76434
$$ 471394272 473673630 477260551 480218582 481323242 481354332 480148811 478620682 476767883 476391449
654.8D76391449K954712L077698K122917J035614j039200j995735k224579k112579
$$ 476391449 479346161 482423859 484546776 485582390 484543190 482547455 480322876 478210297
662.5D78210297r16176J50070J603622L041420J568795R86976J597863j808320k803192
$$ 478210297 477294121 477444191 479047813 482089233 483658028 484645004 486242867 484434547 481631355
671.2D81631355j541290N89409J964378K926293L125229K413597J803627M78630J15776
$$ 481631355 480090065 480679474 482643852 485570145 488695374 491108971 492912598 493391228 493507004
679.9D93507004j063462j148262J034241K944374M378510K562141J024132L04527p59735
$$ 493507004 492443542 491295280 492329521 495273895 499652405 502214546 503238678 503543205 502783470
688.6E02783470j194687j416816L9978J097641K683372L508873K876205K066880r37767
$$ 502783470 501588783 500171967 500211945 501309586 503992958 507501831 510378036 512444916 511507149
697.3E11507149k321663j535797p22199k24571J010170L414040M045791K643395N93338
$$ 511507149 509185486 507649689 506927490 506702919 507713089 511127129 515172920 517816315 518409653
705.9E18409653p44744j335830j188164j085014O18286L440818L217392K593537K033958
$$ 518409653 517664909 516329079 515140915 514055901 514674187 518115005 521332397 523925934 525959892
714.6E25959892L28789j691132k856864j307297J110115K519378L363572L234062J683273
$$ 525959892 526288681 524597549 521740685 520433388 521543503 524062881 527426453 530660515 532343788
723.3E32343788N27458p32002k053451j285859K7581J129379K308769L633270L816910
$$ 532343788 532871246 532139244 530085793 528799934 528827515 529956894 532265663 535898933 539715843
732E39715843K775345J90582k643127k660065j982155l69491J469917K751122L025512
$$ 539715843 542491188 542681770 540038643 537378578 535396423 535026932 536496849 539247971 542273483
740.7E42273483K167015J584626n60913j980057k040291j296043N55992K497520K962380
$$ 542273483 544440498 546025124 545464211 543484154 541443863 540147820 540703812 543201332 546163712
749.3E46163712J930046K530479J387024j543465j858139j074066q41865R25598L332138
$$ 546163712 548093758 550624237 552011261 550467796 548609657 547535591 546693726 547619324 550951462
758E50951462L561592L552170K233200N9013j627273j726761m53720K94456K242737
$$ 550951462 554513054 558065224 560298424 560357437 558730164 557003403 556549683 556844139 559086876
766.7E59086876J555099K020913K894668m28734j427765j749534k142334j518517L99361
$$ 559086876 560641975 562662888 565557556 565128822 563701057 561951523 559809189 558290672 558690033
775.4E58690033J798325J953849J956292P41844O58912j591110l136520j008606O24428
$$ 558690033 560488358 562442207 564398499 565140343 565799255 564208145 561071625 560063019 560687447
784.1E60687447J727295K273674K463836J651535O07720j124306k179108j627807k30179
$$ 560687447 562414742 564688416 567152252 568803787 569411507 568287201 566108093 564480286 564250107
792.7E64250107M34799K9526K193184K234764L22685j371651k186660k080040l205147
$$ 564250107 564684906 564714432 566907616 569142380 569465065 568093414 565906754 563826714 560621567
801.4E60621567j611595r21898l09334J316872R77554r58405l216667k807503l325386
$$ 560621567 559009972 558088074 557778740 559095612 560073166 559114761 555898094 553090591 549765205
810.1E49765205k988624k156449j463279J20849K91100R72938q68949k166939j495323
$$ 549765205 546776581 544620132 543156853 543277702 543568802 544541740 543672791 541505852 540010529
818.8E40010529j920815j154823M94537K457810K840690K631798K033386J087990R81483
$$ 540010529 538089714 536934891 537429428 539887238 542727928 545359726 547393112 548481102 549462585
827.5E49462585J206170J664505J815490L734436M526978M104843L734474K722016
$$ 549462585 550668755 552333260 554148750 557883186 562410164 566515007 570249481 572971497
835.2E72971497J682853k2812K48681M79240J142235K749138M140701L833465K262612
$$ 572971497 574654350 574631538 574880219 575359459 576501694 579250832 583391533 587224998 589487610
843.9E89487610K077675M38080j38169p13348p9498J921043K607574L841935L023071
$$ 589487610 591565285 592003365 591865196 591151848 591072350 592993393 595600967 599442902 602465973
852.5F02465973K180824N08766l08761J03798M9667J249428K104301L634377K848930
$$ 602465973 604646797 605155563 604846802 604950600 605000267 606249695 608353996 611988373 614837303
861.2F14837303K517357K331810l86543j692925j880989q45794L44657J271668O77795
$$ 614837303 617354660 619686470 619299927 617607002 615726013 614880219 615224876 616496544 617174339
869.9F17174339Q85582M38347j885033k820320l381920k090911j354218n18646J4953
$$ 617174339 618059921 618498268 616613235 613792915 610410995 608320084 606965866 606447220 606462173
878.6F06462173M55590J314888R3193m31366j811104k037621j062126j091766j227531
$$ 606462173 606917763 608232651 608325844 607894478 606083374 604045753 602983627 601891861 600664330
887.3F00664330J18522J790505O09893l55110j805038j553307j124344q88786O94580
$$ 600664330 600782852 602573357 603183250 602828140 601023102 599469795 598345451 597456665 598151245
895.9E98151245P29561K616348J404228r02366j767502k431870j168289j307983N78842
$$ 598151245 598880806 601497154 602901382 601999016 600231514 597799644 596631355 595323372 595902214
904.6E95902214K135391K796517L671112L312683K003288p52258j190376j505127r96361
$$ 595902214 598037605 600834122 604505234 607817917 609821205 609068947 607878571 606373444 605377083
913.3F05377083p8087K86179K9716p72705n04379k594834l481483l361130l292198
$$ 605377083 605298996 605585175 605614891 604842186 604337807 601742973 598261490 594900360 591608162
922E91608162k521248k039909j576348j932258j750717l042565l361740l096390m188232
$$ 591608162 589086914 587047005 585470657 583538399 581787682 578745117 575383377 572286987 568098755
930.7E68098755l817253k325745l71017j65940j02653j86653j104660k016068k893638
$$ 568098755 564281502 561955757 561584740 561418800 561316147 561129494 560024834 558008766 555115128
939.3E55115128j999398j383476n43938r2010Q1558M86832p30019j330337j563225
$$ 555115128 553115730 551732254 551188316 551096306 551177864 551664696 550934677 549604340 548041115
948E48041115j762200j252899o2408N3940j3695R98039J13602j668816l236542l631477
$$ 548041115 546278915 545026016 544963608 545017548 545003853 546001892 546115494 544446678 541210136 537578659
957.7E37578659l514900l315201k285995j288338p4196J27602j585617l631745l195495
$$ 537578659 534063759 530748558 528462563 527174225 527100029 527227631 525642014 522010269 518814774
966.3E18814774k410317l062210k678337k004624j449279r71566j200943k749137m058381
$$ 518814774 516404457 513342247 510663910 508659286 507210007 506238441 505037498 502288361 498229980
975D98229980m387588m985390m416504l560447l445855l468093l519860l889236n009957
$$ 498229980 493842392 488857002 484440498 480880051 477434196 473966103 470446243 466557007 461547050
983.7D61547050n668716n661201n931511n537835m753036m092903l427849l035927
$$ 461547050 455878334 450217133 444285622 438747787 433994751 429901848 426473999 423438072
991.4D23438072k813606m172897m416581l576240m192429m461364l278695j803512
$$ 423438072 420624466 416451569 412034988 408458748 404266319 399804955 396526260 394722748
999.1C94722748j703873j848144l092347l257789k894554l392792k379646k196846
$$ 394722748 393018875 391170731 388078384 384820595 381926041 378533249 376153603 373956757
1006.8C73956757j410752j122589j221313j170235j676788k181168k957535j487388
$$ 373956757 372546005 371423416 370202103 369031868 367355080 365173912 362216377 360728989
1014.6C60728989j662598k401924k538567k364616j297112k185859k343598k614670
$$ 360728989 359066391 356664467 354125900 351761284 350464172 348278313 345934715 343320045
1022.3C43320045k328414k726937k397461r73358j542587j293640j781044r60388j109086
$$ 343320045 340991631 338264694 335867233 334893875 333351288 332057648 330276604 329316216 328207130
1031C28207130j725692j501580j198272L32489P5874J023483J008568J557694J876907
$$ 328207130 326481438 324979858 323781586 324114075 324189949 325213432 326222000 327779694 329656601
1039.6C29656601J624069J696358j71890N40657K27852R40856J048394l54920o1683
$$ 329656601 331280670 332977028 332805138 333345795 333573647 334514503 335562897 335207977 335146294
1048.3C35146294q88939j069260j857071j096268j205711r25636n29709j226006J84555
$$ 335146294 334257355 333188095 331331024 330234756 329029045 328103409 327573700 326347694 326532249
1057C26532249o67839M60663N04341K45476R96437J381874K872582K114830L037529
$$ 326532249 325864410 326325073 326829414 327074890 328071327 329453201 332325783 334440613 337478142
1065.7C37478142K344742J870536J667061Q92220J300697R87663J086426o04133R31587
$$ 337478142 339822884 341693420 343360481 344252701 345553398 346541061 347627487 347023354 347954941
1074.4C47954941J407776K97126R04885K58064K86865k88810J063652O12220J298638
$$ 347954941 349362717 349659843 350564728 350822792 351109657 350820847 351884499 352496719 353795357
1083C53795357K701072J584626K543945J363144O19011P62977J211663J254692J428947
$$ 353795357 356496429 358081055 360625000 361988144 362607155 363370132 364581795 365836487 367265434
1091.7C67265434K072487J505127K312813J368980J127358J128616J475563J974259
$$ 367265434 369337921 370843048 373155861 374524841 375652199 376780815 378256378 380230637
1099.4C80230637Q19931J246185J356087J960334J435280J911507J956558K937k1629
$$ 380230637 381050568 382296753 383652840 385613174 387048454 388959961 390916519 390919456 390897827
1108.1C90897827Q1329J463624R82627M56620R45282P96852J579590J304817N60989
$$ 390897827 390979156 392442780 393425407 393882027 394827309 395624161 397203751 398508568 399069557
1116.8C99069557r08661l8032N84869l15399M00429Q03413P04270j24093P46003J059646
$$ 399069557 398160896 398122864 398707733 398392334 398792763 399596176 400300446 400176353 400922356 401982002
1126.4D01982002P40242P76673J278457K498932J569214K138329K410965J999244J624871
$$ 401982002 402722244 403498917 404777374 407276306 408845520 410983849 413394814 415394058 417018929
1135.1D17018929J124153K354355K337265J831054J602097K122116K074242J185112
$$ 417018929 418143082 420497437 422834702 424665756 426267853 428389969 430464211 431649323
1142.8D31649323P51800L00140O34537O34346Q85468O69288N09224J080666J20430
$$ 431649323 432401123 432701263 433335800 433970146 434855614 435524902 436034126 437114792 437235222
1151.5D37235222p76291q18977o23398n28183l67127o60247p56989K45399L82805m37278
$$ 437235222 436458931 435639954 435016556 434488373 434121246 433460999 432704010 432949409 433332214 432894936
1161.1D32894936j197167l71208M24576N05600P39670J207771K510071K902450L238068
$$ 432894936 431697769 431326561 431751137 432256737 432996407 434204178 436714249 439616699 442854767
1169.8D42854767K974396K434883K438469K391166K649613L130073L320961L001442
$$ 442854767 445829163 448264046 450702515 453093681 455743294 458873367 462194328 465195770
1177.5D65195770L387032K946472K232361J951370J461220J345062J429482K025261
$$ 465195770 468582802 471529274 473761635 475713005 477174225 478519287 479948769 481974030
1185.3D81974030K039604J421852J336403Q36868j12038P4158n68008r97010n4206
$$ 481974030 484013634 485435486 486771889 487608757 487496719 487570877 487002869 486005859 485951653
1193.9D85951653l01590l88375o51932j106185j246911j453628j145592j133461q96873
$$ 485951653 485650063 485261688 484609756 483503571 482256660 480803032 479657440 478523979 477627106
1202.6D77627106p81365r61113j162071j191063m38118n77392j139260j091003n76821
$$ 477627106 476845741 475884628 474722557 473531494 473093376 472515984 471376724 470285721 469708900
1211.3D69708900k54554n88150k48947j55945p0610J13639m34074n64384n66941o26716
$$ 469708900 469454346 468866196 468617249 468461304 468390694 468504333 468070259 467505875 466938934 466312218
1220.9D66312218n80559l17116j16882m56734o14815l53241m69360j137695j198464
$$ 466312218 465731659 465414543 465297661 464840927 464226112 463872871 463403511 462265816 461067352
1229.6D61067352p77893n13992n12543m86717l88680n72929k45323k63329n30967n75753
$$ 461067352 460289459 459775467 459262924 458776207 458387527 457814598 457569275 457305946 456774979 456199226
1239.3D56199226n03234n2987k79617j51291J36223j98898o04859o69975m54597o24352
$$ 456199226 455695992 455643005 455363388 455212097 455348320 455149422 454544563 453874588 453419991 452795639
1248.9D52795639m86679j65520L06931l433n68123j63040j51902j53045j08681p8430
$$ 452795639 452308960 452143440 452450371 452446938 451878815 451715775 451563873 451410828 451302147 451223717
1258.5D51223717k59667K13547Q13675L18336J95885R0637L22037L91541P58438R37118
$$ 451223717 450964050 451177597 451991272 452309608 452505493 452596130 452918167 453309708 454068146 455005264
1268.2D55005264P30667J232987J138115J518745R23386N97381J500473J249466R44176
$$ 455005264 455735931 456968918 458107033 459625778 460549164 461146545 462647018 463896484 464840660
1276.9D64840660J086159J400528J237602J311379J530113J492729J560364J599121
$$ 464840660 465926819 467327347 468564949 469876328 471406441 472899170 474459534 476058655
1284.6D76058655J573639J448364J951561K007179J643639J379127J038208M25797
$$ 476058655 477632294 479080658 481032219 483039398 484683037 486062164 487100372 487526169
1292.3D87526169N75752J188355R67178J167450R99298Q76961Q14514M73137K99301
$$ 487526169 488101921 489290276 490257454 491424904 492424202 493301163 494115677 494588814 494888115
1301D94888115K58598M46358J85547M78973J79825l4714M10157K746r02862j433754
$$ 494888115 495146713 495593071 495778618 496257591 496437416 496402702 496812859 496815605 495912743 494478989
1310.6D94478989n75257m58221p25556k91862M0588L13416K37121M41971L38402M82712
$$ 494478989 493903732 493445511 492719955 492428093 492468681 492782097 493019218 493461189 493799591 494282303
1320.3D94282303N32379N55649R50088Q38776J099892J131973M79507n47981n19981
$$ 494282303 494814682 495370331 496320419 497159195 498259087 499391060 499870567 499322586 498802605
1328.9D98802605l71132n05142l80173o27670j14212N4473Q7548j17188m28200J34125
$$ 498802605 498431473 497926331 497546158 496918488 496804276 496858749 496946297 496829109 496400909 496535034
1338.6D96535034J11237k81754n06019N24673J224022J124840J033058O03027K71874
$$ 496535034 496646271 496364517 495858498 496383171 497607193 498732033 499765091 500368118 500639992
1347.3E00639992o5193L66897l29513n06592j9341N6496N00374l58467m32129m49639
$$ 500639992 500574799 500941696 500612183 500105591 500086250 500142746 500643120 500284653 499852524 499402885
1356.9D99402885n93681n92041m96559j77956l48472K05612k20718Q7432n14450j051712
$$ 499402885 498809204 498217163 497720604 497542648 497194176 497399788 497179070 497266502 496752052 495700340
1366.6D95700340j64909j016159r73625l62931J50414J65253L40347N48324o68983
$$ 495700340 495535431 494519272 493545647 493182716 493333130 493498383 493838730 494387054 493718071
1375.2D93718071l59688m58793r4643o43578m83284J45645p88879q63342j487580j466331
$$ 493718071 493358383 492899590 492804947 492161369 491678085 491823730 491034851 490171509 488683929 487217598
1384.9D87217598p59430n33943k312966j513938j67122j662369j613731j450310j514321
$$ 487217598 486458168 485924225 483611259 482097321 481930199 480267830 478654099 477203789 475689468
1393.6D75689468k127876k823410k116013k183532j321984k454185j939735j359177
$$ 475689468 473561592 470738182 468622169 466438637 465116653 462662468 460722733 459363556
1401.3D59363556k216759j638794j505432k747230l459435j815071j254120j362533
$$ 459363556 457146797 455508003 454002571 451255341 447795906 445980835 444726715 443364182
1409D43364182j446419k161560j220208j142883j423530j281395j244164n13763n16358
$$ 443364182 441917763 439756203 438535995 437393112 435969582 434688187 433444023 432930260 432413902
1417.7D32413902M67339j838608r75952J207733N15862O73332j007080L67050J216888
$$ 432413902 432881241 431042633 430066681 431274414 431790276 432463608 431456528 431823578 433040466
1426.3D33040466O61927J557121J052132J158103P75185J390267J376266J100006J763954
$$ 433040466 433702393 435259514 436311646 437469749 438244934 439635201 441011467 442111473 443875427
1435D43875427J487580J767082J112137K468223J852913J358452J562576J160889J734047
$$ 443875427 445363007 447130089 448242226 450710449 452563362 453921814 455484390 456645279 458379326
1443.7D58379326J016235J625290J751328J842155R45892Q09212J672249Q97369J389618
$$ 458379326 459395561 461020851 462772179 464614334 465560226 466369438 468041687 468939056 470328674
1452.4D70328674Q75664K167587K413521J406403J338310r2659L419456J242829K093811
$$ 470328674 471204338 473371925 475785446 477191849 478530159 478437500 481856956 483099785 485193596
1461.1D85193596J297722R69887K620582J450882K849732K037353K197456K050095
$$ 485193596 486491318 487461205 490081787 491532669 494382401 496419754 498617210 500667305
1468.8E00667305K229080K850762J843910M299888L336945K649460L028259K504273
$$ 500667305 502896385 505747147 507591057 511890945 515227890 517877350 520905609 523409882
1476.5E23409882J815223J936341J792793J524696J556969J389046J858558J783448
$$ 523409882 525225105 527161446 528954239 530478935 532035904 533424950 535283508 537066956
1484.2E37066956J736412J886673M60128m7454J371459J24512j343765r4223M67567
$$ 537066956 538803368 540690041 541150169 541102715 542474174 542598686 541254921 541160698 541628265
1492.9E41628265k97432p58209k28843m599534q21189r83735l683700o44837r36584
$$ 541628265 541330833 540572624 540343781 535744247 534923058 533939323 530255623 529610786 528674202
1501.6E28674202j202965j173172N06706J266785l847999n309220K90489R06296q94241
$$ 528674202 527471237 526298065 526804771 528071556 524223557 518914337 519204826 520111122 519216881
1510.2E19216881O39686m28161j990128m56734r93537n82962j196633k366409J23939
$$ 519216881 519856567 519428406 517438278 516981544 515988007 515405045 514208412 511842003 511965942
1518.9E11965942R75190j67122o09398N25589O45675J545830j074524k96325R25407
$$ 511965942 512941132 512774010 512164612 512690201 513335876 514881706 513807182 513510857 514436264
1527.6E14436264M13208J175613J379586J573066J098328J122971j106186K37884K30026
$$ 514436264 514849472 516025085 517404671 518977737 520076065 521199036 520092850 520330734 520560760
1536.3E20560760K18430J905785R07592Q33817l66974p24983J81694J691322J331024
$$ 520560760 520779190 522684975 523592567 524426384 524059410 523334427 523516121 525207443 526538467
1545E26538467j277580Q38623M00963J157913J173592p42493O33698P40699J610299
$$ 526538467 525260887 526099510 526500473 527658386 528831978 528089485 528723183 529463882 531074181
1553.6E31074181k025643j022148J750984J945687J338539n749817k659035n91736
$$ 531074181 529048538 528026390 529777374 531723061 533061600 527311783 524652748 524061012
1561.4E24061012Q3161j487046r62715k340202k623901q60405j563340p73544p968712
$$ 524061012 524144173 522657127 521694412 519354210 516730309 515869904 514306564 513533020 505564308
1570E05564308k076568j879006l522606k700729k981911l99017j0121002k448540l379936
$$ 505564308 503487740 501608734 498086128 495385399 492403488 492004471 481883469 479434929 476054993
1578.7D76054993m747620m183311n590935l731117n836182l718071m929009m149932
$$ 476054993 471307373 467124062 461533127 457802010 451965828 448247757 443318748 439168816
1586.4D39168816l963280n168381l567505o239052l958053n819740l495179m152946
$$ 439168816 435205536 430037155 426469650 420230598 416272545 410452805 406957626 402804680
1594.1D02804680m976006k502975n000763k533112n195655l102608m113884l729668
$$ 402804680 397828674 395325699 390324936 387791824 382596169 379493561 375379677 371650009
1601.9C71650009k174606m747582j537590l553199j422158l136978j651688j794357
$$ 371650009 369475403 364727821 363190231 359637032 358214874 355077896 353426208 351631851
1609.6C51631851l404236j33133k904853p4730k053719L81622Q9913n740891J750412
$$ 351631851 348227615 348094482 345189629 345114899 343061180 343442802 343532715 337791824 339542236
1618.2C39542236j432342O88133j924705R37576J55678j954689J462707o57616K016564
$$ 339542236 338109894 338798027 336873322 337810898 337966576 336011887 337474594 336816978 338833542
1626.9C38833542j583786R04045K39449L76625J252098J22871K632942P8163K331314
$$ 338833542 337249756 338153801 338393250 338769875 340021973 340144844 342777786 342855949 345187263
1635.6C45187263m73289L219833Q68340K90604K729377O13022K923393R30367K791290
$$ 345187263 344713974 347933807 348802147 349092751 351822128 352435150 355358543 356288910 359080200
1644.3C59080200K474213Q13827K710686j597557L104019O39572L256340K490731k031517
$$ 359080200 361554413 362368240 365078926 363481369 366585388 367224960 370481300 372972031 370940514
1653C70940514K131004m89807L643455R51653K086220O46858J594581K415352K229920
$$ 370940514 373071518 372581711 376225166 377176819 379263039 379909897 381504478 383919830 386149750
1661.6C86149750L836860Q53844L979530K081833K667351K801361K345658L834152
$$ 386149750 389986610 390840454 394819984 396901817 399569168 402370529 404716187 408550339
1669.4D08550339K265815N746155K861634M144210L878518L320999K833519K969894
$$ 408550339 410816154 416562309 419423943 423568153 427446671 430767670 433601189 436571083
1677.1D36571083M784775L085861N287743L922195M687691O700859N803604N312119
$$ 436571083 441355858 444441719 449729462 453651657 458339348 465040207 470843811 476155930
1684.8D76155930j067696M934578M343452M595070N532265M870415M888115M341926
$$ 476155930 475088234 480022812 484366264 488961334 494493599 499364014 504252129 508594055
1692.5E08594055N291557M929390M578743K235413N809402O384583O442680O423912
$$ 508594055 513885612 518815002 523393745 525629158 531438560 537823143 544265823 550689735
1700.2E50689735j160316O303711N285911M558831K520485L166847L873215K391014
$$ 550689735 549529419 555833130 561119041 565677872 568198357 571365204 575238419 577629433
1707.9E77629433L804626L362084K422828K127457K450256K944756J336670J196327
$$ 577629433 581434059 584796143 587218971 589346428 591796684 594741440 596078110 597274437
1715.6E97274437L755989L699646k875137K315063L192253J642533J143264N78919
$$ 597274437 601030426 604730072 601854935 604169998 607362251 609004784 610148048 610726967
1723.4F10726967R48219K002525J823845J073189J680832K480621Q29812P00950L171158
$$ 610726967 611675186 613677711 615501556 616574745 618255577 620736198 621566010 622266960 625438118
1732F25438118L414116M9057l294487K766228L459091K048569K892341J673317r52568
$$ 625438118 628852234 628901291 625606804 628373032 631832123 633880692 636773033 638446350 637493782
1740.7F37493782L134804K903595J176910J751785L854905L757095K467651K650833
$$ 637493782 640628586 643532181 644709091 646460876 650315781 654072876 656540527 659191360
1748.4F59191360J727829M265137K245712J84479L980332L385162L412247L709793
$$ 659191360 660919189 665184326 667430038 667614517 671594849 674980011 678392258 682102051
1756.2F82102051J289596J403046K614822K131424K984085M19312K79083L402024K175979
$$ 682102051 683391647 684794693 687409515 689540939 692525024 692944336 693223419 696625443 698801422
1764.8F98801422K167969K357712J694107j582489J501999M255142J466369j27182
$$ 698801422 700969391 703327103 705021210 703438721 704940720 709195862 710662231 710535049
1772.5G10535049j304016K851792K304306l46909J403198M17633J261979J014557l1205
$$ 710535049 709231033 712082825 714387131 714040222 715443420 715861053 717123032 718137589 718106384
1781.2G18106384J055756K082901K206650n3101K18582Q22602M06646N10788J674347
$$ 718106384 719162140 721245041 723451691 723398590 723617172 724439774 724846420 725357208 727031555
1789.9G27031555J439514J147919j067581p74384L556061J358643m68903L68271J024322
$$ 727031555 728471069 729618988 728551407 727777023 731333084 732691727 732222824 732591095 733615417
1798.6G33615417N31693m57077K557754O70014Q43964J430053k2659N50461J51596
$$ 733615417 734147110 733690033 736247787 736917801 737761765 739191818 739169159 739719620 739871216
1807.3G39871216p935M36478J538925L8223Q56552J780854M38919M40903m45099O73751
$$ 739871216 739863281 740299759 741838684 741876907 742733459 744514313 744953232 745394135 744949036 745622787
1816.9G45622787l01742J52969J366120O30035J589737K92816J185227J608047k068710
$$ 745622787 745321045 745474014 746840134 747470169 749059906 749352722 750537949 752145996 750077286
1825.6G50077286j454163Q51517K062302J467895j179352K33383J848145K33917k29187
$$ 750077286 748623123 749474640 751536942 753004837 751825485 752058868 753907013 754140930 753911743
1834.3G53911743m18625j79214L75976j1825J485596O52771R74502R62677J208572
$$ 753911743 753493118 753313904 753689880 753678055 755163651 755816422 756790924 757753601 758962173
1842.9G58962173Q81348m837494P97577J363449N11399N38253Q27179J284409j32141
$$ 758962173 759843521 755006027 755803604 757167053 757678452 758216705 759043884 760328293 760196152
1851.6G60196152J32904m97132J1979j22376K29035J278533M84314P60270J60904O28509
$$ 760196152 760329056 759831924 759843903 759721527 759950562 761229095 761713409 762473679 762634583 763263092
1861.3G63263092m68063n09339r765k29721J232376K93350J278839M2114j347885N28717
$$ 763263092 762795029 762285690 762275925 762046204 763278580 763571930 764850769 764892883 763544998 764073715
1870.9G64073715L93982N4703o68564M20303K17362O39572Q12759K04087L28903k10190
$$ 764073715 764467697 764522400 763853836 764274139 764491501 765131073 765943832 766147919 766476822 766266632
1880.6G66266632J23596p93152j82647j7853M67148J355362L82003J019822J9455j443863
$$ 766266632 766390228 765597076 765414429 765396576 765863724 767219086 767601089 768620911 768640366 767196503
1890.2G67196503o95038J59759k2735M93545J069260l19290Q06427M54712J69906l53393
$$ 767196503 766501465 766661224 766638489 767132034 768201294 767882004 768688431 769143143 769313049 768959656
1899.8G68959656j044083k31933l67508Q20388P90329P99561O01807J0910j64643m00543
$$ 768959656 767915573 767683640 767316132 768136520 768926849 769726410 770328217 770339127 770174484 769773941
1909.5G69773941k92282q63571M75769K30942O12182P70874J24588J400528j390915
$$ 769773941 769481659 768618088 769093857 769324799 769936981 770707855 770832443 772232971 770842056
1918.2G70842056j423187K35367J71738O56280k21176k05765M52042M69513l83149
$$ 770842056 769418869 769654236 769825974 770482254 770261078 770055313 770507355 770976868 770593719
1926.8G70593719J54572k25983m52194K05460j3275Q30688L86963L79181k7313m47770
$$ 770593719 770748291 770522308 770070114 770275574 770262299 771092987 771479950 771859131 771831818 771384048
1936.5G71384048m75387n85709j52282n12238J361389Q24356r40552N08271M71267
$$ 771384048 770908661 770322952 770170670 769658432 771019821 771844177 770903625 771411896 771883163
1945.2G71883163k42462j128311o83365k04086O25000N59692K67563L02582k90451
$$ 771883163 771640701 770512390 769829025 769624939 770249939 770809631 771077194 771379776 771089325
1953.8G71089325R8801p29447n03235l50876k33612N27268N23910J045380J82419j02692
$$ 771089325 771188126 770458679 769955444 769604568 769370956 769898224 770422134 771467514 771649933 771547241
1963.5G71547241n87234o71997l52936q52356j6861N78384Q88291K08282L21884M8600
$$ 771547241 770960007 770288010 769935074 769082718 769065857 769644241 770532532 770740814 771062698 771111298
1973.1G71111298m67606k33688p68357m91943l91388O02112N87616L21350N89752r3078
$$ 771111298 770643692 770410004 769641647 769149704 768758316 769360428 769948044 770269394 770859146 770766068
1982.8G70766068k52991j090470n73806j53656J67160L37524L03879J414337M54559
$$ 770766068 770513077 769422607 768848801 768695145 768862305 769199829 769503708 770918045 771372604
1991.5G71372604p70416j121826o03180o07681n76096M04892M62113Q22906M55704
$$ 771372604 770602188 769480362 768877182 768269501 767693405 768098297 768560410 769383316 769839020
2000.1G69839020L53164n59539j184769p20673q34808M3335J30692O21337Q26493L51181
$$ 769839020 770192184 769632645 768447876 767727203 766892395 766935730 767066422 767687759 768514252 768865433
2009.8G68865433j43891m04205n50842j567078n53589L2273M58679J024551M49372
$$ 768865433 768721542 768317337 767766495 766199417 765645828 765678101 766136780 767161331 767610703
2018.5G67610703J91116k40936j2513r02099j017456m83322j52359L95507M81034P66143
$$ 767610703 767801819 767560883 767548370 766646271 765628815 765145493 764993134 765388641 765869675 766635818
2028.1G66635818J85624Q8501q64869j195831n35126m32052M3487L0442P35702M20380
$$ 766635818 766821442 766909943 766045074 764849243 764314117 763882065 763925552 763955994 764691696 765112076
2037.7G65112076L09601J24511n38559p18078j099015J3352P4921N88531O89392r003
$$ 765112076 765421677 765546188 765007629 764289551 763190536 763203888 763278809 763867340 764556732 764547729
2047.4G64547729P9880l31573j80512q30612m17404l75748k40326Q15888M96979K80914
$$ 764547729 764627609 764296036 764115524 763284912 762867508 762491760 762251434 763067322 763564301 763845215
2057G63845215k23770J44577k80686o03790o72760n13306R57489O43845L42941k73514
$$ 763845215 763621445 763766022 763485336 762881546 762208786 761695480 762652969 763296814 763639755 763366241
2066.7G63366241k5405O4849q60748p44095q74862N3100N12009O82449K70081k2660
$$ 763366241 763340836 763405685 762544937 761800842 760925980 760979080 761491089 762173538 762443619 762420959
2076.3G62420959K24228l67736k01035n25589k77710j59073M58679O71692k59628L49960
$$ 762420959 762645187 762277451 762076416 761550827 761273117 761114044 761572723 762244415 761984787 762334747
2086G62334747k15759q48236p83920l90702k05764P4920O58188L77960M04969r5749
$$ 762334747 762118988 761270752 760486832 760096130 759890366 759965286 760623474 761001434 761406403 761310654
2095.6G61310654j17798j069718r86709M25033K49329K64664l05100M97589N87921
$$ 761310654 761192856 760123138 759136429 759561462 759810791 760075455 759770355 760267944 760855865
2104.3G60855865k92587n27878p06253m32739p09381K99988J68609K95563J91422m31290
$$ 760855865 760563278 760035400 759329147 758896408 758187027 758487015 758655624 758951187 759142609 758711319
2113.9G58711319L50037m94004k2278j09939l24478J14517K3270M53796j49841J84097
$$ 758711319 759061356 758567352 758545074 758435135 758110657 758225174 758248444 758702240 758552399 758736496
2123.6G58736496l01437o40946l97415l67126J73873J98060O32629K02560L32947j00021
$$ 758736496 758435059 757794113 757396698 757029572 757203445 757401505 758034134 758236694 758569641 758469620
2133.2G58469620n41229j60828n71594j44883J68000O70929L18222J53045p705m14505
$$ 758469620 757928391 757767563 757195969 757051086 757219086 757890015 758208237 758361282 758353577 757939072
2142.9G57939072j86539m55933K66037k39105q5678M67072K06604L93447l09677j13601
$$ 757939072 757752533 757296600 757562637 757323532 757237854 757704926 757911530 758304977 757995300 757881699
2152.5G57881699k28959j35192k23313m9209M50515J20545O68487L17078J63498o00281
$$ 757881699 757652740 757517548 757294235 757245026 757695541 757816086 758484573 758801651 758965149 758364868
2162.1G58364868q53500j05438k5559K92511k34451M97360N23605q7585j01318l41721
$$ 758364868 757511368 757405930 757380371 757672882 757438431 757935791 758459396 758371811 758270493 757928772
2171.8G57928772k12708m96597K30179L41339L82462M82177K45438K04315j91116O3019
$$ 757928772 757716064 757219467 757449646 757790985 758173447 758655624 758901062 759105377 758914261 758977280
2181.4G58977280l37830q7280M4403K6550J22299O3248N36957j46485l7765k70309
$$ 758977280 758639450 758552170 758596573 758623123 758745422 758808670 759345627 759199142 759161377 758891068
2191.1G58891068k70157p8354j36795Q45337M11377J51062k03858l00293l69644m06876
$$ 758891068 758620911 758542557 758405762 759251099 759662476 759813538 759609680 759309387 758939743 758532867
2200.7G58532867L07084R5291K40936k6093K59629L01437J4572P3929n00793K441J23291
$$ 758532867 758839951 758935242 759176178 759150085 759409714 759711151 759725723 759799652 759298859 759301300 759424591
2211.3G59424591m6005k18353K15377N26734L97567J66169q98972q3771J16043k95257
$$ 759424591 759378586 759160233 759375610 759902344 760299911 760466080 759567108 759483337 759599380 759304123
2221G59304123M8370L97415M02375k48795J20011l59726l17154n2948j40763J25809
$$ 759304123 759352493 759749908 760152283 759903488 760023499 759663773 759346619 759293671 759152908 759278717
2230.6G59278717k2278L45230J26419N89981Q6899m26788q6060n66711k16980l05786
$$ 759278717 759256439 759601669 759728088 760318069 760404968 759978180 759892120 759325409 759108429 758802643
2240.3G58802643L98025O72913K90832K24381j91422j59683m58374k67639l07541j01318
$$ 758802643 759200668 759873581 760164413 760388794 760197372 760037689 759579315 759311676 759004135 758902817
2249.9G58902817M4861M35028P87277R3841j24740q46481k80991r6207j63727N85709
$$ 758902817 758947678 759382706 760169983 760263824 760139084 759292603 759011612 758915405 758751678 759337387
2259.5G59337387J92261L66363K37809N7220l56445m18015l60489l64456M8447j90735
$$ 759337387 759529648 759896011 760133820 760191040 759834595 759416580 759056091 758691635 758740082 758549347
2269.2G58549347L50876K13394N00565K63671n40313l80173n49240J10092k47040K17438
$$ 758549347 758900223 759113617 759614182 759877853 759337540 758957367 758408127 758518219 758271179 758488617
2278.8G58488617P17316L41491J8540p28607j63041l92227k88315l87420q8578N73426
$$ 758488617 759205933 759547424 759565964 758837357 758674316 758282089 757993774 757606354 757517776 758091202
2288.5G58091202L04947P34024j43357k31704o16684p43637l2120k03476L94058r9182
$$ 758091202 758396149 759130173 758986816 758755112 758138428 757394791 757362671 757159195 757553253 757454071
2298.1G57454071O5994L52555O51855M02222n57785l07465o51703J0834l0746M3563
$$ 757454071 757520065 757872620 758524475 758926697 758368912 758061447 757409744 757420578 757389832 757433395
2307.8G57433395O38276O03790K96631q99430j83792l76968n71060N3711K76413N53360
$$ 757433395 758071671 758675461 758972092 758072662 757888870 757511902 756940842 756994553 757270966 757824326
2317.4G57824326J57699N75180J97220J35803p02667r00116k27585m06112P06481N54429
$$ 757824326 757982025 758557205 758754425 758890228 758187561 757287445 757059860 756653748 757360229 757914658
2327.1G57914658N36117Q4458L8757l35770o05011l68881j125641Q64029J016083N38330
$$ 757914658 758450775 758535233 758573990 758238220 757633209 757264328 756138687 757002716 758018799 758557129
2336.7G58557129n79987j324081p9498J82418J149064j46637j248169j009217J2055
$$ 758557129 757977142 756653061 756573563 756755981 757905045 757758408 756510239 755501022 755513077
2345.4G55513077N42984n60913j160126L1357J680832L11966j59226q3999N11016J039277
$$ 755513077 756056061 755495148 754335022 754366379 756047211 756359177 756199951 756115952 756626968 757666245
2355G57666245r24988J315536n15671j120681p95060o89239N40543n36881J447525
$$ 757666245 756741257 758056793 757541122 756420441 755625381 754936142 755476685 754939804 756387329
2363.7G56387329k16675p16400r01947M42047L89099j981964j96228j246948o64139
$$ 756387329 756170654 755454254 754552307 754994354 755383453 753401489 753205261 751958313 751294174
2372.4G51294174J67237j35575p6675n23224l35693n83115k11868p41425k43988J0300
$$ 751294174 751461411 751325836 751249161 750725937 750390244 749807129 749595261 748853836 748609848 748620148
2382G48620148l43399J14669n79223m26254n18723n83572l22876l02506k4566j7472
$$ 748620148 748276749 748391418 747812195 747385941 746867218 746283646 745960770 745658264 745633698 745616226
2391.7G45616226J33896l16009j9608j72501m34265j58844l89099R7275L0518j61133
$$ 745616226 745750122 745434113 745414505 745242004 744807739 744648895 744259796 744357071 744387589 744226456
2401.3G44226456l29743o9732j24436n63202l93448p09838l67203o2943K20337l4942
$$ 744226456 743896713 743826981 743702545 743139343 742745895 742036057 741668854 741605911 741826248 741791306
2410.9G41791306k50016J45417j94016k41241m91181m33349m03443R7275R6054p66525
$$ 741791306 741541290 741686707 741492691 741251450 740760269 740326920 739923477 740020752 740116806 739350281
2420.6G39350281m19083l73230n0201j47248j68991k25830o52389r3308M730J24512
$$ 739350281 738931198 738557968 738507767 738360519 738191528 737965698 737313309 737220001 737224731 737349243
2430.2G37349243m76684n78232k23236o19812o05469m35867q7052j86996k899k92740
$$ 737349243 736872559 736294327 736071091 735451279 734845810 734409943 734322891 734135895 734132996 733840256
2439.9G33840256k11792K5024n53665m06189n51758k96936l80707m57Q9798n97763
$$ 733840256 733628464 733653488 733099823 732693634 732141876 731844940 731464233 731463776 731553574 730955811
2449.5G30955811o0196k72293k34223l64609l60260n03006p53250J73569P0496j03226
$$ 730955811 730895615 730623322 730389099 730024490 729664230 729161224 728407974 728581543 728652039 728548813
2459.2G28548813m54483k83203l70331q44879l88184m89502p1258K4414j7624m44565
$$ 728548813 728094330 727811127 727440796 726595917 726207733 725718231 725646973 725671387 725653763 725209198
2468.8G25209198o74744j10016k80990m19693r36127n36499l46985n02395o3935j74560
$$ 725209198 724534454 724424438 724143448 723723755 722787628 722251129 721904144 721401749 721337814 721163254
2478.5G21163254j15204k81067j85013o27212o63452l44849n74341m6539q3542l07312
$$ 721163254 721048050 720766983 720581970 719954758 719291306 718946457 718372116 718325577 718242035 717934723
2488.1G17934723m54788j83487k56272o31332k66647n45960o24618m80805m19769k62222
$$ 717934723 717479935 717296448 717040176 716408844 716142197 715596237 714971619 714490814 714071045 713808823
2497.7G13808823P6599k20948r67407o79931l43247l18146n10940k98996l08533l31192
$$ 713808823 713885422 713664474 712697067 712017136 711673889 711355743 710844803 710545807 710237274 709906082
2507.4G09906082j81198m54483l64914n03540j90582l37601l41034k01645m21142J87301
$$ 709906082 709724884 709270401 708905487 708401947 708211365 707873764 707532730 707331085 706909943 707097244
2517G07097244m26788o30570o11114n09567m120n22919m05884m01230k76031l65219
$$ 707097244 706670456 706039886 705428772 704919205 704915085 704392166 703986282 703585052 703309021 702943802
2526.7G02943802m38309k74277o94580m67071j02921O3172m63562n46799l80173m89425
$$ 702943802 702505493 702231216 701536636 701069565 700966644 701029816 700566254 700019455 699639282 699149857
2536.3F99149857l34549m05426k4338m10309p22351n61524j94625Q6975m05350l28369
$$ 699149857 698815308 698409882 698385544 697975235 697252884 696691360 696496735 696583710 696178360 695849991
2546F95849991n73731n32684l49350m01153j56785j8768j55868o62156l45077l60184
$$ 695849991 695276260 694743576 694394226 693993073 693836288 693817520 693661652 692999496 692654419 692294235
2555.6F92294235j78299j87149r67178o33774j69830R0866l71246l40119m6310n64118
$$ 692294235 692115936 691928787 690961609 690327835 690158005 690248871 689877625 689537506 689491196 688927078
2565.2F88927078l78494l45535n41687n04761o44913p80716Q2321N06745j82266m79432
$$ 688927078 688548584 688203049 687661362 687156601 686511688 685730972 685813293 686320038 686137772 685658340
2574.9F85658340n36575k58026n38101n44434k23236k26593j15204m06418n53741o61469
$$ 685658340 685121765 684863739 684325638 683781204 683557968 683331375 683216171 682809753 682256012 681594543
2584.5F81594543l62167m46014n87845l48892j92948J44272l94668l85132l06244n70908
$$ 681594543 681232376 680786362 680198517 679849625 679656677 679800949 679406281 679021149 678714905 678143997
2594.2F78143997o73141m88434J92489j57470m37470q21914o03180N3100l83835n42678
$$ 678143997 677470856 676982422 677174911 677017441 676579971 675758057 675154877 675207977 674824142 674281464
2603.8F74281464l72391m63715q53576l77198m03366m22363L0212o17294n77774l21197
$$ 674281464 673909073 673445358 672591782 672214584 671811218 671388855 671419067 670801773 670223999 669902802
2613.5F69902802j37482p01065q52967j26190l41568j68075j58844k79312n33982n82123
$$ 669902802 669765320 669064255 668211288 668085098 667743530 667575455 667416611 667137299 666603317 666021194
2623.1F66021194p39822p47147k05993o99310m38309l51029k00729m8065n79453m12597
$$ 666021194 665281372 664534225 664328232 663628922 663190613 662839584 662638855 662590790 662011337 661598740
2632.8F61598740p36924l56750k92893o01959n18036m79507m3182l97339n01938o51703
$$ 661598740 660861816 660505066 660212173 659610214 659092178 658612671 658569489 658172150 657670212 657018509
2642.4F57018509n75333j56707m09012o79551n89599k18201k14996r8648l78342l59421
$$ 657018509 656443176 656286469 655877457 655197906 654608307 654390106 654175110 654076462 653698120 653338699
2652F53338699m56390q36105m13819n62820k17133k20794m64173j28631j36338j60064
$$ 653338699 652882309 652046204 651632385 651069565 650852432 650631638 650167465 650038834 649902496 649742432
2661.7F49742432p54319r13238n37262k68173l94364k52304j72729l89481L4866l46450
$$ 649742432 648988113 648074875 647537613 647269440 646875076 646622772 646450043 646060562 646095428 645748978
2671.3F45748978m12293k79312l47214l38974n46264j2665j5793m58374p92007k95258
$$ 645748978 645336685 645057373 644710159 644371185 643824921 643812256 643796463 643338089 642546082 642250824
2681F42250824l0060m57916k63519n17655n82657n69152k10877k8763j68915j65176
$$ 642250824 642220764 641762848 641499329 640981674 640399017 639829865 639618988 639590225 639421310 639256134
2690.6F39256134r01909n52597k4032l05405l31154R460k25563n21240k57988m17175
$$ 639256134 638354225 637801628 637777596 637472191 637141037 637150497 636924934 636403694 636145706 635728531
2700.3F35728531j26724o24848o21643M311m66919l67584k71187M7340k35519n16930
$$ 635728531 635601807 634976959 634355316 634359627 633892708 633525124 633253937 633301277 633065758 632548828
2709.9F32548828l65677n57632r2735l75596o79664l05977j18904l38402J4954K44636
$$ 632548828 632183151 631625519 631532784 631157188 630477524 630171547 630052643 629714241 629729195 629973831
2719.5F29973831n24216m75692k56195J50032K1286l59993m13552o29692k8686k94419
$$ 629973831 629449615 628973923 628717728 628867760 628889046 628529053 628115501 627485809 627457123 627162704
2729.2F27162704n19218q4419k04888n44891m77562o0463j25618P9842j58921m57534
$$ 627162704 626643486 626559067 626354179 625809288 625331726 625271263 625145645 625225487 625066566 624609032
2738.8F24609032l28598j58387j49154l40004J31492j54724j91574J41220l69758n56107
$$ 624609032 624280434 624122047 623972893 623632889 623764381 623609657 623418083 623559303 623189545 622633438
2748.5F22633438K5330N3749p76711r8152o6490q01354m29000k67296n8060j36032
$$ 622633438 622658768 622712517 621935806 621837654 621771164 620969810 620540810 620273514 620215454 620079422
2758.1F20079422m97704o22901J57508J94703l78762l25622n83458k7962l06091q53234
$$ 620079422 619581718 618958817 619116325 619311028 618932266 618606644 618023186 617995224 617689133 616835899
2767.8F16835899j74865J74102j95884m23889p9575m05693k88773l82919p32231l88527
$$ 616835899 616661034 616835136 616639252 616215363 616135788 615730095 615441322 615058403 614326172 613937645
2777.4F13937645m32625m01993m63638l47977m02794m00505n02700m09508J6098l33710
$$ 613937645 613505020 613103027 612639389 612291412 611888618 611488113 610985413 610575905 610592003 610258293
2787F10258293l13644n85633m70810m15229n89485l04146o55556m80690o26678n71442
$$ 610258293 609944649 609359016 608888206 608472977 607883492 607579346 606923790 606443100 605816422 605244980
2796.7F05244980n15671n55572l80135o81534n55916j038513o12259o35795r26171
$$ 605244980 604729309 604173737 603793602 603112068 602556152 601517639 600905380 600269585 599343414
2805.4E99343414N9052j69182k48566n44891q02650j194878j507874l45115j51215
$$ 599343414 599402466 599233284 598984718 598439827 597637177 596442299 594934425 594589310 594438095
2814E94438095q67767r79004l28446m12826p39327o43158p56568p92008r95178p04918
$$ 594438095 593570328 592591324 592262878 591850052 591110725 590467567 589710999 588918991 587923813 587218895
2823.7E87218895o87180o05735o02188q29812m69856q30574j405182j302986m14581
$$ 587218895 586531715 585925980 585323792 584493980 584024124 583193550 581788368 580485382 580070801
2832.4E80070801l99018r83772j051369j385726j001091p31164j338157j794319j352043
$$ 580070801 579671783 578688011 577636642 576250916 575249825 574518661 573180504 571386185 570034142
2841.1E70034142j115532j466217j694146j884002j842194k027550j532097j751365
$$ 570034142 568918610 567452393 565758247 563874245 562032051 560004501 558472404 556721039
2848.8E56721039k432785j945381j452141q37822q08525k63481k73133q48884k37313
$$ 556721039 554288254 552342873 550890732 550052910 549244385 548980904 548707771 547858887 547621574
2857.4E47621574j9531P4158l50113k61078k44141q62999o13098o56166p63550q59298
$$ 547621574 547602043 547676201 547326088 547065010 546820869 545957870 545344772 544688606 543925056 543065758
2867.1E43065758p93953q85277j205749r64699n25360l42980m85802m30755p19109
$$ 543065758 542271805 541386528 540180779 539216080 538690720 538347740 537861938 537431183 536712074
2875.8E36712074q43429q84476p68967l94134p04575q09173q73566o09131m57802q84666
$$ 536712074 535868645 534984169 534215202 533821068 533116493 532307320 531433754 530824623 530366821 529482155
2885.4E29482155j200867j095733n64957p66030j003112j045037p78427o30340r14460
$$ 529482155 528281288 527185555 526620598 525854568 524851456 523806419 523027992 522397652 521483192
2894.1E21483192o58798o58226r71985j286621r11827o94885p08122o30951q56514
$$ 521483192 520824394 520166168 519194183 517907562 516995735 516300850 515592728 514961777 514105263
2902.8E14105263n28641q28629n93223n93147j181755r14689j334228j327705j092873
$$ 514105263 513576622 512747993 512154770 511561623 510379868 509465179 508130951 506803246 505710373
2911.4E05710373o71043p40700j635247j821441j596298q85697j317673j609573p73163
$$ 505710373 505039330 504298630 502663383 500841942 499245644 498359947 497042274 495432701 494659538
2920.1D94659538o24733j065750j145172m17633m90456p04269m19006J80778P16782
$$ 494659538 494034805 492969055 491823883 491406250 490915794 490211525 489792519 489973297 490690079
2928.8D90690079L76510k51655m87862K95983O78367L99933p9803K23426J036606P32346
$$ 490690079 491066589 490814934 490327072 490623055 491301422 491701355 491621552 491844978 492881584 493613930
2938.5D93613930N82809L47672O31561Q17070K85072O10733Q43125M78325J8158O81991
$$ 493613930 494196739 494544411 495175972 495993042 496278114 496888847 497731972 498210297 498228455 498910446
2948.1D98910446J104012O08253L96118M25530P63817L21731K00691J24665j6327O06804
$$ 498910446 500014458 500622711 501018829 501444359 502208176 502529907 502730598 502855263 502838936 503445740
2957.7E03445740N79567O08406O97899P40013N71213K35481K34680N2376N64880J217842
$$ 503445740 504025307 504633713 505331612 506071625 506642838 506878319 507112999 507165375 507730255 508948097
2967.4E08948097R84078O72493N74264M67148L73840M04854P82433O54564J95770O64101
$$ 508948097 509932175 510604668 511178932 511646080 512019920 512424774 513207207 513861771 514057541 514721642
2977E14721642Q98666L29323j59340K27165N64117P1831j72157N7220N44320N01861
$$ 514721642 515620308 515949631 515790291 516017456 516581573 516653404 516481247 516538467 517082787 517584648
2986.7E17584648L26920J27945J3694J32294j16806J19782j1292k92511m20380j83219
$$ 517584648 517911568 518039513 518053207 518185501 518068695 518188477 518177185 517884674 517464294 517281075
2996.3E17281075K96516l17040l53164l78762o24694o15845n10330L6583k15988m82674
$$ 517281075 517577591 517260551 516907387 516528625 515903931 515288086 514777756 514814339 514598351 514115677
3006E14115677o00090n27725m98238q69980o44798l56674l81165l85818n7679o28967
$$ 514115677 513515587 512987862 512489624 511619644 510974846 510618172 510237007 509851189 509793510 509164543
3015.6E09164543j205902p09915o45523n42069l58200n48439r76600r07555o15234
$$ 509164543 507958641 507248726 506603203 506061134 505702934 505154495 504177895 503270340 502655106
3024.3E02655106o24733p36657q44650p00035q53462n37338n19524p95975m74205m93316
$$ 502655106 502030373 501293716 500449066 499749031 498895569 498358231 497838707 497042732 496568527 496075211
3033.9D96075211p70722j366196j110572r66072o64826p0915r68819j073456p74459
$$ 496075211 495304489 493938293 492827721 491861649 491196823 491125908 490157089 489083633 488309174
3042.6D88309174o25153o29463j147003q54836o63986j021271j370354q59603l83912
$$ 488309174 487684021 487054558 485907555 485052719 484388733 483367462 481997108 481137505 480753593
3051.3D80753593q78105q17718l39203o05736q13141q69789j110115o88820q16345
$$ 480753593 479875488 479057770 478718567 478112831 477299690 476429901 475319786 474630966 473814621
3060D73814621q64525m87060n63202n25055p48787l94859p82662j152458q27065j289138
$$ 473814621 472950096 472463036 471899834 471374779 470625992 470231133 469448471 468296013 467468948 466179810
3069.6D66179810p04995l31268n57327o02150m43077p44667j506768m75502K19460
$$ 466179810 465474815 465143547 464586220 463984070 463540993 462796326 461289558 460814056 461033516
3078.3D61033516l59993p91779o75048o55556q29735o48804j112938r79080q48083
$$ 461033516 460673523 459881744 459206696 458551140 457721405 457072601 455959663 454980583 454132500
3087D54132500o01044j71585p53975m35181m28085r65614j031914p74307n11856p43409
$$ 454132500 453531456 453359871 452605896 452170715 451742630 450777016 449745102 448970795 448458939 447715530
3096.6D47715530n20210m81834l61786o65093j340637q43582q61664q40225k61307
$$ 447715530 447195320 446713486 446351700 445686607 444345970 443502388 442640724 441800499 441539192
3105.3D41539192p65266r58557l31002m63256p07703q88138j117973o36368k48222
$$ 441539192 440773926 439815369 439484367 439021111 438313408 437425270 436307297 435670929 435422707
3114D35422707m35639j020126j171417n04380k86979p39327r21783r30672j182671
$$ 435422707 434987068 433966942 432795525 432291145 432004166 431264839 430343056 429412384 428229713
3122.6D28229713j021690l50189j89743r82323j136169n35088m42581q07304j378098
$$ 428229713 427208023 426857834 426668091 425685768 424549599 424014511 423571930 422764626 421386528
3131.3D21386528j120453p74155n26428k96478q13446j013832q42133l51677p05948
$$ 421386528 420266075 419491920 418965492 418669014 417855568 416841736 415999603 415647926 414941978
3140D14941978r76333m02947j089058j234626q10051p55158o19964p91512o02989k66342
$$ 414941978 413965645 413562698 412473640 411239014 410428963 409673805 409053841 408262329 407659340 407392998
3149.6D07392998n07164r66759r18922r03054q21190r30214j141128o58569o90689
$$ 407392998 406885834 405919075 405000153 404097099 403275909 402345695 401204567 400545998 399855309
3158.3C99855309q90007j171990j211471n95360m06113n30815p51991p26700q55141
$$ 399855309 398965302 397793312 396581841 395986481 395580368 395049553 394297562 393570862 392715721
3167C92715721q16803o26793p89680p71828j063156j140251p16858o19431r74121r23958
$$ 392715721 391898918 391272125 390482445 389710617 388647461 387507210 386790352 386170921 385196800 384272842
3176.6C84272842o74018q21534q05015q14018q62351j139755r04503l32642l47175
$$ 384272842 383598824 382777290 381972275 381158257 380295906 379156151 378251648 377919006 377571831
3185.3C77571831l86238p78199j118202r31854n40276p67326q35457o93435j023484
$$ 377571831 377185593 376407394 375289192 374357338 373817062 373049736 372214279 371520844 370497360
3194C70497360l88679n77774j207657q64411n96733j58729k69013p28721j057854o13136
$$ 370497360 370108681 369530907 368323250 367458839 366862106 366703377 366434364 365705643 364647789 364034653
3203.6C64034653l05672q71048p70340p08275q31947o97670n65453o69822m55437k38113
$$ 364034653 363728981 362857933 362087593 361379318 360547371 359849701 359284248 358614426 358158989 357920876
3213.3C57920876p48215q44193r45549q93516k65961j90086p38030o46934l13835p14341
$$ 357920876 357172661 356328468 355382919 354489403 354223442 354033356 353295326 352648392 352334557 351620216
3222.9C51620216o68144n89905o36062o83861p51305o69136q64334n24826l63731j68114
$$ 351620216 350952072 350362167 349726105 349042244 348290939 347621803 346757469 346232643 345868912 345700798
3232.6C45700798j56975n91430n60799q95271r30939q05130n65834k68250m80690n08117
$$ 345700798 345543823 344952393 344391594 343496323 342565384 341760254 341194420 340926170 340445480 339937363
3242.2C39937363l30849l74603o86417k01073k70729p06062n00259q39005q15124n52941
$$ 339937363 339606514 339231911 338545494 338344421 338073692 337367630 336867371 336028366 335213242 334660301
3251.9C34660301j86310j39083p93152r11866l99246l54996q51745m86603k96364l87459
$$ 334660301 334473991 334334908 333541756 332629890 332230644 331875648 331023903 330537300 330240936 329853477
3261.5C29853477o58950p32117k93350m55246J47362j17188p44972m66385l94096j21270
$$ 329853477 329194527 328462410 328169060 327713814 327861176 327743988 326999016 326532631 326138535 326017265
3271.2C26017265p53212l96461p8316q96263m28848r4681l09105p02324n27649k25754
$$ 326017265 325264053 324867592 324789276 323893013 323464165 323369484 323060379 322358055 321830406 321604652
3280.8C21604652m50592m23584k40249J08070j31302m82006o90117r04064o81953k05689
$$ 321604652 321154060 320730476 320490227 320598297 320466995 319984989 319294872 318390808 317708855 317503166
3290.4C17503166j36070m96635k08169m11777l55606J69544n47180p35512j69620M1370
$$ 317503166 317367096 316870461 316662292 316250515 315894909 316064453 315517273 314781761 314612141 314653511
3300.1C14653511m51622p92179k16637n0659k05192n94044r49936m46625j27277j80893
$$ 314653511 314201889 313409710 313193073 313142414 312937222 312343178 311393242 310946617 310819340 310638447
3309.7C10638447j83907n61199p25975n95474l02830L4065k43911n68943r92585r81826
$$ 310638447 310454540 309893341 309167366 308571892 308269062 308303127 308059216 307490273 306497688 305515862
3319.4C05515862l77713k44941k01645n50919o69422m87804o63567m09927n37587q57391
$$ 305515862 305138149 304893208 304691563 304140644 303471222 302983418 302319851 301909924 301372337 300514946
3329C00514946m79717n44281r39122o10675p60250p51324L20511O9923q56552j122417
$$ 300514946 300035229 299490948 298551826 297941151 297180901 296429577 296750088 296820011 295963459 294841042
3338.7B94841042r26838m25072m09908m82006n09053n80864q89988r87186m89044k33860
$$ 294841042 293914204 293489132 293079224 292597218 292088165 291507301 290617313 289630127 289141083 288907223
3348.3B88907223j11695j09443l63140o78101m36230j02329m06017o11363o65531k99129
$$ 288907223 288795528 288686085 288322945 287644844 287208614 287106285 286700268 286088905 285423374 285124245
3357.9B85124245J7452m79927o86951l77922k81277L9959r0942o21090j9207k90565
$$ 285124245 285141697 284661770 283974819 283596897 283315620 283355579 283264637 282643547 282624340 282333775
3367.6B82333775p86915q5831j46046l44352m83837j92757r594m63619j90201n11799
$$ 282333775 281546860 281461029 281314983 280970631 280486794 280294037 280284443 279820824 279630623 279118824
3377.2B79118824m45938K54288l9864k42348m67682m72488j58825m08020m55933K23790
$$ 279118824 278672886 278927174 278887310 278644962 278177280 277704792 277545967 277137947 276682014 276905804
3386.9B76905804L29437k16427r1648m0569k76223k67067k26535j58501j80511K31018
$$ 276905804 277235241 277018814 276927166 276886597 276610374 276343307 276116772 275958271 275777760 276008778
3396.5B76008778J88427m77295m44985j08070M88338J73798r61018m77657N62840K05211
$$ 276008778 276197205 275719910 275274925 275166855 275655193 275828991 274867973 274390316 274953156 275158367
3406.2B75158367k11391K15301K75994j00365m23069n7583M31404j84917n0469L54691
$$ 275158367 274946976 275162277 275438271 275337906 274914837 274857254 275288658 275103741 275053272 275407963
3415.8B75407963o0196O6967L37276N53131L29648m17653l43914L92971N53456L39088
$$ 275407963 275347767 275414734 275752010 276305141 276634789 276217136 275873222 276266193 276819649 277158737
3425.5B77158737L65505j8711J965O96564N81836k08206L6812O42891L45306K38285
$$ 277158737 277524242 277505531 277507496 278204060 278785896 278577690 278614502 279257393 279602699 279840984
3435.1B79840984K16236M18034K29588L11050J024971L14903p7514j66760M10500J159591
$$ 279840984 280057220 280475254 280704842 281015892 282040863 282355766 282278252 282111492 282521992 283681583
3444.7B83681583Q80337J016903j61953k07233P43808O50711P12357J54953L72505
$$ 283681583 284561920 285578823 285416870 285209637 285953445 286604156 287316513 287471466 287843971
3453.4B87843971P03659P94449J082878N32704J30157L54290R63135J039123P84245
$$ 287843971 288547630 289342079 290424957 290957661 291087818 291442108 292405243 293444366 294228611
3462.1B94228611N56450O21796O14261M86813Q82511P21550O21567L87745K37178M13533
$$ 294228611 294785061 295406857 296021118 296507931 297390442 298111992 298733559 299121304 299358482 299772015
3471.7B99772015O69441J334457R11808N45368O25134P82452J199932J351432J031781
$$ 299772015 300441456 301775913 302687721 303233089 303858223 304640675 305840607 307192039 308223820
3480.4C08223820L78532M02870K4090P34253J653977Q64696Q33664J178760R09863
$$ 308223820 308602352 309005222 309029312 309763565 311417542 312282238 313115902 314294662 315204525
3489.1C15204525O38027J003456J069699Q22506Q21151O62346J012459R63669Q34656
$$ 315204525 315842552 316846008 317915707 318738213 319559364 320221710 321234169 322197838 323032494
3497.8C23032494M73098M58870J273766J484299J412811P06291M94614Q21190J034164
$$ 323032494 323505592 323964462 325238228 326722527 328135338 328841629 329336243 330157433 331191597
3506.5C31191597J071892J432266J380844M09279J113701P80525N54047J147957J092567
$$ 331191597 332263489 333695755 335076599 335485878 336599579 337380104 337934151 339082108 340174675
3515.1C40174675J267357O08101R88121J436729J322975J417733J469459J242981J96343
$$ 340174675 341442032 342050133 343038254 344474983 345797958 347215691 348685150 349928131 350124474
3523.8C50124474J098671J374588J198730J307411P29256J050491J301384J465454
$$ 350124474 351223145 352597733 353796463 355103874 355833130 356883621 358185005 359650459
3531.5C59650459J256867J282692J368141J635399Q04634K43492J903191J402587J405373
$$ 359650459 360907326 362190018 363558159 365193558 365998192 366241684 368144875 369547462 370952835
3540.2C70952835J768417J404000J630935J863099J676063L36075R65042P46880J684112
$$ 370952835 372721252 374125252 375756187 377619286 379295349 379631424 380596466 381343346 383027458
3548.9C83027458K540589K051429K169876m5166J131745J575737J390724J965713P33796
$$ 383027458 385568047 387619476 389789352 389744186 390875931 392451668 393842392 395808105 396541901
3557.6C96541901K311859K539520J649551J093331K025070J890373P80106M005775
$$ 396541901 398853760 401393280 403042831 404136162 406161232 408051605 408831711 412837486
3565.3D12837486K298661P42683R67026m26331K995262K225609J550598K289963K464943
$$ 412837486 415136147 415878830 416845856 416419525 419414787 421640396 423190994 425480957 427945900
3574D27945900J317368J412887K476158J084633K637940K865409J416245J337738J853027
$$ 427945900 429263268 430676155 433152313 434236946 436874886 439740295 441156540 442494278 444347305
3582.6D44347305K241021J433525L814315K586441L47023K933503K97584J944657L003959
$$ 444347305 446588326 448021851 451836166 454422607 454769630 457703133 458000717 459945374 462949333
3591.3D62949333L406296K272263J062812L243752L40805J954460L975639J683846
$$ 462949333 466355629 468627892 469690704 472934456 473275261 475229721 479205360 480889206
3599D80889206K580414J956062J510315K312202K465249K439193K762375L399964J213455
$$ 480889206 483469620 485425682 486935997 489248199 491713448 494152641 496915016 500314980 501528435
3607.7E01528435L488121P85332m62533O753159L327408m73633L770752Q29735L719749
$$ 501528435 505016556 505801888 505339355 512092514 515419922 514946289 518717041 519546776 523266525
3616.4E23266525M336319J421700L080177R35555R86137K925758K344475K536354L744011
$$ 523266525 527602844 529024544 532104721 533040276 534026413 536952171 539296646 541833000 545577011
3625.1E45577011K988892K825088O442375K831688o487426L273086M349098N158577
$$ 545577011 548565903 551390991 557833366 560665054 554177628 557450714 561799812 566958389
3632.8E66958389L048058n04837K676430L772964K937851J398544K262192L565712
$$ 566958389 570006447 569501610 572178040 575951004 578888855 580287399 582549591 586115303
3640.5E86115303K358513K069626K351799L079567M121513N124550N88341o31066O305848
$$ 586115303 588473816 590543442 592895241 595974808 600096321 605220871 605809212 605178146 611483994
3649.2F11483994O89277j770363L64151L908806M639931M774856N814057m703522M22516
$$ 611483994 612173271 610402908 610767059 614675865 619315796 624090652 629904709 625201187 625623703
3657.9F25623703M454994J902390K166710J286201K795372J860428J753311J774674
$$ 625623703 630078697 631981087 634147797 635433998 638229370 640089798 641843109 643617783
3665.6F43617783N54428M759369M431610K346420R35364p177429J300811P074967Q122253
$$ 643617783 644172211 648931580 653363190 655709610 656644974 649467545 650768356 657843323 665965576
3674.3F65965576K019959j1578904k14920N665207M462052j521454N29022K844315
$$ 665965576 667985535 656406631 656191711 661856918 666318970 664797516 665326538 668170853
3682F68170853J995163J055069K58102J026535L647766O584854m227752k907715P246094
$$ 668170853 670166016 671221085 671479187 672505722 676153488 682738342 678510590 675602875 682848969
3690.6F82848969n059128j752625M558563Q79136J225204K34909l42636J430588J512375
$$ 682848969 677789841 676037216 680595779 681474915 682700119 682935028 682592392 684022980 685535355
3699.3F85535355L082733K623520m617462k654419L715133J854248L26844M16870K628555
$$ 685535355 688618088 691241608 686624146 683969727 687684860 689539108 689865952 690282822 692911377
3708F92911377M062424n934067L193817N673599j0869598L170700L917770m82177K28805
$$ 692911377 696973801 691039734 694233551 699907150 689037552 692208252 696126022 695643845 695872650
3716.7F95872650K265167J960755k692108M79812N548935j518707m925919L769379
$$ 695872650 698137817 700098572 697406464 697886276 703435211 701916504 696990585 700759964
3724.4G00759964K030563n05905k507934p14112K850952J548768N885925q64945p746887
$$ 700759964 702790527 702284622 699776688 699062576 701913528 703462296 709348221 708483276 700736389
3733.1G00736389P447586K623444q200150m53567L021087J48774P54165L232575k673264
$$ 700736389 708183975 710807419 702607269 702153702 705174789 705323563 706077728 709310303 706637039
3741.8G06637039J534882J1173477n048294j7811508P584381M874878N820999j192627
$$ 706637039 708171921 719345398 714297104 696485596 704069977 708944855 714765854 713573227
3749.5G13573227r354477J0342560l646622q299713L819733K927017L435440l489456
$$ 713573227 704218750 714561310 710914688 702614975 706434708 709361725 712797165 709307709
3757.2G09307709K127609N340500o496353k211991L644333J547928m66690K833710
$$ 709307709 711435318 716775818 710279465 708067474 711711807 713259735 712793045 715626755
3764.9G15626755j716309m122848L285141M782486M76532q617249J446991L030243
$$ 715626755 713910446 709787598 713072739 717855225 718331757 709714508 711161499 714191742
3772.6G14191742j05743P40432o28128M94309M63867K959442K94952p109451K506485
$$ 714191742 714085999 714826431 714198303 714692612 715156479 718115921 718410873 711301422 713807907
3781.3G13807907K995834J242371J415100k464294j890793k30408J036301J543655
$$ 713807907 716803741 718046112 719461212 716996918 715106125 714875717 715912018 717455673
3789G17455673k7008p02591n19180N79758O05774J212616K458877l058929k965012
$$ 717455673 717428665 716726074 716206894 716786652 717392426 718605042 721063919 718004990 715039978
3797.7G15039978K460022L310394O382675l980636j1935654L246002K408753M392090
$$ 715039978 717500000 720810394 727193069 723212433 711276779 714522781 716931534 721323624
3805.4G21323624N718307q139419m642411L614045J511001m95682K34375N67627J142426
$$ 721323624 727041931 718902512 714260101 717874146 719385147 718889465 719123840 719691467 720833893
3814.1G20833893N174713J27716j2524643L309174N029297L921051K677764j4415359
$$ 720833893 726008606 726136322 713611679 716920853 721950150 725871201 728548965 714133606
3821.8G14133606O3171M331818J334991K205887K48108l058472j55868J406555L067703
$$ 714133606 714196777 718528595 719863586 722069473 722317581 719259109 719103241 720509796 723577499
3830.5G23577499J775895p431946J673813O905365m894104p81632P370758p429962
$$ 723577499 725353394 717921448 719595261 726500626 721606522 720824890 728195648 720765686
3838.2G20765686l483810P771072m268875k487564N737762l03802l974457R98001P37686
$$ 720765686 717281876 725052948 720784073 718296509 724034271 723730469 719756012 720754013 721491699
3846.9G21491699j72348J715775J84860J627426M379349l445358M117965j1437835
$$ 721491699 721319351 723035126 723219986 724847412 729226761 725781403 729899368 718461533
3854.6G18461533l924790P717896p17545j732407J755906K016601K431717m203033
$$ 718461533 714536743 722254639 721537094 719804687 721560593 723577194 726008911 721805878
3862.3G21805878P92694N979309n789108n796662L220673N125503O323624m915771
$$ 721805878 722598572 728577881 722788773 716992111 720212784 725338287 731661911 726746140
3870G26746140q916474J908341M910507L454513q161468n46799K452850n80749K427368
$$ 726746140 717829666 719738007 724648514 728103027 719941559 719394760 721847610 721266861 723694229
3878.7G23694229M125595l804092o448975M422608J063232O88095M378891j0613327
$$ 723694229 727819824 724015732 717566757 721989365 723052597 723740692 728119583 717506256
3886.4G17506256Q62885L346634j59150M307404N29022o580505O38199K556762j297836
$$ 717506256 718369141 721715775 721556625 725864029 726393051 719812546 720450745 723007507 721709671
3895.1G21709671N37720Q57162K307587K332840q713150L745880K371597m886627L942413
$$ 721709671 722247391 723104553 725412140 727744980 719031830 722777710 725149307 720262680 724205093
3903.8G24205093k572860j489487P76138O10962J300659o49871L42025L73917J24435
$$ 724205093 721632233 720142746 720918884 721529846 722830505 722180634 722522659 722896576 723021011
3912.5G23021011o65435k41547J625824J948242k517319l527679L150253k03781k782745
$$ 723021011 722355576 722114029 723739853 725688095 723170776 719643097 722793350 722589569 719806824
3921.1G19806824K075500J478653J516571j563110l761826L95966J414719J206817
$$ 719806824 721882324 723360977 724877548 723314438 719552612 719948578 721363297 722570114
3928.8G22570114k9449K98309J481705k377701j735153J478271K29340M3564k36817
$$ 722570114 722540665 722838974 724320679 721942978 720207825 721686096 721915436 721959000 721722183
3937.5G21722183q11691J74713L00446K055130J684494l260956r89990Q34808L05939
$$ 721722183 720910492 721085205 721385651 723440781 725125275 721864319 720874329 721709137 722015076
3946.2G22015076J112137j561432m95911M79889j082764J419907M82025p10678l41034
$$ 722015076 723127213 721565781 721069870 721549759 720466995 721886902 722368927 721658249 721317215
3954.9G21317215n48172L1357j64719L57590m62418J12152J060486q59985n02701K79694
$$ 721317215 720769043 720800400 720635681 720993271 720530853 720643005 721703491 720843506 720340805 720620499
3964.5G20620499L62167O42014M31823j40075o32706k15683J19629m28620l2424P63626
$$ 720620499 720982666 721624680 722056503 721916428 721283722 721068039 721187668 720759048 720726624 721490250
3974.2G21490250l92151q54721j24207L67355L75748J45035J68991K15225M19007n23835
$$ 721490250 721098099 720243378 720119171 720486526 720862274 721007309 721176300 721391525 721810532 721286697
3983.8G21286697N1499O92673m00620l34778l357J165390K54669j340332l82232M27475
$$ 721286697 721338196 722030869 721630249 721295471 721292114 722457504 722712173 721371841 720989609 721417084
3993.5G21417084L75747p63778j35041M67225N1117J08184j83792
$$ 721417084 721792831 721029053 720894012 721361237 721412354 721520538 721336746
4000.2G21336746
$$ 721336746
##END=$$ End of the data block
