##TITLE=$$ Begin of the data block
##JCAMP-DX=5.00 $$ ACD/SpecManager v 10.08
##SPECTROMETER/DATA SYSTEM=Varian
##DATE=14 Jan 2013 10:31:38
##DATA TYPE=INFRARED SPECTRUM
##DATA CLASS=XYDATA
##ORIGIN=
##OWNER=
##NPOINTS=3735
##FIRSTX=399.26403809
##LASTX=4000.35498047
##MAXX=4000.35498047
##MINX=399.26403809
##MAXY=77.32235718
##MINY=27.51078987
##XFACTOR=1.0000000000
##YFACTOR=0.000000100000000
##FIRSTY=50.60036087
##DELTAX=0.96440572
##XUNITS=1/CM
##YUNITS=TRANSMITTANCE
##XYDATA=(X++(Y..Y))
399.3E06003609J68113n551605j352005P331658M242706p389221n595665k575722m797020
407.9D90484848j493187Q999214L834267K80800Q866195l47862p464599l313866j281395
416.6D98564415K670670r98841j1228561L499260M080658M059372M441414n297776
424.3D99790611k535591j114311l540306L880920N305405K518234n359306n247345
432.1D93698311K003670J16844j698570m885369J411858M899406J651726L003807J189079
440.7E01390762j437683n205498m035530R41697M041137j621208j247024P285842K693253
449.4E02805748K577286k08588p154083o292458m599228L20244L863144R928475O492614
458.1E07733154p238655n752411q247299m694672J518059N145455J435012r3116L638191
$$ plain form
399.3 506003609 506171722 500620117 499268112 506599770 510842476 503453255 497857590 495281868 490484848
407.9 490484848 488991661 497990875 501825142 502105942 510972137 510624275 503159676 499845810 498564415
416.6 498564415 501235085 500236244 489007683 492506943 496587601 500646973 505088387 499790611
424.3 499790611 497255020 496140709 492600403 496481323 501786728 504304962 498945656 493698311
432.1 493698311 495701981 495818825 494120255 489234886 490646744 495546150 497197876 500201683 501390762
440.7 501390762 499953079 494747581 490712051 491653748 495694885 494073677 492826653 500112495 502805748
449.4 502805748 505383034 505174446 498020363 491727905 487128677 487448921 491312065 501240540 507733154
458.1 507733154 500494499 494742088 486494789 481800117 483318176 488463631 489898643 489805527 493443718
466.8D93443718j037064m111023l425483j557122O524k24457L143005l52516l353996
475.5D82531586J687126j904373n505028L736763P45773p272033l45879M625740K468529
484.1D80768204L302726j4038m377365k364692l425179J108055N377274K367630K368698
492.8D85111313j007614k725411j634598k648468j351852l82423l45917J447525M113769
501.5D80576324J786461k789879n032539m811554K25182J90620j23367M21982j382790
510.2D69060440J274338L350715N12085j770248l113632l046036p88498O18057K61307
518.9D66358528J230812R60121k555275j994018j97220k329063j423150k17552J408081
527.5D61241264M309578L452530N913l235893m313050m174881k891235o63261J080589
$$ plain form
466.8 493443718 492406654 488295631 484870148 483313026 483319550 483095093 486238098 485885582 482531586
475.5 482531586 484218712 482314339 476809311 480546074 481291847 474019814 473673935 478299675 480768204
484.1 480768204 484070930 484056892 479679527 477314835 473889656 474997711 480374985 482742615 485111313
492.8 485111313 484103699 481378288 479743690 477095222 475743370 475360947 475015030 476462555 480576324
501.5 480576324 482362785 479572906 474540367 469728813 469953995 470144615 470021248 470443230 469060440
510.2 469060440 470334778 473685493 474197578 472427330 469313698 466267662 465479164 466097221 466358528
518.9 466358528 467589340 468549461 465994186 464000168 463802948 461473885 460050735 459833183 461241264
527.5 461241264 465550842 469003372 469009285 465773392 461460342 457285461 454394226 453730965 454811554
536.2D54811554M123955N041504J081161j435356k043571l975678k728043j510276
543.9D53365250l65143K340355K025108J689262m47502j652679j583786j871147j667595
552.6D51832123k699204q03070R91669K135925K207031J112290r00765m242439l006515
561.3D46627045o79627J429100J603813J638718L122902J932297n84336m121933l083534
570D47884445j193237j535454J229477K157745J675568J355438J194878j202812l210640
578.6D48355408j709328j565399j410027Q30880K481575K313690L042183P63244k834854
587.3D50267372j833992p55653k04544J82113R87244K096100K678833J630630n36461
596D54511642j475791k942811j501922j54953P96814K459831J443214Q16346j439553
$$ plain form
536.2 454811554 458935509 463977013 465058174 463622818 461579247 457603569 454875526 453365250
543.9 453365250 453000107 455340462 457365570 459054832 458607330 456954651 455370865 453499718 451832123
552.6 451832123 449132919 448329849 449321518 451457443 453664474 454776764 453875999 449633560 446627045
561.3 446627045 445947418 447376518 448980331 450619049 453741951 455674248 455089912 450967979 447884445
570 447884445 446691208 445155754 446385231 448542976 450218544 451573982 452768860 451566048 448355408
578.6 448355408 446646080 445080681 443670654 444501534 446983109 449296799 452338982 453102226 450267372
587.3 450267372 448433380 447677727 447473183 447655296 448642540 450738640 453417473 455048103 454511642
596 454511642 453035851 450093040 448591118 448436165 449232979 451692810 453136024 453952370 452512817
604.7D52512817k163429j621895k484474r09653O65818J766777R13124j71280m19502
613.4D48088303j460343j547279j889420k697410q91381L510209L320007P22313M40483
622D47595482L29285j21499r09500k21252J126060J878624K821694L001442K399254
630.7D57899590J353759P42684L78723o77185j135178M16184L104438M267731L148041
639.4D69498787K323837N54276j005936J02387M93583J42212R96475K500229L294983
648.1D78900833K465935J643600n684k078590k132606r43222Q44879K341880K818222
656.8D83855247J890183J198196K37236k572174m065513l056526m88511J023140K225418
665.4D80246696L447075K256508J82076J39160q61130k321472k214775O18133K384606
$$ plain form
604.7 452512817 450349388 448727493 446243019 445333366 445999184 447765961 448679085 448507805 448088303
613.4 448088303 446627960 445080681 443191261 440493851 439602470 443112679 446432686 447154999 447595482
622 447595482 447924767 447803268 446893768 446672516 447798576 449677200 452498894 455500336 457899590
630.7 457899590 459253349 459996033 460374756 459697571 458562393 458978577 462083015 466350746 469498787
639.4 469498787 471822624 472376900 471370964 471473351 471966934 472109146 473105621 475605850 478900833
648.1 478900833 481366768 483010368 483004684 480926094 478793488 477850266 478695145 481037025 483855247
656.8 483855247 485745430 486943626 487180862 484608688 480543175 477486649 476998138 478021278 480246696
665.4 480246696 483693771 485950279 486132355 486271515 485410385 483088913 480874138 481492271 483876877
674.1D83876877K881088L624802K714271P88079J29547k50130j307259l71780J300240
682.8D93385735K888832L245506K624435K671357L12919j375618j379471q13636O82487
691.5E02242546J576996K580795K375717K218171J684837m61006j809197k333412j994591
700.2E06080856j20048L133926M225311L218804J972809M64554k43149j240006j415786
708.8E16077271n00222J265831K690315L196908K849693R60464J73531j404801k227363
717.5E23081627q49724J29166J990089L414498K897834J933785J661453j60370j969757
726.2E32128601j620026p69958J348267K240638K704888L185501K099876M94232j169815
734.9E40642204j627426j345749m66423O98815K426681K440453J823387K189560K3536
$$ plain form
674.1 483876877 486757965 490382767 493097038 493885117 494014664 493764534 492457275 492085495 493385735
682.8 493385735 496274567 499520073 502144508 504815865 505128784 503753166 502373695 501560059 502242546
691.5 502242546 503819542 506400337 508776054 510994225 512679062 512218056 510408859 508075447 506080856
700.2 506080856 505960808 509094734 513320045 516538849 518511658 518976212 518733063 517493057 516077271
708.8 516077271 515577049 516842880 519533195 522730103 525579796 526540260 526713791 525308990 523081627
717.5 523081627 522231903 522361069 524351158 527765656 530663490 532597275 534258728 534098358 532128601
726.2 532128601 530508575 529738617 531086884 533327522 536032410 539217911 541317787 541812019 540642204
734.9 540642204 539014778 537669029 537202606 537901421 540328102 542768555 544591942 546781502 546805038
743.6E46805038j693420j974983j614571k88391K160721L355751K511787K084694J32790
752.2E51479416p22122j122551j454850K82059K060013K962647K375831L109284K044715
760.9E61014442n69572j523399j153756L02353N17044J624604J351928J912575J992111
769.6E65468330l14445j31111k092552k846222j201401J061249K604522J568871J710968
778.3E65828209P90024J7891r24874k218895j269340p4463Q62122K166061K650795
787E67827530J383896P38525o68335j545639j372108j396828l18604O87943K786560
795.6E68122940K344856J72501j338615k594376k387314k772446k079582q00285Q18291
804.3E59485970J234169K4757j471596k515793k717819m451866l112793j535912q80127
$$ plain form
743.6 546805038 545111618 543136635 541522064 541233673 543394394 546750145 549261932 551346626 551479416
752.2 551479416 550757294 549634743 548179893 548461952 550521965 553484612 555860443 558969727 561014442
760.9 561014442 560444870 558921471 557767715 558070068 558587112 560211716 561563644 563476219 565468330
769.6 565468330 565153885 565022774 562930222 560084000 558882599 559943848 562548370 564117241 565828209
778.3 565828209 566618233 566636124 565711250 563492355 562223015 562148552 563010674 565176735 567827530
787 567827530 569211426 569949951 569281616 567735977 566363869 564967041 564648437 565336380 568122940
795.6 568122940 570467796 570640297 569301682 566707306 564319992 561547546 559467964 558667679 559485970
804.3 559485970 560720139 560744896 559273300 556757507 554039688 549587822 546475029 544939117 544058990
813E44058990R89380J82038q4076l42560j829376k844620k406273j164627R12972L167724
822.6E40639572K769280L270492L032227J448097O80008K25716J470108K007026K930641
831.3E58473167L805047L929138L698425L092384K382469Q53463L00216k52800J542321
840E77823830L577537M189644L595772K052231K440757J47171j019592j37024L22190
848.7E92992516J231041K023887L494759L149757K455559M29840l75252P95326O02799
857.4F06800232J064110K041702L697662K726250J701584J878128j96571j945572j897278
866F15870247r08699m75311N94596J760140K094574k6932k080345k543716l631592
874.7F10652962k436028r52110K77252R10378Q47740N71594n07011j245575j788292
$$ plain form
813 544058990 545048370 545230408 545146332 544803772 542974396 540129776 537723503 536558876 537471848 540639572
822.6 540639572 543408852 546679344 549711571 551159668 551839676 552065392 553535500 555542526 558473167
831.3 558473167 562278214 566207352 569905777 572998161 575380630 576234093 576534309 576281509 577823830
840 577823830 581401367 585591011 589186783 591239014 593679771 593826942 592807350 592670326 592992516
848.7 592992516 594223557 596247444 599742203 602891960 605347519 605777359 605402107 606197433 606800232
857.4 606800232 607864342 609906044 613603706 616329956 618031540 619909668 619713097 617767525 615870247
866 615870247 614961548 614486237 615080833 616840973 618935547 618908615 616828270 614284554 610652962
874.7 610652962 608216934 607264824 607542076 608452454 609300194 609871788 609364777 608119202 606330910
883.4F06330910j254273k045746j435241J4801M83055J058769k06146n59082j507492
892.1F00879555j232910m07792n61409M22249M56848J297493J422730M17595j526032
900.8F01168327k267990j212158r72290O51550K021866K514420K754593L635902K231255
909.4F10525475l64914q53653j900063r78432m02565L85209M04586m87632q69790l119964
919.1F02338257l459702l937835l351822k291298j395607j491471l102493j743202
926.8E81564827k365723l121528l540612l800659l134918l114700p38640l1357j66397
935.5E61550293n57976j139946j113014k712936k913247j633300O9236O6719o7672
944.2E51548157L18489l07465j026382k300911j414871r16481j309205j06315Q51440
$$ plain form
883.4 606330910 605076637 603030891 601595650 601610451 602093506 603152275 602946129 602387047 600879555
892.1 600879555 599646645 599238853 598677444 599099693 599556541 600854034 602276764 602694359 601168327
900.8 601168327 598900337 597688179 596715889 597367439 599389305 601903725 604658318 608294220 610525475
909.4 610525475 610160561 609306908 607406845 606428413 606025848 606411057 606815643 606328011 605458221 602338257
919.1 602338257 598878555 594940720 591588898 589297600 587901993 586410522 583308029 581564827
926.8 581564827 579199104 576077576 572536964 568736305 565601387 562486687 561748047 561716690 561550293
935.5 561550293 560992317 559852371 558739357 556026421 553113174 551479874 551549110 551615829 551548157
944.2 551548157 551866646 551559181 550532799 548231888 546817017 545900536 544591331 544485016 545336456
952.8E45336456N11551p5760j050148l520355l456535l282891l430481j699371j372948
961.5E27959518r64164m15917j345558l036308l007164k770691l477974k422295j427154
970.2E09092293j346970j305923j405602k493934l820801m844475n339279m300461
977.9D84234848l788033l615913l203659l111381l807488n024872n727882o321411
985.6D49634209o287003m997177l766708l589287l451958l241310l681374m351005
993.3D16268387m124947m252205l725509k983780l633957k803803k097702k136497
1001.1C90509987k711182l027420k809982l111191k764435k467994j193695p41921
1008.8C71682167j092567j587220j733436j596642k512932j824417k734146l012504
$$ plain form
952.8 545336456 545848007 545772247 544722099 541201744 537745209 534462318 531031837 529332466 527959518
961.5 527959518 526995354 526579437 525233879 522197571 519190407 516419716 512941742 510519447 509092293
970.2 509092293 507745323 506439400 505033798 502539864 498719063 493874588 488535309 484234848
977.9 484234848 480446815 476830902 473627243 470515862 466708374 461683502 455955620 449634209
985.6 449634209 443347206 438350029 434583321 430994034 427542076 424300766 420619392 416268387
993.3 416268387 412143440 407891235 404165726 401181946 397547989 394744186 392646484 390509987
1001.1 390509987 387798805 384771385 381961403 378850212 376085777 373617783 372424088 371682167
1008.8 371682167 370589600 369002380 367268944 365672302 363159370 361334953 358600807 355588303
1016.5C55588303j664772j507340j675072k064476j441192l142624l296700k132911
1024.2C38663216k160378j688652j971130j264458j082153m66957j154671j558380
1031.9C27316437j504784j493072L80287K79770J400413J598740J373291Q69865M91486
1040.6C30712433J696510J098252P15217m82368J059227Q00514n94826N13344j132088
1049.3C34386215r39636j428413j827393j624145r68285J2855o34803K29225l18184
1058C26887436K70080K23809O55555J584893J162185K040787K336159L577804K143097
1066.6C40881805J636467J751557P89413J067009M47388O48422R8877R10759L71819
1075.3C48603516N34706J762771O81992R21516m19655K060Q76656K119980K679634
$$ plain form
1016.5 355588303 353923531 352416191 350741119 348676643 347235451 344092827 340796127 338663216
1024.2 338663216 336502838 334814186 332843056 331578598 330496445 330029488 328874817 327316437
1031.9 327316437 325811653 324318581 324698868 324978638 326379051 327977791 329351082 330220947 330712433
1040.6 330712433 332408943 333507195 334222412 333740044 334799271 335599785 335004959 335518303 334386215
1049.3 334386215 333446579 332018166 330190773 328566628 327598343 327611198 326976395 327205620 326887436
1058 326887436 327157516 327381325 328036880 329621773 330783958 332824745 335160904 338738708 340881805
1066.6 340881805 342518272 344269829 345059242 346126251 346573639 347222061 347320938 348231697 348603516
1075.3 348603516 349138222 350900993 351582985 352504501 352084846 352086906 352963562 355083542 357763176
1084C57763176J444015J915322O19278O04019O35529J201972J720467J463928K260247
1092.7C69627953K058563K383728J297607J451683R71451M30336J393776J028366J711006
1101.4C82354469J110459J940002K282791J128235J032028O09398O07109q850O97212
1110C91752853J229821J782264J800576R33189R03320j335j1177n42526m0589P17659
1119.7C98524055J77994N89028M13742K89459J95618R28001N39246J22261Q49151J246300
1129.3D03874855K525177K301750K222786K405472K213669J702614J083488K004089
1137D20333900K428093K030602J913986K292824J666832J203651J077881K99225L95279
1145.7D33642273M08745N33867N83877P20215O33164j03684k21443o36940n99213n46722
$$ plain form
1084 357763176 359207191 361122513 361741791 362345810 362981339 364183311 365903778 367367706 369627953
1092.7 369627953 371686516 374070244 375367851 376819534 377790985 378221321 379615097 380643463 382354469
1101.4 382354469 383464928 385404930 387687721 388815956 389847984 390457382 391064491 391055641 391752853
1110 391752853 392982674 394764938 396565514 397498703 398402023 398400688 398389511 397846985 397806396 398524055
1119.7 398524055 398702049 399291077 399704819 399994278 400189896 401117897 401657143 401779404 402628555 403874855
1129.3 403874855 406400032 408701782 410924568 413330040 415543709 417246323 418329811 420333900
1137 420333900 422761993 424792595 426706581 428999405 430666237 431869888 432947769 433246994 433642273
1145.7 433642273 434051018 434584885 435168762 435888977 436522141 436418457 436197014 435560074 434960861 434414139
1155.4D34414139k79808K67715k05231m07905q67577n45273J82877l42255l05023N96276
1165D32507935R71946J262856K187538L211746L475495K317886K113533K418365K456704
1173.7D52924004K586708K821693L156548K978363L414764L086815K562103K300415
1181.4D75831413J511917J200333J861801K422257J477661Q44497J010247Q12568J63727
1190.1D87136421j05018m08478k93732O7368m26903k12250n60951j232834j164703
1198.8D82798920j152878j040421j367378j412811j386147j228256l05405m03328j168365
1207.4D73333931j195717j064300q03070j83449k36512o68106j45034L74794k90947
1216.1D69121590j074448m29306j03340n91278l60413m19693k80151J6517m17785p71713
$$ plain form
1155.4 434414139 434134331 434402046 434196815 433788910 432921333 432376060 432558937 432216682 431911659 432507935
1165 432507935 433479881 434742737 436930275 440142021 443617516 445935402 448048935 450467300 452924004
1173.7 452924004 455510712 458332405 461488953 464467316 467882080 470968895 473530998 475831413
1181.4 475831413 477343330 478543663 480405464 482827721 484305382 485149879 486160126 486972694 487136421
1190.1 487136421 487031403 486622925 486329193 486396561 485969658 485757408 485196457 483963623 482798920
1198.8 482798920 481646042 480605621 479238243 477825432 476439285 475211029 474905624 474502296 473333931
1207.4 473333931 472138214 471073914 470270844 470087395 469850883 469182777 469037743 469412537 469121590
1216.1 469121590 468047142 467617836 467514496 466923218 466562805 466143112 465862961 465879478 465461693 464689980
1225.8D64689980o98586n24712q78982j015282p58819o25916o70357p70111l97148
1234.4D58350067k46887k47269l85055n35851o70891n80673J8616O2866K85072j73111
1244.1D55876884o11457j96801n95169o95648o37398m75006m69284m78744J93367L28331
1253.7D52239075L7727k73056k31247m28963m83017r9105M12521R71374N58434J69106
1263.4D52872849J12190L64609M42352O53724R71718P45087J143646J269570J053733
1272D59629478Q78869Q56018J100807J232605J213302J170159J225548J317749J801719
1280.7D70426254J520996J178170J528205J672440J574936J592941J896591J717682
1288.4D83108215J659050J306763R39331R10950P10563P16057J195069J450805Q50792
$$ plain form
1225.8 464689980 463991394 463466682 462587700 461572418 460813599 460187683 459517326 458747215 458350067
1234.4 458350067 458103180 457855911 457470856 456935005 456264114 455683441 455702057 455764923 456049995 455876884
1244.1 455876884 455265427 455068626 454473457 453777809 453140411 452665405 452196121 451717377 451910744 452239075
1253.7 452239075 452276802 452003746 451772499 451343536 450860519 450761414 451173935 452145309 452703743 452872849
1263.4 452872849 452985039 453349648 453792000 454445724 455417442 456162529 457306175 458575745 459629478
1272 459629478 460508347 461364365 462465172 463697777 464911079 466081238 467306786 468624535 470426254
1280.7 470426254 471947250 473125420 474653625 476326065 477901001 479493942 481390533 483108215
1288.4 483108215 484767265 486074028 487013359 487924309 488634872 489350929 490545998 491996803 492847595
1297.1D92847595R57451R05190N92498R2392k68097K75765M27437N93605Q3275J98707
1306.8D96705818O08368r3841j105767j547661m23317k99263o48574l97263P7896N93949
1316.4D93470345K87513M48876L62930K61612K92282M51851J034164J136589R05724
1325.1D98651886O69479O62003k33345l16315l72963p56149j48392n56335n89524J15357
1334.7D97125702L32985k70310m40330P3700j22566k28310j28670Q02956J082840J072006
1344.4D99300003J151390N55840L17917l83759j34964J3008J1902o523k35710K46582
1354E00835686j70441j90430l71399m89044o17485o48613l55491l23906M85954l41683
1363.7D97813148k83012j22642o82679o34498j322136j081581m84810n264Q4343P06443
$$ plain form
1297.1 492847595 493805046 494710236 495302734 495395126 495127029 495402794 495830231 496423836 496507111 496705818
1306.8 496705818 497314186 497220345 496114578 494566917 494143600 493844337 493195763 492798500 492876396 493470345
1316.4 493470345 493757858 494206734 494569664 494831276 495123558 495575409 496609573 497746162 498651886
1325.1 498651886 499321365 499983368 499750023 499433708 499060745 498304596 498156204 497599869 497010345 497125702
1334.7 497125702 497458687 497188377 496748047 496821747 496699181 496470871 496342201 497145157 498227997 499300003
1344.4 499300003 500451393 501007233 501325150 500941391 500806427 500819435 500831337 500824814 500589104 500835686
1354 500835686 500665245 500474815 500103416 499614372 498996887 498348274 497992783 497668877 498154831 497813148
1363.7 497813148 497530136 497407494 496724815 496090317 494768181 493686600 493201790 493196526 493280869 493987312
1373.3D93987312Q15010p93190n51948m08058j4115m58641j41258m7302r46541r98573
1382.9D90442696j460762j255532j267509o53877j678925j773453m20837j345215j380272
1391.6D79206314j498451j131783k094268l748818j966362j770706j170540k488060
1399.3D63337326k477112j585960k012520j560898j629753k603989l241691j771622
1407.1D46453781j129074j543808j235657j732177j886826j560364j262893j187401
1414.8D34915581j243248o38314j14784R93614j352691j115418J000519J74103M86107
1423.4D33105469k62528J93672P46842N63965J334572R56916J092225P36808J348725
1432.1D39816666J339645J317444K127228J923599K122269Q26377J903840J423111
$$ plain form
1373.3 493987312 494802322 494009132 493457184 493049126 493035011 492576370 492435112 492387810 491441269 490442696
1382.9 490442696 488981934 487726402 486458893 485805016 484126091 482352638 481931801 480586586 479206314
1391.6 479206314 477707863 476576080 474481812 470732994 468766632 466995926 465825386 463337326
1399.3 463337326 460860214 459274254 457261734 455700836 454071083 451467094 448225403 446453781
1407.1 446453781 445324707 443780899 442545242 440813065 438926239 437365875 436102982 434915581
1414.8 434915581 433672333 433034019 432919235 433912849 432560158 431444740 432445259 432619362 433105469
1423.4 433105469 432842941 433036613 433783455 434347420 435681992 436638908 437731133 438467941 439816666
1432.1 439816666 441156311 442473755 444600983 446524582 448646851 449473228 451377068 452800179
1439.8D52800179J482811J820220R95102J191292P94754K061157J909409J335030J248016
1448.5D65637970J191940J522293R63211J635933J031456J991043K082138J383896
1456.2D77439880K118912K72102L139649R21440J664200J341057J336593K711411J315117
1464.9D92260361K563896K036362K394485K278366J963425K715378K696113L253327
1472.6E12161713J756286L674011L447190K461166K163010K117691J776543J544265
1480.3E31101875J576767R82018J924209K225151J532670J891746O45599r8762J763534
1489E43544807k16980j974182r6740L59878M9439q7090l49312n511818o97097j071358
1498.7E33949547l593483o54717r99946p62367p91970N71671J203918j989059m799881
$$ plain form
1439.8 452800179 454282990 456103210 457098312 458289604 459084358 461145515 463054924 464389954 465637970
1448.5 465637970 466829910 468352203 469315414 470951347 471982803 473973846 476055984 477439880
1456.2 477439880 479558792 479830894 482970543 483891983 485556183 486897240 488233833 490945244 492260361
1464.9 492260361 494824257 496860619 499255104 501533470 503496895 506212273 508908386 512161713
1472.6 512161713 513917999 517592010 521039200 523500366 525663376 527781067 529557610 531101875
1480.3 531101875 532678642 533660660 535584869 537810020 539342690 541234436 541880035 541781273 543544807
1489 543544807 543327827 541353645 541256905 541616783 541666222 541579132 541229820 535718002 535020905 533949547
1498.7 533949547 530356064 529701347 528701401 527939034 527147064 527718735 528922653 526933594 522133713
1507.3E22133713j781235j08452q95576R12590n22766j558381j79214r06334o77681
1516E16416664j919250k699013J46446J742172P12014j920205O47088N34973J605186
1524.7E15266075o09436K41127J371689j85547L48129J147538J599617J006012N13801
1533.4E20699005j551857P86019R77363P65495K272034J058502q2817K70081O09398
1542.1E25803223n5580P86705L59420j727943J197891Q24165J634255Q40378j346360
1550.7E28316154R30062R30633J654816k082291q15963J673698J556931K087326m140320
1559.4E30111046l878136j239242L39431j181144j058197k735520l126907j101303
1567.1E16130028j316071j09405p777024k211418j909294l781090k975006l018837
$$ plain form
1507.3 522133713 520352478 520244026 519348450 520261040 519738274 518179893 518000679 517094345 516416664
1516 516416664 514497414 511798401 511944847 513687019 514399033 512478828 513125916 513660889 515266075
1524.7 515266075 514656639 514897766 516269455 516083908 516432037 517579575 519179192 520185204 520699005
1533.4 520699005 519147148 519933167 520910530 521676025 523948059 525006561 524923744 525193825 525803223
1542.1 525803223 525747643 526534348 526893768 525165825 526363716 527187881 528822136 529662514 528316154
1550.7 528316154 529246216 530176849 531831665 529749374 528933411 530607109 532164040 534251366 530111046
1559.4 530111046 526232910 524993668 525333099 524151955 523093758 520358238 517231331 516130028
1567.1 516130028 514813957 514704552 506927528 504716110 502806816 499025726 496050720 493031883
1574.9D93031883l60718j0532341k482185l279610m436111m009819n608864l791962
1582.6D58530273n942382l583222m919967m289742m283714n311508l322449o237107
1590.3D20640182l706436n762176l830452m105530m949188k634163n051689k566643
1598C88033905n196457k911644l807983l683815k298126m662743j695595l505478r21631
1606.7C59350433l443069k085304k021523l603897j71471l211555L7880j848335K77824
1615.4C43280983n1689n369187J790200j533470Q46328k063293R20868L84674j678887
1624C36526527J620369p06062K140122j956215N74073K99492M38195J394958j13182
1632.7C40218277K721252N62897K798004j162758K621079Q47855K97622K910233P91740
$$ plain form
1574.9 493031883 492671165 482138824 479656639 476377029 471940918 467931099 462322235 458530273
1582.6 458530273 452587891 449004669 444084702 439794960 435511246 430199738 426877289 420640182
1590.3 420640182 416933746 411171570 407341118 403235588 398286400 395652237 390600548 388033905
1598 388033905 382837448 379925804 376117821 372434006 370135880 365473137 363777542 360272064 359350433
1606.7 359350433 355907364 353822060 351800537 348196640 348025169 344813614 344851494 343003159 343280983
1615.4 343280983 343229294 337860107 339650307 338116837 338963165 336899872 337820740 338205414 336526527
1624 336526527 338146896 337440834 339580956 337624741 338198814 338498306 338936501 340331459 340218277
1632.7 340218277 342939529 343502426 346300430 345137672 347758751 348606606 348904228 351814461 352606201
1641.4C52606201K856293P97539K776107K252579J47400M009323q83369K480659M26979
1650.1C67469711L354302K868118k645760J339112Q60748L939781N83039J998138R66911
1658.8C80734100J683274K329979J805877L540230R37500L833275K258072K802391
1666.5C99924698K935181K999115L942756J638031N529556K620736M496612M373017
1674.2D28459702L527488K983208K460785M344368L444748N523453M395408M928970
1681.9D60068130N318757K406196N580902J707726N762939M488869M833450N182000
1689.6D95348969M452781N183296M463692N202065N049438N359497J710282N212860
1697.3E31982880O561737O198578O479988m0245N845146M537582M218903L283767L070145
$$ plain form
1641.4 352606201 355462494 356260033 359036140 361288719 361436119 365445442 364562073 367042732 367469711
1650.1 367469711 370824013 373692131 371046371 372385483 373246231 377186012 377769051 379767189 380734100
1658.8 380734100 382417374 384747353 386553230 390093460 391030960 394864235 397122307 399924698
1666.5 399924698 402859879 405858994 409801750 411439781 416969337 419590073 424086685 428459702
1674.2 428459702 431987190 434970398 437431183 441775551 445220299 450743752 455139160 460068130
1681.9 460068130 465386887 467793083 473373985 475081711 480844650 485333519 490166969 495348969
1689.6 495348969 499801750 504985046 509448738 514650803 519700241 525059738 526770020 531982880
1697.3 531982880 538544617 544743195 551223183 551182938 557028084 561565666 565784569 569068336 572138481
1706E72138481L255654K729835L886032L021431K812882K526512K505226L235588J266060
1714.7E97377701R04999L460350L055725k309380K571526L048706J784973J527176
1722.4F11421776O17142N05600J614608K063141J602593J704330K469940J058235O17524
1731.1F23674889K827720L053246o34575l826294L531990M010544K318039K946777
1738.8F37902336J437531j235733L214149K809677J165619K122116L729248L584976
1746.5F54729919K815094L305054J650162L533020J589584M90036M439011L293991
1754.2F75845871L389893L609695R34982J672135K477035K218704L192673L27301M38843
1762.9F94107132L375778K198105J947250K462693K235870j688843J195297M156266
$$ plain form
1706 572138481 575394135 578123970 582010002 585031433 587844315 590370827 592876053 596111641 597377701
1714.7 597377701 598282700 601743050 604798775 602489395 605060921 608109627 609894600 611421776
1722.4 611421776 612038918 612544518 614159126 616222267 617824860 619529190 621999130 623057365 623674889
1731.1 623674889 626502609 629555855 628921280 625094986 628626976 632637520 634955559 637902336
1738.8 637902336 639339867 638104134 641318283 644127960 645293579 647415695 651144943 654729919
1746.5 654729919 657545013 660850067 662500229 666033249 667622833 668112869 672551880 675845871
1754.2 675845871 679235764 682845459 683780441 685452576 687929611 690148315 693340988 693668289 694107132
1762.9 694107132 697482910 699681015 701628265 704090958 706326828 704637985 705833282 709989548
1770.6G09989548J753540q15735j708222L476487K557373k62680J631088P33337J332016
1779.3G18686752O24619m07562R86862J869735K243195L99323L86428Q79441K48947
1788G25917740K86865J622543J215210J035691l70179l55529L176346R43908p11593
1796.7G32761002L60336J308288J040268j0833K579879L38974K15531J364899L56903
1805.3G40315247M72641o9733K0065N33982J399307J81122J195526J607284K37732
1814G45893173M80576k26135M93927n60532L97644J320496N24368J621628K87017J095810
1823.7G51327972J118775j897659o22559R32236J923751J489411j454468J67770J892930
1832.3G54878159M5242k83356r7046J41754M44794k52151J432876Q47244P54166P45011
$$ plain form
1770.6 709989548 711743088 710927353 709219131 712695618 715252991 714990311 716621399 717354736 718686752
1779.3 718686752 719311371 718903809 719890671 721760406 724003601 724402924 724789352 725668793 725917740
1788 725917740 726204605 727827148 729042358 730078049 729707870 729352341 732528687 733472595 732761002
1796.7 732761002 733121338 734429626 735469894 735459061 738038940 738377914 738593445 739958344 740315247
1805.3 740315247 740787888 740718155 740738220 741272202 742671509 742852631 744048157 745655441 745893173
1814 745893173 746373749 746147614 746641541 746081009 746478653 747799149 748323517 749945145 750232162 751327972
1823.7 751327972 752446747 750549088 749926529 750858765 752782516 754271927 752817459 752985229 754878159
1832.3 754878159 754923401 754640045 754542999 754684753 755129547 754877396 756310272 757157516 757911682 758656693
1842G58656693J442108J192703n054321O71997J686096M16717M17176Q32443P28073
1850.7G60989685j27411O82602l84293j30615l26462N8365J307831N87540Q88901K88772
1860.3G63834915N75562m69513n74494j14059l16620J220856Q43887J416855m30222
1869G65987167j422805L83453K90375M08935m97055j16730J26496J041031J012268
1877.7G67213135M47082L45764m84771l4790n79682j73340m37088L27073J480255N16052
1887.3G68619690J104050K30484j291809q25501J74637n2719K83584J172486j64490
1896G69250412O91071N36499j45798n04685k34680l3111p81708O74744O00280O94351
1905.6G70747375N73578n2719O6681j53274k89002r56116L54462N28107Q43200N12085
$$ plain form
1842 758656693 760098801 761291504 756237183 756909180 758595276 759011993 759429169 760261612 760989685
1850.7 760989685 760862274 761544876 761160583 761029968 760703506 760761871 762069702 762657242 763546143 763834915
1860.3 763834915 764410477 763940964 763366470 763252411 762935791 764156647 765000534 766417389 765987167
1869 765987167 764564362 764947815 765238190 765647125 765150070 765033340 765159836 766200867 767213135
1877.7 767213135 767660217 768005981 767521210 767486420 766906738 766733398 766296310 766623383 768103638 768619690
1887.3 768619690 769723740 769954224 768662415 767836914 768011551 767958832 768242416 769414902 769250412
1896 769250412 769941483 770477982 770332184 769827499 769592819 769559708 768778000 769452744 770053024 770747375
1905.6 770747375 771320953 771268234 771334915 771181641 770892639 769936523 770290985 770819092 771662292 772174377
1915.3G72174377r1857J141052j623154j148376N66558N951N30548K49329l2654L71018
1924.9G72142792M68063k39639j17035p25098n13534K06375N2795P08161M50058O46133
1934.6G73079071j00632l02276k42462o95878n10330n89752J480103Q28857q14209
1943.2G72132492M82407M02679l24249j186142n96619j00403O34079O34003L44849
1951.9G72423096K02331o6147K39640r17359o16226m83856m01154L26691O41937J063614
1961.6G72412567O1112P7667m63562n68848l06091q38547k51770N46646J501465M13284
1971.2G72583923j99051m49676m31213j00480q67004l89862j49460O32858N50080N42679
1980.8G71722794O72760l55149m37011r30405m67529n18265l7308N59311L59116J202316
$$ plain form
1915.3 772174377 772082520 773223572 771600418 770452042 771018600 771024551 771555099 771804428 771771774 772142792
1924.9 772142792 772610855 772371216 772254181 771529083 771015549 771221924 771274719 771982880 772432938 773079071
1934.6 773079071 772978439 772676163 772433701 771737823 771227493 770637741 772117844 772946701 772132492
1943.2 772132492 772614899 773017578 772693329 771507187 770910568 770810165 771444244 772078247 772423096
1951.9 772423096 772625427 772559280 772798920 771881561 771265335 770781479 770380325 770707016 771348953 772412567
1961.6 772412567 772473679 772551346 772087784 771518936 771212845 770374298 770122528 770669174 772170639 772583923
1971.2 772583923 772384872 771935196 771503983 771403503 770536499 770146637 769997177 770630035 771180115 771722794
1980.8 771722794 772395554 772040405 771603394 770672989 770205460 769687195 769649887 770209198 770568314 771770630
1990.5G71770630M28162p01981j120682m75235n78918l94135O39343N39246P67136
1999.2G70873566P0877K89535l29513j159592p84836q81042J23596L10745P07855O03638
2008.8G69824829L70178K30103n77622r12551j439438l40119O7063J08795O13861O22024
2018.5G68567123M05274r1629o8436j190109p61795l39813n28794L03040P47070R20868
2028.1G67962799J42136Q850r26666j032105n43289o84891J06583J73797P98035O05011
2037.7G66610260N01099j60218r43527o04553r43298j50681j82495O76575R00573M3564
2047.4G65747299J57013m74701k58179p19070n08194l19290l586P70798M06875M13971
2057G65212936k32315q2245m71801o46668n15136k68097R16595K70462M13513K30179
$$ plain form
1990.5 771770630 772198792 771496811 770376129 769900894 769321976 768927841 769567184 770106430 770873566
1999.2 770873566 770944443 771233978 770904465 769744873 768960037 768078995 768202591 768513336 769221191 769824829
2008.8 769824829 770195007 770425110 769847488 768934937 767495499 767155380 767222443 767331238 767945099 768567123
2018.5 768567123 768972397 768880768 768812332 767622223 766860428 766520615 765991821 766294861 767041931 767962799
2028.1 767962799 768104935 768113785 767187119 766155014 765611725 764926834 765033417 765207214 766005249 766610260
2037.7 766610260 767111359 766951141 766007614 765403061 764459763 764309082 764126587 764803162 765703735 765747299
2047.4 765747299 765904312 765429611 765171432 764452362 763944168 763624878 763621292 764392090 764798965 765212936
2057 765212936 764980621 764898376 764426575 763779907 763264771 762996674 763913269 764183731 764597244 764827423
2066.7G64827423o4850k78244p77969l70255m60205m2724M1427P82013M43955k14310
2076.3G63886261J46637k74887k81983p95135j33591r842L43552P86743l69415J79519
2086G63477859O8131o02341q69217l63464o2256j5182M37088K975K35825k0981k9831
2096.6G62258606o65512p41272J50680j80053L48587J39389L79104K28348m87747o23016
2106.2G60807114o35605M6921k48795K8458M1198L83759K52838j32980J95236r22623
2115.9G59815521m82177k91443M577K95410K45667O12640k86255N5466j75552l37601
2125.5G59456253n46875n07812L15017K01493P84454J02539j07269k55509m16488N0354
2135.1G59076157m73557p4234r9182K17514P27386O29273q2474l53699j83258o93359
$$ plain form
2066.7 764827423 764762573 764484329 763706360 763336105 762875900 762833176 762874603 763656616 764100571 763886261
2076.3 763886261 764032898 763758011 763476028 762680893 762547302 762537460 762881012 763667755 763298340 763477859
2086 763477859 763545990 762943649 762074432 761710968 761648712 761633530 762070618 762073593 762309418 762288437 762258606
2096.6 762258606 761593094 760851822 761002502 760822449 761171036 761310425 761689529 761917877 761430130 760807114
2106.2 760807114 760171509 760218430 759969635 759998093 760039291 760423050 760675888 760542908 760738144 759815521
2115.9 759815521 759333344 759041901 759046478 759341888 759587555 760200195 759913940 759969406 759793854 759456253
2125.5 759456253 758909378 758401566 758716583 758918076 759702530 759805069 759697800 759442291 759025803 759076157
2135.1 759076157 758602600 758528366 758429184 758646698 759374084 760003357 759920883 759567184 759383926 758690567
2144.8G58690567J8158r2621K9450K73437L90473N38635l30124k15683m88510j73569
2154.4G58640213l46222j03912N98755K60086O38580n2185J88217j56250p01370k43759
2164.1G58722153j15052M08783J5335O69480K51465l08457N4245k77176r2849l72544
2173.7G58955383L53775N50614K83661K42767p4844j87989k01263P3013n17196m1199
2183.4G59436722J88522K77558M19311n1651L52783J45874J36338p67060o76727K28577
2193G59690247K30941N83954J78528M01535L2501p5531l34091n85937K72064J08108
2202.6G60502319J82648j95923L48816M57535j24664M6310m30298k39181m06189O0348
2212.3G60201721L11051L88412N82733R5520R9259m97132k02942l02047k69928L08456
$$ plain form
2144.8 758690567 758708725 758616104 758645554 758918991 759309464 759848099 759517975 759302292 758813782 758640213
2154.4 758640213 758293991 758190079 758788834 759048920 759687500 759635315 759823532 759667282 758965912 758722153
2164.1 758722153 758607101 759015884 759031219 759700699 759952164 759643707 759697952 759420776 759327927 758955383
2173.7 758955383 759309158 759859772 760143433 760386200 760311356 760123367 759922104 759995117 759477921 759436722
2183.4 759436722 759625244 759902802 760322113 760270462 760623245 760769119 760905457 760138397 759461670 759690247
2193 759690247 759921188 760505142 760683670 761085205 761117706 761042175 760708084 760122147 760394211 760502319
2202.6 760502319 760684967 760489044 760837860 761295395 761170731 761217041 760786743 760547562 760141373 760201721
2212.3 760201721 760512772 760901184 761483917 761579437 761678696 761181564 760978622 760676575 760406647 760715103
2221.9G60715103K84805O27213J31378k21481m33579K6093J18027l92609l27835j33896
2231.6G60393219L65753L90930P34635j9074l74908j98288n65872j34583j68762M83246
2241.2G60906296L62243L54920L61481k97013j41983o05240m44259l62320K57110M66690
2250.9G60857925K34909L53928q1024J35345p38067m30603P0038N2948M70123p2251
2260.5G60853271L13111L12424L47442j13754p47604p86438m55399K56119j12000L75290
2270.2G60242462M56085M29764O8054l07388j37405p36847L4332k31323m7379N64499
2279.8G60334854L60718L78189l37677l22495n66635j66320m25339m12903M95834N81665
2289.4G59919891R21555l61557l73535l26309q17032k14768N5847L52173m75158L57818
$$ plain form
2221.9 760715103 760999908 761627121 761758499 761537018 761103439 761129532 761247559 760854950 760527115 760393219
2231.6 760393219 760758972 761149902 761884537 761865463 761490555 761292267 760726395 760591812 760423050 760906296
2241.2 760906296 761268539 761623459 761984940 761687927 761545944 760940704 760496445 760134125 760391235 760857925
2250.9 760857925 761092834 761446762 761365738 761501083 760763016 760332413 760402451 760455399 760925522 760853271
2260.5 760853271 761166382 761478806 761826248 761712494 760964890 760178452 759723053 759979172 759867172 760242462
2270.2 760242462 760698547 761128311 761196365 760888977 760751572 760014725 760049057 759817734 759770355 760334854
2279.8 760334854 760695572 761073761 760736084 760413589 759846954 759680634 759255295 758842392 759338226 759919891
2289.4 759919891 760841446 760479889 760106354 759780045 758963013 758748245 758804092 759156265 758681107 759038925
2299.1G59038925Q60977J75324l4180l01437j55945m17023K02027j49537K23847N64499
2308.7G60007477j29547M59060l8299n8289p01904q84476j91574J4572M98657J94016
2318.4G59169693M87747N30853L87040j160965j083222J77841j06048R16900P58820
2327.1G60078659N62820j86767j3962m50363j015854N57327o79321p3013O38427l73229
2336.7G59044724j049195M65317J569595j028518o39801L16009K29j129684j084137
2345.4G56464539M85458j76697q99963L28064J776886J83258n59998N53055Q75931
2354.1G59030533L27682o87790P04422j490097j721115K33917J385270j0834j326065
2362.7G56445923J568756L43780k77175j588822O1569P26624j515198k38495j491852
$$ plain form
2299.1 759038925 759899902 760075226 760041046 759739609 759583664 759166641 759368668 759219131 759442978 760007477
2308.7 760007477 759877930 760336990 760298691 760240402 759538498 758654022 758462448 758477020 758975677 759169693
2318.4 759169693 759657440 760188293 760575333 759414368 758331146 758508987 758402939 759319839 760078659
2327.1 760078659 760641479 760454712 760440750 759990387 758974533 759531860 758852539 758779526 759417953 759044724
2336.7 759044724 757995529 758460846 760030441 759001923 758362122 758678131 758678360 757548676 756464539
2345.4 756464539 756949997 756773300 755873337 756201401 757978287 758161545 757601547 758154602 759030533
2354.1 759030533 759358215 758670425 759374847 757884750 756163635 756397552 757782822 757771988 756445923
2362.7 756445923 758014679 758358459 758081284 756492462 756554031 757280655 755765457 755526962 754035110
2371.4G54035110m06646M42428n90973r46044p11747K39563l34015n50689q02613k96173
2381.1G50078201l98559m76685L74069j53122l99856r66339o69632j83869j35345L31421
2390.7G47400284q9493j52893k15454J97067M8981l73841l59725n62211l23410n07431
2400.3G45061874J26419j37329m72107K10114k69623m29306n46341m38614K02027L27682
2410G43634796l45001r6436K60315m08020m31213o67191m79965l59497P3776K03781
2419.6G41385345p69119j61590P2403m33350m58374j50375m79813q42133j1596J54190
2429.3G38305588j1444k16523k62680m64401m87747k70386n26962l00674j03455K44903
2438.9G35906219p0800k41471l26614p54242m79126q14056l69721j12839j93634M0360
$$ plain form
2371.4 754035110 753628464 754070892 753479919 752533875 751822128 752061691 751727676 751176987 750374374 750078201
2381.1 750078201 749679642 749202957 749577026 749423904 749024048 748057709 747388077 747204208 747068863 747400284
2390.7 747400284 747310791 747157898 746942444 747139511 747188492 746814651 746454926 745892715 745569305 745061874
2400.3 745061874 745188293 745050964 744578857 744788971 744519348 744090042 743543701 743105087 743307114 743634796
2410 743634796 743289795 743193359 743453674 743045654 742614441 741947250 741467285 741107788 741181564 741385345
2419.6 741385345 740616226 740454636 740527039 740093689 739635315 739484940 739005127 738162994 738151398 738305588
2429.3 738305588 738294144 738077621 737814941 737350540 736862793 736592407 736065445 735764771 735661316 735906219
2438.9 735906219 735835419 735593948 735267334 734513092 734033966 733219910 732850189 732737350 732543716 732584076
2448.6G32584076j48621K1286k30179l88183n54657l12195m41055n94788M3335k33383
2458.2G29745636k19345K0447r4147q78525q20312j67160l14789n7602l82767k19040
2467.8G26612396n0201k95868m73404m51202m2572q17337o84128k43454l67737k05307
2477.5G22981186k02179l71933o09665k52991m98428m21066k66037m32816l68805n30319
2487.1G19026947k23007l37372l5172j35803o86264n85556m42505j50070k56424j07345
2496.8G16067429n71137n07431q9569n32608m89655p27615n34897k91443j86157k33154
2506.4G11903763m21219n84412q10852k29339l38745l79258k77633j71509O5460j86615
2516.1G08569641k09045o30951n97306n82275k94952j41754m86985j29013m36554n73044
$$ plain form
2448.6 732584076 732435455 732456741 732226562 731838379 731283722 730971527 730530472 729935684 729979019 729745636
2458.2 729745636 729526291 729546738 729452591 728574066 727753754 727586594 727271805 727214203 726831436 726612396
2467.8 726612396 726562195 726266327 725792923 725341721 725299149 724481812 723797684 723554230 723186493 722981186
2477.5 722981186 722779007 722407074 721797409 721544418 721045990 720624924 720358887 719926071 719557266 719026947
2487.1 719026947 718803940 718466568 718431396 718295593 717609329 717023773 716581268 716431198 716174774 716067429
2496.8 716067429 715496292 714988861 714899292 714366684 713877029 713149414 712614517 712323074 712136917 711903763
2506.4 711903763 711482544 710898132 710087280 709857941 709519196 709139938 708862305 708690796 708756256 708569641
2516.1 708569641 708360596 707729645 707132339 706550064 706255112 706113358 705626373 705497360 705060806 704487762
2525.7G04487762l98559p4692k74277m73861l49427p61566j50299j62277l96347l87116
2535.4G01059341m38919n16204p24183o8664l17917k71835k03629k26288J5030o30493
2545F97676239o19583m13208L3798k42920o25915m22745m31137m08325o70853j13754
2554.6F93761597j34583j85928k75498o85196m21066m11377J5030m98352n41382j82495
2564.3F90440750m12521j96381o02341l17688k07290n09033o02112l60184J9150k06070
2573.9F87046280j69449n94864n21087k99149m49829k42691k06757j79672k65808j41983
2583.6F83974991m06113o50406n12390k57187l09601n04760k62299m49142j84784k17438
2593.2F80220871o37512q55103n07889K7771l57742n4550n05524m70276J89667m40597
$$ plain form
2525.7 704487762 704089203 704014511 703740234 703266373 702916946 702155380 702005081 701842804 701446457 701059341
2535.4 701059341 700620422 700104218 699380035 699311371 698993454 698721619 698517990 698291702 698306732 697676239
2545 697676239 697056656 696643448 696677246 696434326 695808411 695385666 694954529 694546204 693875351 693761597
2554.6 693761597 693627014 693441086 693165588 692480392 692059326 691647949 691662979 691164627 690623245 690440750
2564.3 690440750 690028229 689831848 689229507 688911819 688704529 688195496 687593384 687233200 687252350 687046280
2573.9 687046280 686876831 686281967 685760880 685461731 685011902 684769211 684562454 684382782 684116974 683974991
2583.6 683974991 683568878 682918472 682406082 682148895 681839294 681334534 681072235 680623093 680438309 680220871
2593.2 680220871 679583359 678728256 678220367 678248138 677890396 677835846 677330322 676860046 677049713 676609116
2602.9F76609116n36347o33087p12967p38296k94724l21121l42484Q6518p70188p66296
2612.5F71580124m44565k95563l69186m38919k10953m66614k56042n35431m47846o16912
2622.1F67498093q46405j91422k02026k98844o35376o15005o30264l38898N6457p7438
2631.8F63718872l06702j083679n12390l42712p29828l78494m34952k54135k57569
2640.5F59418411m69513q16497n49775q3084j89819n34592o80389l34778k71759j32446
2650.1F55355759n77622n11246k25219n53971m87213q06732l47519q8577k38190l01208
2659.8F51218262m19388q7814m11301p71408r60922k63749J66855j90506l12805l04718
2669.4F47662506J45645m82330p24793m76226l51105j78833m10156M577l6850p7057
$$ plain form
2602.9 676609116 676072769 675439682 674726715 673988419 673693695 673372574 673030090 673116608 672346420 671580124
2612.5 671580124 671135559 670839996 670470810 670031891 669820938 669354324 669098282 668562851 668115005 667498093
2622.1 667498093 666651688 666460266 666258240 665959396 665324020 664709015 664078751 663739853 663796310 663718872
2631.8 663718872 663412170 662328491 661816101 661473389 660743561 660365067 659930115 659675980 659418411
2640.5 659418411 658948898 658132401 657582626 657499542 657309723 656775131 656094742 655759964 655488205 655355759
2650.1 655355759 654778137 654266891 654041672 653487701 653000488 652193756 651846237 651757660 651519470 651218262
2659.8 651218262 650798874 650711060 650299759 649528351 648567429 648303680 648470535 648280029 647967224 647662506
2669.4 647662506 647808151 647325821 646601028 646124802 645773697 645594864 645184708 645189285 645152435 645075378
2679F45075378n48172q47702m65927n61523k75116k92969j57089m78287m94690K08435
2688.7F41162338k7389m15497q53729o89545m09508l13186k14882j68648k63023k76795
2698.3F37530136K60086k34909m73709k73209m03366n09491o58149j43509j7624j10550
2708F34965706l54805l82996l21922n86853l46336m07334k86560j64947k59896k59285
2717.6F31594772j71165k87323n65186l25203m26025k00233j29586j40075m6921n14641
2727.3F28788414k49290k16408l02239r5977o5766m51088q59947l80516K39334L19290
2736.9F26725807k83241m23660o28472m95491J09711J6174J35002k98538k51999L2654
2746.5F24637947k33040k64473k56538k07443n12314j15624m56123p81937J07804L4637
$$ plain form
2679 645075378 644527206 643679504 643213577 642652054 642376938 642083969 641926880 641448593 640953903 641162338
2688.7 641162338 641134949 640719452 639865723 639176178 638766670 638453484 638238602 638069954 637806931 637530136
2698.3 637530136 637790222 637555313 637081604 636808395 636405029 635895538 635237389 635093880 635076256 634965706
2708 634965706 634610901 634227905 633905983 633319130 632972794 632565460 632278900 632113953 631854057 631594772
2717.6 631594772 631423607 631136284 630571098 630245895 629819870 629619637 629490051 629349976 629303055 628788414
2727.3 628788414 628539124 628322716 628020477 627924500 627858734 627407646 626547699 626167183 626406517 626725807
2736.9 626725807 626442566 626018906 625390434 624894943 625004654 625020828 625155830 624857292 624605293 624637947
2746.5 624637947 624404907 624140434 623883896 623676453 623164139 623048515 622592392 621810455 621918259 621952896
2756.2F21952896m53300o76880j93787n1651j67160j63269l01170l69072o12870q0642
2765.8F18883095l08800n49126J37177J68686k98348n64842l46641l55339j29166n50881
2775.5F16085815o86111j17188m41093m62913k78664Q3198l76739p75909l68424m19846
2785.1F12242126k17285l46565n12695n70603l45344l15514o57577n69764n51872o11305
2794.8F07543602j031342m99954m5318l35083m77105p55233o71921j069794p62634
2803.4F01895218m05579m42314k60506o63528n29976k97851n19562j358605r85107
2812.1E96432190l54614p82891m00886o50673m95033k61956p30590p59621r94721j093940
2821.8E89907265j008377n50118l74336m34914o99043j049957r82666r01718p58858
$$ plain form
2756.2 621952896 621499596 620822716 620628929 620577278 620410118 620246849 619945679 619576607 618963737 618883095
2765.8 618883095 618574295 618025169 618162346 618331032 618032684 617467842 617121201 616765862 616636696 616085815
2775.5 616085815 615399704 615282516 614841423 614378510 614099846 614183044 613806305 613030396 612661972 612242126
2785.1 612242126 612024841 611678276 611165581 610594978 610249634 609934120 609276543 608706779 608154907 607543602
2794.8 607543602 606512260 606012306 605966988 605631905 605154800 604399567 603727646 602657852 601895218
2803.4 601895218 601489639 601047325 600786819 600123291 599593315 599295464 598775902 597417297 596432190
2812.1 596432190 596077576 595294685 594893799 594243126 593748093 593486137 592755547 591995926 591001205 589907265
2821.8 589907265 588898888 588348770 587974434 587539520 586840477 585790520 584807854 583906136 583147278
2830.4E83147278r40170p54281r95597j146126r21745j191025o39725p31201j370621
2839.1E74456787j467323j191101j461830k101441j718254j694107j765518j800270
2846.8E61256943j715126j534653k129173k299576j512642p42187q91686p08580n27153
2855.5E49196167m23088J83296p172m08477o06308m70276l40614j72959k60544n72395
2865.2E46117630m69170r15565j224136j243401q35762m31137n61066o03714o74133
2873.8E39159546o91223r67980p64656p91054n18760j86539r36088q80166r49211n55954
2883.5E31917915l39927j065941j060066r13048p25327j244507j170311p03086r14956
2892.2E23780746p78617p31469o60286r16328p77359n59502r23347r04770q84819r62029
$$ plain form
2830.4 583147278 582207108 581452827 580457230 579311104 578389359 577198334 576558609 575827408 574456787
2839.1 574456787 572989464 571798363 570336533 568235092 566516838 564822731 563057213 561256943
2846.8 561256943 559541817 558007164 555877991 553578415 552065773 551323586 550431900 549723320 549196167
2855.5 549196167 548773079 548956375 548949203 548540726 547934418 547464142 547123528 546950569 546690025 546117630
2865.2 546117630 545648460 544732895 543508759 542265358 541429596 540998459 540437393 539833679 539159546
2873.8 539159546 538468323 537500343 536735687 535944633 535425873 535239334 534303246 533423080 532473869 531917915
2883.5 531917915 531577988 530512047 529451981 528538933 527813606 526569099 525398788 524695702 523780746
2892.2 523780746 523002129 522270660 521610374 520694046 519916687 519357185 518433838 517529068 516644249 515682220
2901.8E15682220m93164j33476p72819p64580p96890j331101j288032r86672o53190
2910.5E08462296j162072r35440q70857j382980j650048k223053j222801j027374j414986
2919.2D96572685r93919j374054r79691k44712m17061p81861l09562P1296J12191K11448
2928.8D91866760R8114J19019L166K96402J53122j5411J63536Q3122M57573O61545
2938.5D93886948J156616J225471N63431L82843N09911M67872K83776M13627J89019
2947.1D99079514L15895R43107J240387R93576M38767M59671L15017L19558K99720
2955.8E04405212J85013M34838P9231J96800R16061Q22449N60608N80330L41148P84111
2965.5E09305801J008568L15285R0828J25732P14341J050262J007538N35812j27029
$$ plain form
2901.8 515682220 515189056 515055580 514282761 513518181 512721291 511390190 510102158 509115486 508462296
2910.5 508462296 507300224 506364784 505493927 504110947 502460899 500237846 499015045 497987671 496572685
2919.2 496572685 495578766 494204712 493225021 492980309 492563248 491781387 491471825 491543121 491655312 491866760
2928.8 491866760 491964874 492083893 492087059 492383461 492536583 492521172 492684708 492767830 493225403 493886948
2938.5 493886948 495043564 496269035 496832466 497215309 497725220 498193092 498476868 498890495 499079514
2947.1 499079514 499395409 500338516 501578903 502572479 503011246 503470917 503785934 504105492 504405212
2955.8 504405212 504590225 505025063 505104294 505301094 506217155 507039604 507600212 508180542 508521690 509305801
2965.5 509305801 510314369 510629654 510720482 510846214 511560555 512610817 513618355 514154167 514027138
2974.1E14027138M75464O45980P10946O52275K33421L48015j61095R8610Q42590N06936
2983.8E18380280q889q0604L90129L94668J41602L71399L5248k2049K79121m27742
2993.4E19453163m00162m8828k33993j04141m62075m25262j6060l42560o85768l85857
3003.1E16348457M5662k56233q39424p10182l03879o73256q24051m80804l21846l26233
3012.7E11658211n90782n85709m52194l27149o38427q72269o28471o25802o64100r59625
3022.4E05313683q07343m19807l95012p48024j099015o73561m92859p23228j039276
3031D98915558q58040o90002n66826l86391j053963r94568r17244q77761n82352m89426
3040.7D91498985k41661q46443q96988p34482j228599j329651q28514p91893j142197
$$ plain form
2974.1 514027138 514502602 515148582 515859528 516511803 516745224 517093239 516932144 517030754 517873344 518380280
2983.8 518380280 518371391 518290787 518680916 519075584 519217186 519588585 519623833 519601784 519880905 519453163
2993.4 519453163 519053001 519004173 518770180 518666039 518203964 517778702 517762642 517420082 516734314 516348457
3003.1 516348457 516394119 516137886 515298462 514588280 514284401 513611145 512787094 512306290 511984444 511658211
3012.7 511658211 511067429 510481720 510029526 509702377 509063950 508191681 507563210 506937408 506273308 505313683
3022.4 505313683 504506340 504086533 503691521 502943497 501844482 501170921 500678062 499954834 498915558
3031 498915558 498057518 497367516 496800690 496414299 495360336 494365768 493448524 492570763 491988411 491498985
3040.7 491498985 491257324 490410881 489513893 488779411 487550812 486221161 485392647 484600754 483458557
3049.4D83458557m12063o40793r44062n05867o49643o96067q42209p93419j100884
3058D76873550j127128o97708n11666m56390p70798p78923p55539n40466p71904r78050
3067.7D69484978p06139p54204k85186m42658r97276q15392k68097n95474j250725
3076.4D63369827r06982p92389n35164m17976l21389l76548r09462q64754j096993
3085D57148170q16421l68385o06232p12051n31044m16604p23571j075745j085434k71416
3094.7D50541267l51410p87773n76400q87795m95109n30549j112594q00476o50482
3103.4D44348679r73778o41060k68555p07359n42793n88189p86285r43069j139946
3112D37757645p58057n87120o5765p16896j373711o08597o27098o47774p23762q54531
$$ plain form
3049.4 483458557 483046494 482405701 481461639 480955772 480306129 479610062 478767853 477974434 476873550
3058 476873550 475746422 475048714 474537048 474080658 473309860 472530937 471775398 471234932 470463028 469484978
3067.7 469484978 468778839 468024635 467739449 467296791 466299515 465484123 465216026 464620552 463369827
3076.4 463369827 462462845 461670456 461135292 460717316 460395927 460019379 459109917 458245163 457148170
3085 457148170 456331749 455963364 455357132 454645081 454114037 453697433 452973862 451898117 450812683 450541267
3094.7 450541267 450189857 449402084 448825684 447937889 447442780 446912231 445799637 444999161 444348679
3103.4 444348679 443374901 442733841 442465286 441757927 441215134 440626945 439840660 438897591 437757645
3112 437757645 436999588 436412468 436346703 435629807 434256096 433647499 433020401 432372627 431648865 430794334
3121.7D30794334p53402q58040q61931m94537m96483j184769j088753p04383n95055
3130.4D23756981o57997p22275q33130q91609l86925n07126r81064j134681q06732
3139D16835442o35415j075973q87833m90951m69399p25212p89757q12530p98111p21932
3148.7D09428329r15870p05261p05185q36182r93423j018372q40302r50241p29484
3157.4D01734009q51364o81992l54729j158027j516915o18591m63562j066742o95534
3166C94326553o46858q49304q30498o05545m43230j036224r48181r09233o84586o00967
3175.7C86771927r24797o36749r25522o09665n27077r14688q23708r17739n20936m67872
3185.3C79503174q42323r15719m74510n63965j257705j076393n27878m61769r59931
$$ plain form
3121.7 430794334 430040932 429182892 428320961 427826424 427329941 426145172 425056419 424352036 423756981
3130.4 423756981 423098984 422376709 421543579 420651970 420265045 419757919 418776855 417642174 416835442
3139 416835442 416200027 415124054 414236221 413745270 413275871 412550659 411760902 410948372 410150261 409428329
3148.7 409428329 408512459 407807198 407102013 406265831 405272408 404254036 403413734 402463493 401734009
3157.4 401734009 400882645 400200653 399845924 398687897 397170982 396552391 396088829 395022087 394326553
3166 394326553 393679695 392830391 391999893 391394348 390951118 389914894 388966713 388057480 387372894 386771927
3175.7 386771927 385847130 385210381 384284859 383675194 383148117 382233429 381409721 380491982 379971046 379503174
3185.3 379503174 378660851 377745132 377270622 376706657 375448952 374372559 373844681 373382912 372422981
3194C72422981q47244p88918r02519q16765q41674j60408m47045j044884q33168o52275
3203.6C65088081n02128m82369m84352r23729r82513o65322o23741o23970n74531m79813
3213.3C58745613j96915k35939j259231q92754j70364o31142p65266r44901r33189
3222C52715912o28243l0288l23067o03294m41628q74824k81868q89512j142845N5313
3231.6C47555656j70288p35817j396408p83920j76811p41768l09868j92032p36389
3240.3C42312355o43730l98522n08956n01252p88574n71899j14746p10411p28837l88793
3249.9C36956635l93677n13306m76303k07062l62892o10428p94678p65419o86035l96995
3259.6C31749840L6163m6883m38156p41882o23856n24978m68331n06897l77731j53313
$$ plain form
3194 372422981 371575737 370786819 369884300 369067535 368225861 368065453 367618408 366573524 365740356 365088081
3203.6 365088081 364585953 364103584 363619232 362695503 361712990 361047668 360423927 359799957 359225426 358745613
3213.3 358745613 358548698 358312759 357053528 356160774 355990410 355359268 354594002 353649101 352715912
3222 352715912 352087669 352057381 351734314 351131020 350689392 349814568 349532700 348643188 347500343 347555656
3231.6 347555656 347385368 346649551 345253143 344469223 344292412 343550644 343240776 343048744 342312355
3240.3 342312355 341668625 341270103 340761147 340259895 339471321 338899422 338784676 338074265 337345428 336956635
3249.9 336956635 336562958 336049652 335573349 335366287 335003395 334392967 333598289 332832870 332146835 331749840
3259.6 331749840 331786003 331739120 331300964 330559082 329935226 329410248 328941917 328435020 328057289 327903976
3269.2C27903976l74565n41839k94686J12801o51207q66547m58183p72171j74332k87933
3278.9C23595314n39169l01819m81033k27890j54000j99699o66161p06253m32911o44874
3288.5C19241505j14708J57699j40762k57740l04337o20403n05218j40381m06113m25739
3298.2C16483803o60362o53725k45152j45702k6073n50919n84545p3281n60970r09252
3307.8C12073822n88016m51718j64051o199l16372l32565n30129n56011l54652n93948
3317.4C08180161o13595n90877n18017m06875m26178m46358n59674n12428l61023m87194
3327.1C03257942j131515r83277k88467o75163q10109l99799l24268m01726p50046
3335.8B97493572p52659n18283o11992o29273o61220k99015k20032r73339o36711j59226
$$ plain form
3269.2 327903976 327529411 326987572 326692886 326805687 326154480 325287933 324829750 324057579 323883247 323595314
3278.9 323595314 323056145 322754326 322273293 322045403 321891403 321691704 321025543 320319290 319886379 319241505
3288.5 319241505 319126797 319284496 319143734 318885994 318581657 317961254 317456036 317315655 316909542 316483803
3298.2 316483803 315823441 315169716 314924564 314778862 314752789 314201870 313617325 313544044 312983074 312073822
3307.8 312073822 311485806 311034088 310870037 310863838 310547466 310214901 309684772 309128761 308774109 308180161
3317.4 308180161 307566566 306975689 306457672 306050797 305624619 305178261 304618587 304106159 303745136 303257942
3327.1 303257942 302126427 301143150 300854683 300179520 299369411 298969612 298645344 298243618 297493572
3335.8 297493572 296740913 296222630 295610638 294981365 294320145 294021130 293801098 292827759 292191048 292031822
3345.4B92031822p44819r14574q17051o40144O9007K47803m87880n65606j11618m27913
3355.1B87639027r24645p24182m15897l41626P3224l6240p72171p16438o886l2654
3364.7B83741512n99441j78356n1423l75480j05438k91825n28621l90034q8558k38743
3374.3B80893593o54888l37735j83601k78988k23064J12819K91748l69758m26579J6823
3384B78840370m44736p74021o7997O47869J86500o63662l84712J4629k43892k47116
3393.6B76863232Q5239J96304l62014o70720o370L07617j22795l78151j60675j92699
3403.3B75558968k34890K24037K55623M6692K69012k50416p03430n7697K50282N96218
3412.9B75954399M78420j58920r594L2997N5638l109N0583J47380k9964M73862L91674
$$ plain form
3345.4 292031822 291287003 290372429 289555378 288915234 288984241 289232044 288744164 288178558 288066940 287639027
3355.1 287639027 286714382 285990200 285574303 285232677 285305901 285269661 284497490 283781052 283774166 283741512
3364.7 283741512 283142071 282963715 282912292 282536812 282431374 282139549 281610928 281220894 281132336 280893593
3374.3 280893593 280238705 279900970 279717369 279438381 279215317 279328136 279619884 279250126 278823547 278840370
3384 278840370 278395634 277621613 277553616 278201485 278387985 277724323 277339611 277354240 277110348 276863232
3393.6 276863232 276948471 277144775 276782761 276112041 276105671 276413288 276290493 275912342 275751667 275558968
3403.3 275558968 275324078 275548115 275803738 275850430 276119442 275869026 275165596 275107899 275358181 275954399
3412.9 275954399 276432819 276273899 276264305 276297302 276352940 276349831 276400414 276547794 276517830 276991692 277383366
3423.5B77383366j7662J86519K19498K47612K88219K13681L46012M10804K20128K28252
3433.2B79726429M2191J69944P47891M39510M3087L69988N90992N98030N04875J8921
3442.8B83251858K82573P44877P25918Q10776N0468K51255Q18692M89711L58353L85933
3452.5B88170414R00230O27709O52542J249580M28963j32275L20626P60555N83725
3461.1B93562069O93989Q02040O34498Q01506P80659P09667O53782J000614N24922
3469.8C00163746K42252P83043N20153J167851J292305M18243M72374Q81405J045647
3478.5C06987019O02874O38447J266461R37366R2468N88265R57641R58290J082287
3487.2C14111118O43006J007824J087055R57508O37169J46751R13048J330338J371765
$$ plain form
3423.5 277383366 277365704 277552223 277771721 278019333 278307552 278521233 278867245 279278049 279498177 279726429
3433.2 279726429 279768620 279938564 280686455 281125965 281169052 281539040 282130032 282728062 283232937 283251858
3442.8 283251858 283534431 284279308 285005226 285816002 285866470 286117725 286936417 287426128 287784481 288170414
3452.5 288170414 289070644 289698353 290350895 291600475 292029438 291897163 292217789 292978344 293562069
3461.1 293562069 294256058 295058098 295692596 296494102 297274761 297984428 298638210 299638824 300163746
3469.8 300163746 300405998 301189041 301709194 302877045 304169350 304587593 305059967 305941372 306987019
3478.5 306987019 307589893 308228340 309494801 310432167 310524635 311112900 312070541 313028831 314111118
3487.2 314111118 314754124 315761948 316849003 317806511 318443680 318590431 319503479 320833817 322205582
3495.8C22205582Q82721L66325P34520J224213J228599P40891P90863O59637J073113
3504.5C29906464J387138J097946J287995J330719J066551M24843P14988R32961Q34617
3513.2C38984222J063309J265106J474839R86976R15451Q70934Q54339J349488J589050
3521.9C49353714J283913N78651J204453J413345J319961J164284Q98018J615410J337013
3530.6C60168762P06902J019287J343803J455040K266007J434860K86407J206627R94377
3539.2C70882072J488305J834945J530304J564560J683045J368103P96852J410446
3547C82558632L46413J680564K192460J500053K160034M65126J774864J821976J387711
3555.6C95887833J870880P38067K117844K362556K019196J123734J740455K277718
$$ plain form
3495.8 322205582 323088303 323454628 324189148 325413361 326641960 327382851 328173714 328833351 329906464
3504.5 329906464 331293602 332391548 333679543 335010262 336076813 336501656 337216644 338149605 338984222
3513.2 338984222 340047531 341312637 342787476 343774452 344689903 345560837 346415176 347764664 349353714
3521.9 349353714 350637627 351216278 352420731 353834076 355154037 356318321 357216339 358831749 360168762
3530.6 360168762 360875664 361894951 363238754 364693794 366959801 368394661 368681068 369887695 370882072
3539.2 370882072 372370377 374205322 375735626 377300186 378983231 380351334 381148186 382558632
3547 382558632 382905045 384585609 386778069 388278122 390438156 390903282 392678146 394500122 395887833
3555.6 395887833 397758713 398496780 400614624 402977180 404996376 406120110 407860565 410138283
3563.4D10138283J175041L044395J119614J694527K149849o27518K615166K417183
3571.1D23726540J466713J915054K486267J643715J445656K273864J500817K442970
3578.8D38901596K007027J361809J765937K528382K595520J477012L945160K685051
3586.5D57267494j59111K089653L52707K041321L005867L417168K537880J952362L619651
3595.2D76124992L73230J523018L482704K051392K945290J127548P25708K808609K636719
3603.9D93799210K608451L372994K999992O95343L664933Q15315j30806O874046K440872
3612.5E17140350o68296M744033J045456L563347M619599J723976K171592N33448J200523
3621.2E36074028K895966L525543K875175K862740K583999K828255P095070L053360
$$ plain form
3563.4 410138283 411313324 414357719 415477333 417171860 419321709 418694191 421309357 423726540
3571.1 423726540 425193253 427108307 429594574 431238289 432683945 434957809 436458626 438901596
3578.8 438901596 440908623 442270432 444036369 446564751 449160271 450637283 454582443 457267494
3586.5 457267494 457108383 459198036 459550743 461592064 464597931 468015099 470552979 472505341 476124992
3595.2 476124992 476498222 478021240 481503944 483555336 486500626 487628174 488353882 491162491 493799210
3603.9 493799210 496407661 499780655 502780647 503475990 507140923 507956238 507825432 514699478 517140350
3612.5 517140350 516472054 521216087 522261543 525824890 530444489 532168465 534340057 534873505 536074028
3621.2 536074028 538969994 542495537 545370712 548233452 550817451 553645706 560740776 563794136
3628.9E63794136p291717K833480M585686N428848K296219j23215L700219M040680
3636.6E79264336K568435J362114J994667K784653L224297K458839J587791L181420
3644.4E98426552M193573O103439J555443k832069N526580K562714j874924o16531
3652.1F13044777M740791M964295M609222N978203o153565J19515N373154K468338
3659.8F35144730K372512J148797K341346J686020K032471K227173N40161M402618
3667.5F51895828L697739J096039J825409m881287J237793O815414Q200608L52096
3675.2F70239639j4030761J843643O698303M258957j573868O79474K435608J862259
3682.9F72413254J922989Q06198M47387L576890P175674n326996l042068Q346252n489349
$$ plain form
3628.9 563794136 556502419 559335899 563921585 569350433 571646652 571523437 575223656 579264336
3636.6 579264336 581832771 583194885 585189552 587974205 591198502 593657341 595245132 598426552
3644.4 598426552 602620125 608723564 610279007 607446938 612973518 615536232 613661308 613044777
3652.1 613044777 617785568 622749863 627359085 633337288 627183723 627303238 632676392 635144730
3659.8 635144730 637517242 638666039 641007385 642693405 644725876 646953049 647493210 651895828
3667.5 651895828 655593567 656689606 658515015 653633728 654871521 661686935 669887543 670239639
3675.2 670239639 656208878 658052521 664750824 669009781 667435913 668115387 670550995 672413254
3682.9 672413254 674336243 675142441 675589828 679166718 686342392 681015396 677973328 686319580 680830231
3691.6F80830231k693558M298630J185913J570358M91028O2408J648865J590805L051453
3700.3F92036133K759781n537110l154754M763565K027054k38495L50036K947159M744644
3709G00698013n749511L294677N743561j1993637K407074L522873J43585J049347K121582
3717.7G01237564J487885k648468Q51135N348358l038712m652557M706040J926422
3725.4G05217667k8077k182846p73925K686843R07441N342254j572876o307525Q681793
3734G11970749K424545p873688o60858J873398n05447J153335L423462k610016K187271
3742.7G11382751J0473328r241562j4957046R703521M787674N567856J49307j0410003
3750.4G07455826R482422l307801p950897M310150K655640K834091l700409K284317
$$ plain form
3691.6 680830231 678136673 682435303 683621216 685191574 685682602 685745010 687393875 688984680 692036133
3700.3 692036133 694795914 689258804 686104050 690867615 692894669 692656174 693006210 695953369 700698013
3709 700698013 694948502 698243179 703986740 691993103 694400177 697923050 698066635 699115982 701237564
3717.7 701237564 702725449 700076981 700928116 706276474 703237762 698585205 703291245 705217667
3725.4 705217667 705189590 703006744 702232819 704919662 705827103 711169357 709596481 703288956 711970749
3734 711970749 714395294 706521606 705860748 707734146 707228699 708382034 711805496 709195480 711382751
3742.7 711382751 721856079 712614517 697657471 707360992 712148666 717716522 717865829 707455826
3750.4 707455826 716938248 713630447 705679550 709989700 712645340 715479431 711779022 714063339
3758.2G14063339N625611p015381k601929L475113J504898k7008L091812j365585m050675
3766.8G12700195K884598M748612J031875q602524R10111L299484J42975K58484l25470
3775.5G17048340J420822J48163K189789J227951o745682R01031J720200J145859J619415
3784.2G20675888k197037n95398N74799P52335J108856k15302m25949o97784M06418
3792.9G19386826R10034R17358K655716k513428l981933K325439L560105N292892n002289
3801.5G23550720r975891M668655K676240L434829M255753q330384l391571M061585
3809.3G20949936J899109q5144O256j89133M42658N000000j19553j1785583M246749
3817.9G20365295N205231M238815K784958j6070480n9128N010300J652145J948395
$$ plain form
3758.2 714063339 719688950 712673569 710071640 713546753 715051651 715024643 718116455 716750870 712700195
3766.8 712700195 715584793 720333405 721365280 712762756 713672867 716972351 717115326 717373810 717048340
3775.5 717048340 718469162 718617325 720807114 722035065 715289383 716190414 717910614 719056473 720675888
3784.2 720675888 718478851 717883453 718458252 719210587 720319443 720104141 719678192 718980408 719386826
3792.9 719386826 720296860 721214218 723869934 721356506 717374573 719700012 723260117 728553009 723550720
3801.5 723550720 713574829 718243484 720919724 724354553 728610306 720279922 716888351 720949936
3809.3 720949936 722849045 722763901 722770157 722581024 723023682 728023682 727904129 716118546 720365295
3817.9 720365295 725570526 729809341 732594299 716523819 716464691 721474991 723127136 725075531
3825.7G25075531M21600l029098n82504J354980L255310J646423p633743J895065O949158
3834.3G29352722m815826j184616P385406o516342m440079P506790l444137j996842
3842.1G21847076N082093j875305l353119J817627J010131M83475J454468q04977K396774
3850.7G28058243O265564l274155K95105j4590988p71332Q714218p41501j409072J727905
3859.4G24273987J925964K386322m085769N12161N338058n074692m568099K879257
3867.1G23587189L886642O016312l916702r373703J851196N139618L800125q600845
3874.8G22389832m43573L512725m65088J969910M138184l970566o766205M204025R58558
3883.5G25527802P19299M712829r945907K00195K837830J77002M938965J028442p290192
$$ plain form
3825.7 725075531 725497131 722468033 721885529 723240509 726495819 728142242 720508499 722403564 729352722
3834.3 729352722 724536896 723352280 730737686 724221344 719781265 727288055 723843918 721847076
3842.1 721847076 726929169 725053864 721700745 723518372 724528503 725011978 726466446 725661469 728058243
3850.7 728058243 734323807 731049652 731344757 716753769 715982437 724696655 723955154 722546082 724273987
3859.4 724273987 726199951 728586273 724500504 725012665 730350723 725276031 720707932 723587189
3867.1 723587189 727473831 733490143 729573441 720199738 722050934 727190552 730990677 722389832
3874.8 722389832 721946259 725458984 724993896 726963806 731101990 727131424 720365219 724569244 725527802
3883.5 725527802 726247101 730959930 721014023 721214218 724052048 724229050 729168015 730196457 722906265
3892.2G22906265K39792K980499r76410K99607Q25195L018723K747879r335556L093567
3900.9G25799561J918487m794769L599167k883225j435547O17066P59201J848221k97928
3909.6G25130234r5825j60675M09545K12861k44675J375275K104110k994003k926941
3918.2G22809906M001465n76248l905030J844559K042542J378707j447372l354416
3926G22794113L26233J920242J213532n64804K56195J370392k645951k225647J297913
3934.6G23742218O49490J64719L31650j4267k55890k23847J303483O86187k582321
3943.3G23801422K57034J162644j67999M26712j546936P25555Q67310k329560Q59070
3952G24055252O22406m02069n51605o74896N84487J66626K75193n86624O13174J178284
$$ plain form
3892.2 722906265 723146057 726126556 725150146 725449753 726274948 729293671 732041550 722705994 725799561
3900.9 725799561 727718048 722923279 726522446 723639221 722203674 722820740 723579941 725428162 725130234
3909.6 725130234 725034409 724873734 725283279 725496140 725251465 726626740 728730850 725736847 722809906
3918.2 722809906 726811371 726235123 722330093 724174652 726217194 727595901 726148529 722794113
3926 722794113 723120346 725040588 726254120 725689316 725945511 727315903 724669952 722444305 723742218
3934.6 723742218 724391708 724556427 724888077 724873810 724617920 724394073 725697556 726383743 723801422
3943.3 723801422 724058456 725221100 725053101 725479813 723932877 724658432 725525742 723196182 724055252
3952 724055252 724677658 724275589 723723984 723049088 723633575 723800201 724075394 723488770 724101944 725280228
3961.6G25280228p50046q316m5166q393j41220P5989K85263p82318n26276J27564L01743
3972.2G23809052m03824l6469P44248n4779n01557K50855L46679k39563J84250K37732
3981.9G24336624N2948k04468l25851n15442j61514M45022o4697R03931J47552q75244
3991.5G23738861P1335M48837J058808n07660r65271K06604N70373L57743m95453
4000.2G24484177
$$ plain form
3961.6 725280228 724530182 724521866 724476700 724468307 724327087 724403076 724688339 723906021 723379745 723507309 723809052
3972.2 723809052 723405228 723368759 724113007 724058228 723556671 723807526 724154205 723914642 724098892 724336624
3981.9 724336624 724389572 724185104 723859253 723343811 723182297 723627319 723562622 724466553 724614105 723738861
3991.5 723738861 723810196 724259033 725317841 724810181 723844910 724051514 724621887 724979630 724484177
4000.2 724484177
##END=$$ End of the data block
