##TITLE=$$ Begin of the data block
##JCAMP-DX=5.00 $$ ACD/SpecManager v 10.08
##SPECTROMETER/DATA SYSTEM=Varian
##DATE=14 Jan 2013 10:31:28
##DATA TYPE=INFRARED SPECTRUM
##DATA CLASS=XYDATA
##ORIGIN=
##OWNER=
##NPOINTS=3735
##FIRSTX=399.26403809
##LASTX=4000.35498047
##MAXX=4000.35498047
##MINX=399.26403809
##MAXY=77.66685486
##MINY=27.76448250
##XFACTOR=1.0000000000
##YFACTOR=0.000000100000000
##FIRSTY=49.84840012
##DELTAX=0.96440572
##XUNITS=1/CM
##YUNITS=TRANSMITTANCE
##XYDATA=(X++(Y..Y))
399.3 498484001 480229416 486088028 498036613 505748901 507228737 504481506 495858345 487799606
407 487799606 499485855 504493446 500367889 496611824 497046471 510265923 510053558 502803688 494594612
415.7 494594612 489993706 495994949 490778961 500545464 510657806 505383415 502607346 504682541
423.4 504682541 503562126 495043373 491277237 492524757 495863075 498383408 498507271 498497353 497489586
432.1 497489586 497349892 494291573 492366371 495404472 498877487 500672951 499488678 499356308 503802757
440.7 503802757 505725021 497949753 489058952 486833839 491010590 496638184 500956078 504592133
448.4 504592133 507040367 503788376 495909042 490342560 489526405 492980614 494129829 497465134 503954849
457.1 503954849 497171402 495881081 496116524 490180283 488484192 490281067 492471275 493508835 495311241
465.8 495311241 494547806 493059464 491502609 484099693 480912285 482878342 485478592 485677605 480925903
474.5 480925903 478229904 487276573 489173546 479467850 480050011 480196991 476163979 480776901 486904259
483.2 486904259 483544044 478430061 478620605 477739639 478854713 477229271 473290825 473559952 476425514
491.8 476425514 482134552 483745384 482229042 479326439 475226746 473363533 471198616 470299110 473461952
500.5 473461952 479482193 482756920 480622826 476269073 470959930 469022903 469654884 472589760 473830070
509.2 473830070 472345085 473826752 476771278 477393341 473883438 467471428 465332985 467078629 466864357
517.9 466864357 468181648 469963150 468298492 467629585 468900032 466850166 462319641 460471878 460643196
526.6 460643196 463628082 467609940 469451485 469902229 466935654 462411575 458698845 455110397 454106407
535.2 454106407 456956749 460919571 463584747 465170708 465486450 463539467 459828300 457069817 454235153
543.9 454235153 453200378 457029610 460133209 460800934 459397316 458039856 456164169 452422943 450832748
552.6 450832748 450341606 450380745 450960350 454088402 458108788 457693291 455098457 451826591 448554840
561.3 448554840 447377357 449658546 452111359 452731018 453315010 453513527 453120422 451357307 449193611
570 449193611 446491928 444934998 447494621 450970650 452662430 452461472 452597961 452357368 450856438
578.6 450856438 449147339 447004547 446406479 447252274 449103775 451736984 454032135 454305840 453035889
587.3 453035889 451313744 449051743 447997665 447928467 450721359 454831810 456589737 457686920 457023697
596 457023697 454322395 451844673 450379181 450050430 451323090 453440437 454801369 454882507 453644485
604.7 453644485 452063179 449932137 447556992 447249069 447910271 447615356 448557854 451194534 451573448
613.4 451573448 449706993 447585068 445720367 444325294 443766937 445180359 447654953 450004883 451205177
622 451205177 451682854 451446228 449899368 448612823 449360008 451498795 454476128 458599129 460847702
630.7 460847702 460828133 460930786 461730385 462172089 461648178 462901535 465564613 469199219 473054581
639.4 473054581 474683647 474936104 474652596 473994484 473401756 473502960 474845009 477196198 479851799
648.1 479851799 482777977 485391197 485631638 484285164 482565536 481245041 480458031 481056213 484773712
656.8 484773712 487963676 488896751 488283653 486435966 484846077 482975731 481473007 480823441 482163048
665.4 482163048 486275597 490796127 493038521 490875702 488274612 485287895 483304596 483531685 486398582
674.1 486398582 490012741 493712769 496926193 497881966 496486664 495262451 495724106 495769844 496013947
682.8 496013947 498572960 502189217 505710411 508546219 509769287 508661995 506355553 505009460
690.5 505009460 504410553 504496231 506964455 511716881 515339165 516388016 515947456 513638229 511004524
699.2 511004524 510741577 511524467 512488518 515163307 518741837 521201935 522101440 521999817 521054649
707.9 521054649 519559784 518981323 519934959 522286720 525852585 528610229 529921303 530083694 528427658
716.6 528427658 526521149 525670090 526239204 528102341 530510368 533181267 535478325 536652946 536047935
725.2 536047935 534370842 533047295 532437706 532936859 535145988 538450737 541849556 544576263 544836769
733.9 544836769 543177910 541537170 540545273 540268936 541162033 543497581 545742531 548440552 549714317
742.6 549714317 548626366 547522507 545696449 544264908 544544029 547919502 551386490 552636375 554207153
751.3 554207153 554765205 554062424 551934090 550903740 551872025 552936821 555187798 558083496 561425819
760 561425819 562989769 563208847 562189636 560506554 560510521 560043411 561521225 564223175 566521339
768.6 566521339 568079758 567782669 567033234 564734383 563274193 562777519 563158989 565173836 566941681
777.3 566941681 568315964 568602829 568394547 566840973 565028496 563895226 563494377 565222244 567612953
786 567612953 570191917 572156105 572784462 571955261 570715675 568928757 567030830 567432480 569190292
794.7 569190292 571237144 572121582 572340736 571130142 568657265 566286697 563346596 562323380 561842346
803.4 561842346 561415215 561545753 561617775 560427284 557252960 554528427 551060028 548418198 546366425
812 546366425 545062218 546204758 546709518 547267456 546772881 544623222 542387810 540662613 540099144
820.7 540099144 540548973 542943954 546034737 549080734 550973282 551714745 553203316 554880028 555689430
829.4 555689430 556353645 560170746 565001526 568711052 572333298 575273323 577203827 577704239 578268661
838.1 578268661 578671455 580090866 583076286 586158333 589173775 591539803 593351288 593943138 594278717
846.8 594278717 594367523 594130898 594602585 597420464 601503983 604035492 606317940 607437706 608001213
855.4 608001213 608233910 608638268 609793129 611088715 614772949 618204041 620564880 621560936 621555138
864.1 621555138 620396690 617431793 616567345 616257439 616632195 617664642 618589516 619040718 617766991
872.8 617766991 616057167 613033638 610738792 609549103 609161682 610099030 610807228 610987701 610624733
881.5 610624733 609261513 606273422 604369926 603540573 602776413 602481308 603411674 605056953 604769211
890.2 604769211 604114838 602713890 601274567 600406723 599845848 600021553 600168266 602078018 603241730
898.8 603241730 603132019 601906700 600138779 598950882 596765213 597013855 599451103 602833176 605818520
907.5 605818520 608056564 610193062 609945641 609328728 608057556 606710625 606273117 606532516 607102470
916.2 607102470 607038574 606202202 603061523 599742470 596112251 592359543 589410210 587045364 585729637
924.9 585729637 584119492 582345238 579032288 575404205 572001381 568161278 565128784 562627754
932.6 562627754 562030602 562397346 562336502 561236610 559503670 557968407 555835915 553637733 551633072
941.3 551633072 551265678 551839294 552076759 551984863 551390381 550732307 548858948 546702042 545317993
949.9 545317993 545037689 545187531 545346718 546267090 546389580 544674568 540973587 537118225 533579445
958.6 533579445 530487785 528884697 527922020 527711105 527172890 524815292 521086960 517858047 515355415
967.3 515355415 512814217 510681114 508938675 507807045 506352005 504773865 502516785 498095894
975 498095894 493532143 489155426 484451447 480509148 477150078 473646011 470164108 466360855 461349030
983.7 461349030 455498466 449565506 443706551 438893623 434588280 430070763 426802025 424247398
991.4 424247398 421161385 416627502 411821022 407940788 404028969 400344505 397368813 394764404
999.1 394764404 391930237 389633980 387405739 384602928 381314354 378502350 376030006 373019218
1006.8 373019218 371927643 371356621 370834770 369749031 367380104 365716362 363298912 361074104 358937302
1015.5 358937302 356915779 354885521 352827644 351497765 348899841 346414528 343857918 341569633
1023.2 341569633 339320869 337043266 335419426 333744164 332811050 330794525 329945641 329450417 327744064
1031.9 327744064 326180611 324962730 325059814 324539680 325425339 326868820 328478470 330765877 332013626
1040.6 332013626 332984352 333367462 334509926 335261230 335860634 336172447 335955772 336083984 335449600
1049.3 335449600 334528160 332490578 330927696 329093933 327608109 327198906 327116127 327817764 326387024
1058 326387024 326447716 327712326 328654251 329702415 330877190 333744011 336450844 339400291 340830765
1066.6 340830765 342595215 344639206 344882774 344944115 345499458 347531891 348095093 349015121 350299225
1075.3 350299225 350761414 351933212 352654610 352970848 352283363 353063011 354528656 356172981 358402367
1084 358402367 359811745 361206856 362242889 363462906 363681564 364090843 365368233 367523766 370482216
1092.7 370482216 372369537 374100227 375484581 377039566 377825279 378591728 379790382 380898552 382993546
1101.4 382993546 385254478 387345772 387869339 389532661 391545601 391964073 392218857 391897087 392535515
1110 392535515 393386803 394991150 395797997 396465721 398376312 398936272 399488258 398955421 398914604 399571037
1119.7 399571037 399917145 400768089 400853043 400914230 400541687 401210175 401969872 402658386 403600960 403810539
1129.3 403810539 405799637 408410606 411528816 414101028 415759354 417714882 419027557 420612259
1137 420612259 422550735 424234581 425822601 428484612 431162872 432549744 433369179 434161682 434610329
1145.7 434610329 434469452 434989548 435921097 437153893 437537155 437094803 437094040 436525536 436276398 435421333
1155.4 435421333 433950386 433465118 433818359 434370155 433863258 433034706 432230301 432271233 432575760 432828102
1165 432828102 434187126 435855331 438137169 440592690 443424568 445984917 448083344 450803337 453538475
1173.7 453538475 456265488 459202919 462389717 465448303 468511658 471428185 473744125 475641594
1181.4 475641594 477477684 478771172 480067787 482080574 483738441 485448914 486861839 487456894
1189.1 487456894 487635269 487579308 487359352 486698685 486082726 485790901 485871925 485420685 484206238 483226700
1198.8 483226700 482021141 480440559 479032745 478013878 477285881 476523666 475425644 474300499 473890953
1207.4 473890953 473216705 471937141 471060181 470680313 470675621 470452576 470109940 469910507 469536285 468954277
1217.1 468954277 468319588 467690201 466982765 466615868 466231575 465737000 465691414 465541573 465106125 464622192
1226.7 464622192 463674164 462356606 461660156 461204567 460236282 459195518 458589020 458584251 458591805 458331108
1236.4 458331108 457725754 457204018 456790810 456417465 456501236 456310349 456216850 456152458 455810242 455395737
1246 455395737 454832268 454290657 453584213 453482513 453101425 452585297 452993622 453040352 452886009 452765121
1255.7 452765121 452672348 452460327 452124710 451764908 451768913 452609138 453036461 453368492 453791885 454087982
1265.3 454087982 454565315 455174675 455977097 456723251 457667198 458863945 459975700 460901222 462193069
1274 462193069 463483009 464605255 465904312 467032661 468142395 469434700 471204033 472595291 473695831
1282.7 473695831 475231247 476943817 478760262 480395927 481986656 483464813 485197563 486780243
1290.4 486780243 487786636 488538933 489242973 490176849 491237068 492293739 493337097 494676590 495519257
1299 495519257 496091461 496516495 496656914 496932716 496851234 497324028 497592926 497662277 498088455 497622070
1308.7 497622070 496410179 495529518 495523796 494894218 494012299 493719597 493715172 494060707 494464989 495328293
1318.3 495328293 495550041 495707054 496286278 496541786 497295418 498278351 499293175 500315323 500980301
1327 500980301 500809517 500509605 500059395 499256134 498724747 498281746 498244858 498261719 498362236 498222198
1336.7 498222198 497720566 497650070 497623672 497441559 497290955 498137665 499296150 500066452 500696869 501474876
1346.3 501474876 502090836 501333771 501110687 501404839 501505241 501541824 501460609 501956978 501797180 501389046
1355.9 501389046 500929909 500413094 499693832 498937988 498470230 498197861 498894806 498472443 498019714 497839203
1365.6 497839203 497215881 496627350 495567093 495213089 494981804 494967880 495074883 495490685 495948830 495038681
1375.2 495038681 494583740 494103851 494027176 493652534 493232803 493111458 492480125 491699104 490145760 488672066
1384.9 488672066 487762375 487505493 485140076 483047295 482685356 481466713 480370064 478741264 477412491
1393.6 477412491 475142288 471341743 469761581 468159561 466958580 464259644 461686287 460308838
1401.3 460308838 458524971 456781654 454829597 452414665 449621773 448041611 446627274 444905739
1409 444905739 443503036 441557961 440013313 438549194 437446365 436402550 435337486 435123672 434290428
1417.7 434290428 434331131 433128510 432717018 433678207 433681717 434480057 434320755 434358406 434959679 435652428
1427.3 435652428 437183495 438271561 439534187 440023689 441321411 442626724 443866997 445724297
1435 445724297 447035332 448743324 449944077 452542496 454431496 455909233 457357445 458059044 459670258
1443.7 459670258 460752716 462408600 464097595 465962067 466654167 467167358 469121094 470404549 472035599
1452.4 472035599 472598495 474278336 476969566 479087906 480483742 479895897 483329315 484228630 486129036
1461.1 486129036 488085632 489546623 492153358 493570557 496430054 498558617 500581436 502715950
1468.8 502715950 505015068 507851677 510138359 512820168 515123672 519161301 522949371 525872574
1476.5 525872574 527486992 529265976 530971298 532486382 534358025 535642471 537315559 539118996
1484.2 539118996 540627556 542384987 542856598 542623024 544048271 544646263 543100471 542651749 543018646
1492.9 543018646 542528496 541884346 541726990 537136040 536793060 535520782 531513786 530999985 530018845
1501.6 530018845 528915367 527680397 528086433 529412842 526808052 521959496 521193657 522255173 520836945
1510.2 520836945 520711517 520528450 519295425 519105988 518281021 517886467 516711578 513634872 513899879
1518.9 513899879 515533485 515620041 513681793 514362640 515631790 517257500 515769615 515499115 517136688
1527.6 517136688 517882652 518448486 519402008 520747223 521922531 523146400 521777878 522458687 523382187
1536.3 523382187 524095039 526278419 527679977 527321396 525962067 525717087 526828690 528871078 529904938
1545 529904938 527577324 528332634 529287529 531094284 532180443 530956383 531555634 531895256 533100319
1553.6 533100319 531544266 530925827 532592049 534228020 533949776 528545036 527486382 527131081 527804222
1562.3 527804222 526529579 525207710 522793083 520218697 519440956 518176041 517941284 510077591 507295952
1571 507295952 504956589 501076965 498371468 495864677 495384903 483507538 481347084 478568764 474361610
1579.7 474361610 470203590 464285011 460441666 454702644 451033478 445930481 441753349 437498856
1587.4 437498856 432213211 428992271 422845497 419401665 413541641 409244576 404676247 399421310
1595.1 399421310 396894722 391787529 389235229 384365501 381520462 377257652 373146629 370939941
1602.8 370939941 366236076 364522247 361017036 360078659 356992912 355049133 353243103 349670181
1610.5 349670181 349265175 346074524 346168213 344528618 345072479 345548820 339435005 340510826 338886337
1619.2 338886337 339729691 337923508 338806648 339099464 336950569 338202705 337898445 340193672 338446312
1627.9 338446312 339184494 339147568 339593124 341076660 341061058 343734131 344170303 347347183 345524139
1636.6 345524139 347817497 349411507 350544243 353513603 354038506 356862068 357324104 360037613 362908707
1645.3 362908707 363498955 366306305 364648781 367935867 368929863 371929131 374261208 376051712 376892509
1653.9 376892509 374885445 378697433 379495125 381383362 382162514 384002495 386603203 388735352 392256279
1662.6 392256279 392433891 396262016 398609428 401363945 404333611 407468147 412394104 413978500
1670.3 413978500 419156723 421836433 426011505 430045853 433178177 436513786 439427681 443809052
1678 443809052 447025642 452312698 456734734 461928635 468002586 472078056 477444763 477560883 482942162
1686.7 482942162 487528610 492173920 497196083 501652908 507024231 511531067 516456566 521559563
1694.4 521559563 527012863 529577942 534718475 540881386 547468491 553994293 552501831 558485451
1702.1 558485451 563328323 567771378 571316719 575174179 578276405 580377045 584221725 587575302
1709.9 587575302 590232010 592481003 595143471 598132668 599155655 600421104 604062309 607609062
1717.6 607609062 605529938 607665024 610448074 611931038 613392105 614640884 615383720 616638908
1725.3 616638908 618479424 619892731 621516533 623710670 624168167 624933624 628473434 632172813 632025070
1734 632025070 628574600 631285629 634591560 636626282 639755287 641344681 640042725 643273697 646243896
1742.7 646243896 647742615 649416428 653003464 657034683 659950256 663201828 664575729 668440781
1750.4 668440781 670778961 670823212 674949570 678105621 681426620 685340805 686860809 688346481 690497513
1759 690497513 692722244 695982590 696261978 696364136 699638138 702113800 704457550 706944046 708862000
1767.7 708862000 707261810 708506317 712325668 713786469 713706360 712408600 715491028 717917557 717726212
1776.4 717726212 719430389 720137253 721051712 721464462 721218796 722341843 724502335 726782761 726845551
1785.1 726845551 727249908 728373566 728568878 728517761 730073318 731624680 732962799 732431641 731659241
1793.8 731659241 734886627 736346359 736023178 736343460 737568283 738664780 738274078 739964218 740102768
1802.4 740102768 741002731 742748337 743073196 743344879 743244476 743392105 744004669 745415649 745697403
1811.1 745697403 747086945 748758850 748939514 749239578 748912048 749609604 749201431 749354095 750592346
1819.8 750592346 751323318 753034363 753398209 754434738 755861893 753920441 752399979 753540344 755656662
1828.5 755656662 756638031 755488739 755718460 757465363 757510147 757231827 757271500 757619781 757994080 757384033
1838.1 757384033 758743362 759709625 760576859 761453857 762848282 763818436 758936691 759719543 761507797
1846.8 761507797 762321167 762557907 762970963 763952408 764178238 764591980 763669891 763399200 763422012 763682404
1856.4 763682404 764777679 765379028 766395416 766641769 767189560 766787109 766377945 766275864 765842667
1865.1 765842667 766513443 766817169 768740082 769207840 768053818 768278198 768395538 768346405 767825851
1873.8 767825851 768322525 768455887 769069977 769862900 770487289 770834503 770202103 770215988 769289627 769278793
1883.4 769278793 769482651 769681473 770901489 771518555 772780762 773295212 771908188 770731888 771099777
1892.1 771099777 771226654 771283417 772083740 771993027 773046951 773535309 773532867 772965546 772236023 772237625
1901.8 772237625 771646194 772418442 773150787 773742752 774292068 774519882 774535446 774253845 773942719 772880630
1911.4 772880630 773386993 773754501 774435272 775148544 775220566 776558609 775073929 773890610 774363251
1920.1 774363251 774532700 774931488 774699783 774707108 775093460 775566101 775120010 774977036 774647293 774305344
1929.7 774305344 774511185 774497223 775248718 775233841 775554581 775962906 775705719 775258102 774652100 774354935
1939.4 774354935 773942184 775491028 776668549 776009903 776270142 776570358 776116638 774786453 774042740
1948.1 774042740 773864899 774700928 775226746 775349350 775863113 775815430 775874939 775123901 774633713 774200287
1957.7 774200287 773747330 773859482 774260712 775279694 775385513 775514069 775217209 774712524 774384995
1966.4 774384995 773456116 773239059 773855972 774970322 775323257 775827789 775710983 774827576 774198837
1975.1 774198837 773159637 772849274 773025131 773985748 774653549 775205154 775618134 775053940 774688034
1983.7 774688034 773825607 773562393 773230286 772878113 773086700 773627090 774850769 775045013 774340286
1992.4 774340286 773286438 772831268 772344284 772248764 772971802 773221893 773818130 774085999 774571915 774092865
2002.1 774092865 772828598 771812592 770997467 771511002 771711349 772473755 773204651 773560333 773586578
2010.7 773586578 772743988 772220154 771007309 770467377 770554199 771045761 771812668 772256012 772480698 771863785
2020.4 771863785 771720810 770813828 770022278 769702148 769225311 769593964 770257874 771194153 771415634 771311340
2030 771311340 770541992 769765320 769253922 768748550 769147415 769241104 769876099 770146408 770334473 770467682
2039.7 770467682 769663544 768896484 767649078 767343674 767468033 768178482 769214249 769452667 769125824
2048.4 769125824 768470383 768412094 767465515 767057190 767160873 767090759 767823181 768396835 768735046 768359146
2058 768359146 768265457 767737579 767100372 766749725 766362076 767178497 767687759 768099136 768236771 768169785
2067.6 768169785 767669373 766901855 766842957 766416855 766361008 766467514 767110519 767580719 767526855 767431183
2077.3 767431183 767057419 767064438 766231079 765964661 766135101 766467514 767024155 766929550 767311249 766986923
2086.9 766986923 766241150 765341415 764954987 764940491 764916916 765637512 765891190 766191788 766111221 766060562
2096.6 766060562 765374908 764384460 764478836 764469376 765138168 765454178 765709305 765725250 765090942 764575348
2106.2 764575348 763792648 763474350 763137360 763390732 763516464 763703537 763986740 763925400 764456177 763937073
2115.9 763937073 763469162 763112640 762746353 762862091 763348236 763925323 763403244 763478317 763346710 762850266
2125.5 762850266 762483978 762254181 762545929 762549362 763255234 763734512 763842850 763527222 762998123 762524643
2135.1 762524643 761734238 761925888 762133789 762681656 763323593 763425674 763132324 762842636 762953415 762227402
2144.8 762227402 762094421 762444992 762660828 762761459 762899323 763491516 763405075 763026886 762563629 762641678
2154.4 762641678 762657852 762514877 762710419 762982864 763490601 763311386 763605576 763576355 763037491 762782135
2164.1 762782135 762390442 762595062 762788925 763369217 763688354 763688049 763466568 762933273 762781296 762562027
2173.7 762562027 762987671 763107452 763044357 763427734 763963318 764322433 764173584 763954010 763214340 763108978
2183.4 763108978 763237762 763462677 764038467 764476395 764889450 764543762 764236298 763557205 763320999 763606415
2193 763606415 763817444 764335556 764550705 765048523 764719696 764563980 764395294 763763580 763968353 764056396
2202.6 764056396 764324799 764433136 764949341 765045471 764797745 764799500 764183731 764350662 764403152 764479141
2212.3 764479141 764367981 764461365 765269470 765390396 765542297 765279160 765086670 764766006 764336929 764564133
2221.9 764564133 765000305 765557632 765584641 765317459 764709091 764645538 764997177 764997635 764937744 764872589 765025101
2232.5 765025101 765145721 765705719 765561142 764933548 764546280 764319687 764270325 763936005 764622421 765128021
2242.2 765128021 765505219 765934525 765532150 765101318 764686356 764374466 763786163 764314728 765018845 765355453
2251.8 765355453 765680542 765346146 765432892 764524307 763929901 764207535 764492645 764824524 764796066 765291290
2261.5 765291290 765412521 765621643 765357895 764636383 764116898 763757248 764049683 764047775 764344635 764387283
2271.1 764387283 764783401 765199814 764969330 764839249 764322128 764215469 763730698 763727264 763872681 764128799
2280.8 764128799 764792938 764579697 764601212 764011536 763624573 763131485 762818985 763244095 763390961 764204712
2290.4 764204712 764156418 764157715 763603668 762804489 763084869 763060532 763288040 763021851 763703003 764186096
2300 764186096 763897858 763952408 763376236 763130646 762799835 763105621 762912064 762795868 763735504 764239578
2309.7 764239578 764482269 763825150 763614349 762826462 762162781 762470779 762476883 763131485 763484802 764038849
2319.3 764038849 764431992 764110413 763119659 762946167 763340836 762963181 763688660 763932724 764254456 764375076
2329 764375076 764477310 764540024 763247833 762811661 762542572 762872314 762754059 762454529 762538834 762248077
2338.6 762248077 761926270 761311417 762212830 762888336 762533035 761057816 760057373 760846252 760771561
2347.3 760771561 759967117 760200424 761519470 761407776 760832062 761135788 762232208 763541336 763968964
2356 763968964 765298386 762925262 761199112 761478424 760455399 760256348 759695435 760400696 760697784
2364.7 760697784 760497589 759176407 759049377 759648819 758524780 758268890 757853699 757824554 757600098
2373.3 757600098 757534103 756995621 756303329 756504288 755572205 754943237 754610596 754184341 753681793 753545914
2383 753545914 753725281 752900696 752362976 751962280 751684570 751451035 751121979 751096115 750928955 751076202
2392.6 751076202 751037827 751035233 750637970 750025177 749698105 749176483 749104538 749048996 749172668 748997116
2402.3 748997116 748706055 748684845 748190079 747796936 747422485 746887741 746559296 746797867 746571274 746392593
2411.9 746392593 746917038 746722107 746127548 745455322 744949799 744832840 745271149 745423584 745082855 744746857
2421.6 744746857 744092026 743781509 743029251 742610397 742384186 741664200 741743774 741908112 742092896 741834030
2431.2 741834030 741386871 740916672 740384293 740106125 739494934 739382706 739286499 739230194 739300385 739199448
2440.8 739199448 739023819 738371429 737688522 737067642 736906891 736744614 736673126 736441269 735840225 735740051
2450.5 735740051 735532608 735247040 734812851 734725189 734231949 733432846 733486710 733329086 733445816 733649445
2460.1 733649445 733518372 732578888 731503983 731088486 730530701 730534668 730487061 730395584 730259705 729890518
2469.8 729890518 729623184 729235458 728920593 728058929 727405243 726953201 726401825 726176758 726143112 726008911
2479.4 726008911 725514221 725449295 725221481 724681473 723979950 723417435 723169022 722735748 722465057 721834641
2489.1 721834641 721774902 722019043 721508789 720641327 719864044 719694901 719690781 719805756 719121170 718469467
2498.7 718469467 718261337 717534256 717136917 716747360 716466751 716179810 715908203 715421371 714792480 714417191
2508.3 714417191 713911057 714004974 713676682 712917328 712239609 711823273 711908188 711648865 711410904 710991440
2518 710991440 710574951 709788208 709189758 709158554 708595276 708554993 708628540 708239212 707761383 707613525
2527.6 707613525 707500153 706858139 706212540 705797729 705670090 705088043 704765167 704610367 704017105 703630753
2537.3 703630753 703342056 703200226 702517395 702125320 702075119 701690903 701586456 701338577 700848846 700251007
2546.9 700251007 699832535 699268570 698992920 699076843 698819580 698329010 697614288 697201309 696728897 696582184
2556.6 696582184 696376266 695864563 695805283 695503845 695131378 694416122 693894806 693838272 693756943 693379135
2566.2 693379135 692666550 692258377 691578674 691523209 691674805 691379929 691246872 690674973 690275345 689867401
2575.9 689867401 689222107 688546829 688201141 688376999 688466568 688174210 687471695 686914291 686405563 686035461
2585.5 686035461 685519333 684855118 684441452 684145584 684041443 683832626 683972015 683879700 683224030 682444153
2595.1 682444153 681995010 681959000 681607437 681365967 680799332 680452652 680160599 679467316 679161606 678708191
2604.8 678708191 678304825 677505722 676896362 676571350 676136627 675977478 675575562 675309219 674693985 674179077
2614.4 674179077 673668365 673122635 672993317 672566681 672519989 672314987 671819916 671198502 670573273 669908905
2624.1 669908905 669090042 668860550 668386841 668003922 667748947 667431641 667236710 666947937 666502228 665563812
2633.7 665563812 665105057 664746246 664493637 664447632 664130630 663759842 662924576 662273102 661873016 661502991
2643.4 661502991 660793686 660133133 659887466 659473953 659089584 658630905 658603363 658294983 657849731 657486725
2653 657486725 656580353 656104202 655763016 655651169 655348740 654714508 654471359 654465866 654171677 653240356
2662.6 653240356 652627106 652223434 652180939 652147064 651797409 651671600 651422653 651266403 650916672 650678940
2672.3 650678940 650020981 649016037 648748322 648649063 648588715 648446503 648237839 647708893 647413940 647081528
2681.9 647081528 646335220 646102142 645744019 645491333 645125732 644632416 644451599 644097824 643532333 642797775
2691.6 642797775 642334442 642039871 642042313 642085190 642019653 641774445 641368942 640948715 640185699 640272369
2701.2 640272369 640285721 639614792 639053993 638661804 638698044 638502426 638355408 637873878 637336006 637071304
2710.9 637071304 636624756 636260223 635837479 635850410 635708008 635475006 635031357 634593506 634620171 634100838
2720.5 634100838 633903084 633773384 633512115 633324699 633136330 632801437 631888313 631609077 631605301 631683922
2730.2 631683922 631736908 631365242 631003304 630542030 630228386 630065193 630032120 629645424 629252930 628923035
2739.8 628923035 628476067 628406830 628358078 628499718 628231544 627859039 627867393 627776108 627615891 627436256
2749.4 627436256 627326088 626693382 626113739 625683289 625434380 625591278 625482292 625192261 624594193 624369278
2759.1 624369278 624300117 624148445 624100113 623648224 623268280 622869987 622372093 621774521 621379967 621486130
2768.7 621486130 621544037 621093636 620711632 620667038 620273437 619978333 619351654 618646431 618588257 618511581
2778.4 618511581 617915421 617402916 617792816 617362938 616632843 616351433 615699959 615244675 614711647 614372177
2788 614372177 613971748 613664360 613251762 612521706 612024803 611301003 610836143 610361176 610147972 610000687
2797.7 610000687 609505424 608744316 607616539 606999664 606031418 605233612 604674911 604016457 603959923 603530655
2807.3 603530655 603188896 603046227 602452240 601362801 600569000 599974060 598922577 598127136 597559357
2816 597559357 597108612 596282654 595808105 595629539 594553947 593292274 592333717 591727715 590765991 590038071
2825.6 590038071 589733734 589124870 588376198 587368393 586420593 585381355 584787560 584127388 582908630
2834.3 582908630 581972198 581240692 580604248 579289207 577699013 576248474 574738579 573276405 571844101
2843 571844101 570433350 568688469 567042313 565190582 563091660 560895996 558825836 556921158 554969215
2851.7 554969215 554139481 553727303 553463020 552875633 551840897 551983490 552141037 551704292 551101570
2860.3 551101570 550659866 550545349 550352707 549784203 548991432 548580132 547665405 546408310 545535774
2869 545535774 544494057 543651962 543471107 543144646 542473602 541738586 540669937 539865456 538960228 538300819
2878.7 538300819 538062859 537134018 536318245 535520973 534742470 534168015 533606796 532915001 531792793
2887.3 531792793 531000977 530017319 528941917 528140831 527198830 526303787 525534706 524949532 523942947
2896 523942947 522754402 521686401 520886230 520373077 519401741 518503723 518002625 517552414 517023544 516148605
2905.7 516148605 514993172 514099770 513390732 512563896 511712914 510788536 509720955 508306808 506654778
2914.3 506654778 504681625 503401031 502864914 501487617 499879684 498540535 497674942 497055244 496341133
2923 496341133 495521202 494447975 494033203 494156914 494326019 494186554 494432716 494940300 494845810 494989166
2932.7 494989166 495100784 495229454 495300102 495598373 496202469 496765099 497860985 498645706 499359398 500193787
2942.3 500193787 501052017 501564331 501584511 502121391 502237663 502675705 503825951 504573021 505267410 505979919
2952 505979919 506404076 506402931 506656952 506944733 507215767 507664337 508140297 509126816 510282936 511007767
2961.6 511007767 511028328 511044159 511471481 512018127 512570381 513538742 514636765 514945946 515419235 516186066
2971.2 516186066 516719131 516983643 517449303 518176270 518596649 519407463 519920235 520191231 520514603 520401382
2980.9 520401382 520632362 521069031 521623039 521859741 521687241 521993027 522861061 523499107 523463974 523375320
2990.5 523375320 523512077 523510208 523005638 522714119 522822113 523152351 522982712 521913300 521601334 521445198
3000.2 521445198 521083450 520968704 520512466 519841423 519225578 518948174 518419342 517795639 517426071 517098083
3009.8 517098083 516569824 516048241 515673676 514953804 514573212 513960876 513293495 512793427 512048111 511749039
3019.5 511749039 511067581 510245438 509433250 508724403 508154678 507218781 506357079 505459557 504798660 504041672
3029.1 504041672 503618202 503113518 501864662 501158981 500740509 500302048 499448547 498528061 497457390
3037.8 497457390 496387749 496059608 495396843 494690895 494213905 493529587 492234726 490961380 490158043
3046.5 490158043 489241180 488676453 487966347 487416801 486871643 485640755 484572372 483862877 483117371
3055.1 483117371 482252884 481697311 480889549 479901009 478925171 478126259 477614174 476808434 476361237 475835953
3064.8 475835953 475278625 474466438 473261948 472555847 471637383 471056252 470771332 470314903 469644203
3073.5 469644203 468708992 467990532 467454681 466861496 465980263 465634651 465174522 464461861 464169426 463817635
3083.1 463817635 463217201 461723137 460500069 459645386 458847504 458383560 457734184 457336502 456648979
3091.8 456648979 455955658 455097351 454349251 453920250 452802010 452263832 452021332 451425476 450519829
3100.5 450519829 449724846 449127655 448151016 447866325 447474518 446403847 445522652 444810181 444044914
3109.1 444044914 443476181 443161011 442235565 441383858 440807457 439959145 439163437 438553009 438053513 437224426
3118.8 437224426 436679077 436300087 435453644 434362869 433180389 432700424 432406425 431408386 430151825
3127.5 430151825 428945122 428163681 427596664 426798210 425925179 424923210 424281883 423871422 423093071
3136.1 423093071 422317505 421520309 420831184 420223351 419464073 418541298 417516594 416697998 415728760
3144.8 415728760 415161552 414914589 414153366 413415108 412621231 411837006 411201439 410258484 409245796
3153.5 409245796 408355675 407305298 406504517 405776253 404707565 404030380 403307304 402355957 401480675
3162.2 401480675 400803795 400223160 399208450 398668137 398123932 397051430 396262093 395879974 395475235
3170.9 395475235 394314156 393197365 392152596 391070442 390391464 389456100 388622627 388143311 387520103
3179.5 387520103 386607704 385982056 385462151 384498978 383812828 383251152 382349281 381558876 380808182 379862862
3189.2 379862862 379306450 378472443 377202339 376373291 375515327 375102997 374680977 373857002 373171082
3197.9 373171082 372146339 371319237 370663071 369937325 369237442 368662605 368145828 367463493 366865463
3206.5 366865463 366174355 365606308 364796944 363927116 363548660 363185349 362884140 362311363 361496544 360667877
3216.2 360667877 360045471 359599457 358829880 357969475 357370033 356885605 356171646 355859299 355449524 354616013
3225.8 354616013 354079742 353239899 352671814 352435341 351882133 351297646 350586433 349588280 348660164 348213463
3235.5 348213463 347470474 346536903 346197319 346148109 345925522 345353737 344666901 343973541 343465691 343091049
3245.1 343091049 342595673 341822739 341312485 340979462 340367203 339963417 339035454 338496704 338490639 337630920
3254.8 337630920 337035141 336450958 335849609 335595131 335181694 334639168 334146233 333842201 333186951 332839088
3264.4 332839088 332802734 332499428 332036705 331163673 330755196 330613670 329937325 329198837 328884964 328695374
3274 328695374 328218155 327692108 327167892 326853218 326373901 325854492 325846710 325694084 325272903 324994316
3283.7 324994316 324879761 324378738 323727341 323227081 322604790 322520447 322390175 321724739 321323776 321077614
3293.3 321077614 320937386 320634499 320177536 320103035 319512959 318497086 317987728 317586517 317335663 317079163
3303 317079163 316903019 316942863 316476135 316218147 316037655 315089321 314231148 313628197 313237476 313033352
3312.6 313033352 312565804 312048473 310989666 310166664 310746632 310604000 309727287 309431973 308945751
3321.3 308945751 308432426 307898693 307670803 307348156 306392441 305667820 304761105 303918552 303131237 302376842
3330.9 302376842 302091751 301600685 301233463 300964241 300681858 300383396 299473877 298380985 297654724
3339.6 297654724 297231770 296744251 295978870 294936695 294500275 294505692 293836708 292998180 292473850 292314396
3349.3 292314396 291983891 291332455 290819550 290531826 290480766 290086212 289482822 288889465 288701000 289014359
3358.9 289014359 288719063 288060207 287443924 286827850 286452618 286352043 286198921 285700436 285390034 285028477
3368.6 285028477 284429913 284233704 284182549 283922806 283498440 282815723 282455597 282473431 282097836 281991005
3378.2 281991005 282076225 281618614 281096230 280653191 280566559 280724277 280780735 280638237 280369644 280536633
3387.8 280536633 280295124 279648705 279803028 279837418 279131165 278512211 278291416 278416824 278793621 279013252
3397.5 279013252 278573971 278061104 278195400 278186131 277952709 278065605 277941799 277703552 277692413 277765503
3407.1 277765503 278121014 278422871 278054142 277644825 278239117 278513699 277925301 278115826 278181915 278065224
3416.8 278065224 278844223 279324474 279448719 279477043 279422779 279444695 279069195 279062233 279605103 280065174
3426.4 280065174 280518818 280963879 281348495 281535892 281599064 281907368 282149677 282268467 282754135 283032188
3436.1 283032188 283106499 283557739 284139214 284704609 285024948 285198250 285171509 285156746 285702553 286860676
3445.7 286860676 288206596 288738098 288889847 289178543 289555492 290043621 290746365 291802902 292277355
3454.4 292277355 292786884 293599815 294113274 294518871 294946251 295801964 296274147 296629982 297429371 298492298
3464 298492298 299546146 299731846 299890881 300310478 301068134 302056808 302853031 304040260 305024948 305975037
3473.7 305975037 307238197 307910023 307946072 308308010 309187794 310202427 311142597 311622601 312264919
3482.3 312264919 313007469 313982449 315389729 316045609 316561241 317849998 319135838 319898758 320716362
3491 320716362 321716614 322404175 322646370 323454666 325057907 325766144 326240120 327280045 328333664
3499.7 328333664 329322891 330629005 332082863 332293549 332711792 333945961 335259819 336687317 337737770
3508.4 337737770 338766632 339873695 340984344 341834908 342701378 343854599 344976044 346084824 346935577
3517.1 346935577 347635460 348512840 350139961 351662750 352869453 353996696 355012360 356744270 357927666
3525.7 357927666 358887711 360066910 361153717 362198563 363212776 364552650 365791664 367134438
3533.5 367134438 368131256 370127449 372184982 372670135 373973961 375350609 376698647 377616920 378963737
3542.1 378963737 380951843 382418785 383824806 384911613 387019157 387945175 389199944 391213188
3549.9 391213188 393160858 395786858 396070557 397356606 398774414 400142097 402120247 402641563 404650307
3558.5 404650307 407103500 409161377 409923820 411906166 414498291 415384216 419328995 421557465 421946297
3567.2 421946297 422723007 422925224 426046295 428052254 429906731 432100258 434490814 436361389 437782364
3575.9 437782364 440049591 441845589 444599075 446511993 447671776 449472122 452154770 454799004
3583.6 454799004 455962486 459540176 462302475 463176384 465180588 465272293 467812271 471044807 474683495
3592.3 474683495 476979599 478098221 480748634 481304245 484075508 487674561 489676323 492814789
3600 492814789 494430161 495797424 498279610 500647430 502941475 505778122 508782768 509783134 513770943
3608.7 513770943 515279961 515286179 521715736 524348869 523842468 527300301 527636299 531650085 536613426
3617.4 536613426 538896370 541829453 542723198 544063492 546533623 549465599 552372284 554939194
3625.1 554939194 557781334 561407433 567546577 569651909 564094734 567253914 571608009 576573143
3632.8 576573143 578888817 578889618 581986618 585707970 588880234 590421410 592006416 595134201 598560104
3641.5 598560104 600948601 602691803 605736313 609707031 615598145 617236061 615048676 621189117
3649.2 621189117 623084984 620771637 621011772 625536346 630161591 634150200 639040146 633873138
3656.9 633873138 635124245 640771790 643019180 644951859 646004868 648282471 649994583 651603012
3664.6 651603012 653311691 654225540 658757324 662610016 665327377 666554871 659315796 661458740
3672.3 661458740 669293289 678487167 680693588 665190506 665240402 671658020 676878586 675911484 676165085
3681 676165085 678790131 680442581 681353760 681370468 682075195 686335068 693487854 687573929 683793259
3689.7 683793259 691961823 688222046 686471939 690632477 691029663 691911392 692610626 693192749 694851379
3698.4 694851379 695720367 698280106 700995941 696208572 693584671 697503204 699686050 700660934 701043243
3707 701043243 703572311 707890549 702491531 706247940 711397400 700002441 702945251 706316223
3714.8 706316223 705641708 705824738 708404236 710601425 707966919 708387527 713319702 711300278 706810226
3723.4 706810226 710944901 712724609 712447433 710333557 709144974 712176895 713847427 719189911
3731.2 719189911 718108597 711946564 720366135 721675568 713888016 713474579 714649658 714398575 715230484
3739.8 715230484 718282928 715341644 717506104 728571701 722426529 708122940 715620575 720288849
3747.5 720288849 725632706 723614426 715004272 724996948 721378479 712237244 716001816 719233780
3755.3 719233780 722722168 719732056 721457825 726656342 720300293 717725372 721118317 722849731
3763 722849731 722760162 725250320 724135971 720342941 723135834 727609406 728118591 720867462 721988983
3771.7 721988983 724350433 724018097 724646683 724429703 725248108 725620499 728621597 729874191 722798843
3780.3 722798843 724510574 726610641 727261810 728924561 726596909 725565338 725840149 726030807 726592407
3789 726592407 726707077 727016525 726892166 727302551 727219696 728514938 731790619 728550186 724866180
3797.7 724866180 726855087 730538635 736574783 732137527 722529144 725748138 727716446 731911774
3805.4 731911774 737290039 728190460 723889160 727956390 729779053 729996948 729810104 729427567 730477142
3814.1 730477142 735851212 735164566 722888107 727089844 732414551 737807922 741254883 724861755
3821.8 724861755 724602814 728525696 729899139 732176437 733012314 730336838 729535828 730830231 733994827
3830.5 733994827 736230850 729334183 730697403 737345200 732295990 731125793 738650208 731877441
3838.2 731877441 727308044 734356918 730773315 729224319 735139313 734523849 730474319 731234512 731895523
3846.9 731895523 732413483 733953629 733084946 735115204 739418793 734952164 738323364 724455948
3854.6 724455948 723522568 732701263 731974411 729921112 731335220 733610764 736283798 731736069 732255707
3863.3 732255707 738695602 734149933 728297806 730466003 734062653 739853516 736635437 728027115
3871 728027115 729761429 735177765 739018478 730278091 729661942 732467194 732089615 734283295 737772675
3879.7 737772675 733766937 728139038 732936554 733775864 733800125 738353119 728969498 728804169 731646957
3888.3 731646957 732354813 737260742 737992401 730793381 731259537 734161224 732765961 732767715 733134842
3897 733134842 735735779 738868103 730542984 733980865 736068954 730784149 734164200 731628799 730054092
3905.7 730054092 730366440 731002350 732762985 732490463 732917099 732866821 732721329 732736816 732628555 733868103
3915.3 733868103 735684052 733637543 730485306 733625870 734253998 730849457 731739120 733157501 734891586
3924 734891586 733860931 730482254 730915756 732275162 733355865 732517319 732768936 735716782 734044571
3932.7 734044571 731750107 732059250 731903687 732071762 731845474 731811600 732156601 732059631 733492432 734653549
3942.3 734653549 731793213 731314850 732270966 732064667 732724915 731259842 731392899 732014084 730762177
3951 730762177 732565231 733027725 732286453 731976089 731591034 731813278 731371536 731322021 730486603 730916977
3960.7 730916977 732113647 731590195 731621475 731325760 731416855 731789780 731964188 732447586 731800613 730625458
3970.3 730625458 730566101 731381683 731341476 731093369 731570129 731407852 730812378 731027603 731388321 731395569
3980 731395569 731535492 731955032 732220383 732139282 732280807 731859283 732072678 732409897 731943817 733021698
3989.6 733021698 733050461 731711502 730917053 730845566 731453934 731097870 731135178 731582489 732034683 732470627
3999.2 732470627 732345657
4000.2 732345657
##END=$$ End of the data block
