##TITLE=$$ Begin of the data block
##JCAMP-DX=5.00 $$ ACD/SpecManager v 10.08
##SPECTROMETER/DATA SYSTEM=Varian
##DATE=15 Jan 2013 09:44:18
##DATA TYPE=INFRARED SPECTRUM
##DATA CLASS=XYDATA
##ORIGIN=
##OWNER=
##NPOINTS=3735
##FIRSTX=399.26403809
##LASTX=4000.35498047
##MAXX=4000.35498047
##MINX=399.26403809
##MAXY=76.29988098
##MINY=27.95539474
##XFACTOR=1.0000000000
##YFACTOR=0.000000100000000
##FIRSTY=52.56523132
##DELTAX=0.96440572
##XUNITS=1/CM
##YUNITS=TRANSMITTANCE
##XYDATA=(X++(Y..Y))
$$ plain form
399.3 525652313 517219238 505729485 506550179 511185188 510837212 501880302 492713356 497127266 508889542
407.9 508889542 508292389 496352234 488792114 496146164 505631905 503725586 502759285 505897064 510856895
416.6 510856895 518258286 525203934 522531433 504145622 494615784 492592049 493844986 498658562
424.3 498658562 503898773 498411217 491125183 495925217 498980713 494552574 491629868 490971031 490931396
433 490931396 488497925 484681778 486769257 494424973 494680176 492632446 492534142 493136864 496154594
441.7 496154594 494670448 494911995 496229935 495767746 497099075 495979156 495988426 494146423 492434196
450.4 492434196 494453735 495923157 495176086 489339676 484089165 482768669 484947739 487947464 486064377
459.1 486064377 486701508 490732117 490078011 486798363 488282967 487621078 485951157 490066986 492716103
$$ packed form
399.3E25652313q433075j1489753Q20694M635009l47976q956910r166946M413910J1762276
407.9E08889542n97153j1940155p560120P354050R485741j906319r66301L137779M959831
416.6E10856895P401391O945648k672501j8385811r529838k023735J252937M813576
424.3D98658562N240211n487556p286034M800034L055496m428139k922706o58837l9635
433D90931396k433471l816147K087479P655716K55203k047730r8304O02722L017730
441.7D96154594j484146K41547J317940m62189J331329j119919R270j842003j712227
450.4D92434196K019539J469422p47071n836410n250511j320496K179070K999725j883087
459.1D86064377O37131M030609o54106l279648J484604o61889j669921M115829K649117
$$ plain form
467.7 492716103 491805801 491174469 488311424 483522415 480851479 481230583 480408897 478363609 479095535
476.4 479095535 481186180 480294685 477894897 476220436 477951546 479183235 478661308 478215485 475754166
485.1 475754166 475607071 474886971 470630188 469278107 472701683 475284805 473766136 472327919 473851318
493.8 473851318 474704018 475041428 476008644 476105232 475568771 473578300 472616234 472669144 472393150 474906960
503.4 474906960 473376617 470034218 470181656 470725746 471226196 468649292 465677567 466415215 466747551
512.1 466747551 465920372 466306496 465497704 463356590 462677307 462531395 464720459 464579086 461053848
520.8 461053848 460156937 460739212 462153969 462098885 461256561 460498314 461043243 462138443 460733910
529.5 460733910 460214043 459486656 459238243 460201149 459518356 459898911 459767570 458283958 458095436 457603149
$$ packed form
467.7D92716103r10302o31332k863045m789009k670936L79104q21686k045288P31926
476.4D79095535K090645q91495k399788j674461J731110J231689n21927m45823k461319
485.1D75754166j47095p20100m256783j352081L423576K583122j518669j438217J523399
493.8D73851318Q52700L37410R67216R6588n36461j990471r62066N2910k75994K513810
503.4D74906960j530343l342399J47438N44090N00450k576904k971725P37648L32336
512.1D66747551q27179L86124q08792k141114o79283j45912K189064j41373l525238
520.8D61053848q96911N82275J414757n5084q42324p58247N44929J095200j404533
529.5D60733910n19867p27387k48413R62906o82793L80555j31341j483612j88522m92287
$$ plain form
539.1 457603149 456626816 457707062 458908958 457730293 455367050 454217110 455634804 455059090 452633362
547.8 452633362 451501045 451364174 451717453 450660744 451007843 452559280 452356873 451396980 449732933
556.5 449732933 448678627 448118935 447973289 448557854 447880707 448412018 450978508 451630630 450609818
565.1 450609818 449557037 449815407 450326843 449097252 448854408 449348679 448693237 448371849 449522896
573.8 449522896 450615730 450293159 449944649 449618912 449127426 449078484 448895149 447913208 447676468 448936653
583.5 448936653 449526863 449872971 449855843 449243736 449093628 449209595 449460487 448491631 448362999 449655838
593.1 449655838 450078278 450520248 450548973 450332680 450355186 450718040 450708733 449476128 448789177 449250946
602.8 449250946 449954185 449927254 449308090 447517281 445354729 445434761 445979614 446035919 446205597 444661140
$$ packed form
539.1D57603149r76333J080246J201896j178665k363243j149940J417694n75714k425728
547.8D52633362j132317j36871L53279j056709L47099J551437k02407r59893j664047
556.5D49732933j054306n59692j45646N84565o77147N31311K566490O52122j020812
565.1D50609818j052781K58370N11436j229591k42844M94271o55442l21388J151047
573.8D49522896J092834l22571l48510l25737m91486m8942j83335r81941k36740J260185
583.5D48936653N90210L46108j7128o12107j50108J15967K50892r68856j28632J292839
593.1D49655838M22440M41970K8725k16293K2506L62854r307j232605o86951M61769
602.8D49250946P03239k6931o19164j790809k162552Q0032N44853N6305J69678j544457
$$ plain form
612.4 444661140 442273102 441797142 442234764 441414070 441169128 443193054 443748207 442015266 441333466
621.1 441333466 441812019 442577515 443288574 444364891 445478401 445468979 445874863 447671280 449707603
629.8 449707603 450712318 451272469 451029587 451491585 454488907 456202316 456163712 456954994 458117905
638.4 458117905 459185905 460342674 461245956 462393913 464236870 465038643 464845390 465174980 466110039
647.1 466110039 467190475 468280144 468907661 468488655 468462257 469609489 470731468 471357994 471271591
655.8 471271591 470512619 469805069 469795494 470943451 471579933 470645638 469977913 470521927 470920181 470448303
665.4 470448303 470677109 469616737 462711983 466609344 469615631 470436172 471210251 471975632 472424622
674.1 472424622 473395691 474529076 475080795 476309128 477258034 477746239 478817635 479637756 480890121
$$ packed form
612.4D44661140k388038m75960M37622q20694k44942K023926N55153j732941o81800
621.1D41333466M78553P65496P11059J076317J113510r422M05884J796417K036323
629.8D49707603J004715N60151k42882M61998K997322J713409l8604P91282J162911
638.4D58117905J068000J156769R03282J147957J842957Q01773j93253L29590R35059
647.1D66110039J080436J089669O27517m19006k6398J147232J121979O26526q6403
655.8D71271591p58972p07550r575J147957O36482r34295o67725N44014L98254m71878
665.4D70448303K28806j060372o904754L897361L006287Q20541P74079P65381M48990
674.1D72424622R71069J133385N51719J228333R48906M88205J071396Q20121J252365
$$ plain form
682.8 480890121 482291374 483342171 483543625 483851967 485478668 486866989 488107376 488541183 488610344
691.5 488610344 489505386 489896240 489408875 489453392 491246262 492201157 491471443 491734238 492884178 493800964
701.1 493800964 493820534 494073601 495473976 496602898 497316055 497751236 497817192 498138008 498806686 499597626
710.8 499597626 500104523 500993385 501808472 501883354 503191414 504687347 504554291 504164963 504860458 505885582
720.4 505885582 506091919 506691933 507518425 507896309 508985023 510749435 511461601 511433983 512044373 513192329
730.1 513192329 514566689 514892883 515479279 516586342 517476692 519202156 519779282 519728508 519836845
738.7 519836845 520325813 520908699 520871849 521840172 522775040 523922806 524933357 525430336 525536537 525654831
748.4 525654831 526963844 527166023 528273811 529333992 529220352 530620079 531295013 532007904 533213081
$$ packed form
682.8D80890121J401253J050797K01454L08342J626701J388321J240387M33807O9161
691.5D88610344Q95042L90854m87365M4517J792870R54895p29714K62795J149940R16786
701.1D93800964J9570K53067J400375J128922P13157M35181O5956L20816O68678P90940
710.8D99597626N06897Q88862Q15087P4882J308060J495933j33056l89328O95495J025124
720.4E05885582K06337O00014Q26492L77884J088714J764412P12166k7618O10390J147956
730.1E13192329J374360L26194N86396J107063Q90350J725464N77126n0774J08337
738.7E19836845M88968N82886l6850R68323R34868J147766J010551M96979J06201J18294
748.4E25654831J309013K02179J107788J060181j13640J399727O74934P12891J205177
$$ plain form
757.1 533213081 534597931 535277977 534683037 535638618 537435226 539198990 540630798 541263390 541509094
765.7 541509094 541865120 542580147 542940636 542970200 543375206 543955307 543766556 543787155 544026375 543740196
775.4 543740196 543290977 542886772 543771477 545066032 545229988 545200233 545462799 545277786 545102539 545533600
785 545533600 546228600 547850800 549858437 550649719 550792847 551447716 551927071 551588287 550657921 550364952
794.7 550364952 550393677 549695740 550474091 551456146 551347237 551135254 550659409 549774971 548251610 547364769
804.3 547364769 545854149 544250832 543554497 542993889 541902428 539969215 539569550 538514977 536905022
813 536905022 535878487 534529266 533690491 532425117 532130432 531504021 531245155 532734184 533380013
821.7 533380013 533653488 534284744 536902008 539170303 540801544 543732185 545832634 548804779 552003975
$$ packed form
757.1E33213081J384850O80046n94940R55581J796608J763764J431808O32592K45704
765.7E41509094L56026P15027L60489K9564M05006N80101j88751K0599K39220k86179
775.4E43740196m49219m04205Q84705J294555J63956k9755K62566j85013j75247M31061
785E45533600O95000J622200K007637P91282J43128O54869M79355l38784r30366k92969
794.7E50364952K8725o97937P78351R82055j08909k11983m75845q84438j523361q86841
804.3E47364769j510620j603317o96335n60608j091461j933213l99665j054573j609955
813E36905022j026535j349221q38775j265374k94685o26411k58866J489029O45829
821.7E33380013K73475O31256K617264K268295J631241K930641K100449K972145L199196
$$ plain form
830.4 552003975 554455223 557440109 560387840 562355080 564765053 567885246 568980255 569719009 571528435
839 571528435 573810501 575511093 577392960 579843025 581623306 583530312 585045891 586288757 587148209
847.7 587148209 588454399 588936920 588935127 590354767 591108360 592898941 595139351 596639137 597248802
856.4 597248802 598161888 600378761 601458549 602090988 602465363 603675575 604196091 604758835 606667900
865.1 606667900 607539177 608130493 606885567 605473518 604481506 603365707 601873703 600001335 599349670
873.8 599349670 597725258 596769142 596334801 595506973 594260139 592476501 591918030 590681305 589146576
882.4 589146576 588435707 588049393 586986618 586562881 587130508 587327995 587654228 586563759 585821075
891.1 585821075 585196381 584400940 584660950 584716721 585563278 586915283 588694229 589546127 589148293 588579941
$$ packed form
830.4E52003975K451248K984886K947731J967240K409973L120193J095009P38754J809426
839E71528435K282066J700592J881867K450065J780281J907006J515579J242866Q59452
847.7E87148209J306190M82521j793J419640P53593J790581K240410J499786O09665
856.4E97248802R13086K216873J079788O32439L74375J210212N20516N62744J909065
865.1F06667900Q71277N91316j244926j412049r92012j115799j492004j872368o51665
873.8E99349670j624412r56116m34341q27828j246834j783638n58471j236725j534729
882.4E89146576p10869l86314j062775m23737N67627J97487L26233j090469p42684
891.1E85821075o24694p95441K60010N5771Q46557J352005J778946Q51898l97834n68352
$$ plain form
900.8 588579941 588368874 588085632 586773453 587059250 588213120 590217094 593371048 596723862 599680099
909.4 599680099 601258850 602867393 602974854 603209076 603301163 601901283 600752258 598965034 597834015
918.1 597834015 596887093 595578651 593670273 591035538 588376503 585481873 582297783 578596306 574954414
926.8 574954414 570795593 567127190 564425201 562296867 560258331 557803497 555769234 553636322
934.5 553636322 551968613 550001144 548338737 547744980 546869011 546282616 545141373 544048233 543229637
943.2 543229637 542540359 541746140 540426979 540203590 540270119 540558090 540862732 541860123 543912468 544984360
952.8 544984360 545642776 545467224 544330330 542478752 540564308 538895149 536932144 534983749 532698135
961.5 532698135 531201172 530474091 529561577 527823067 525340958 524112473 523271065 520877609 518349380
$$ packed form
900.8E88579941k11067k83242j312179K85797J153870K003974L153954L352814K956237
909.4E99680099J578751J608543J07461K34222R2087j399880j149025j787224j131019
918.1E97834015r46922j308442j908378k634735k659035k894630l184090l701477l641892
926.8E74954414m158821l668403k701989k128334k038536k454834k034263k132912
934.5E53636322j667709j967469j662407n93757q75969n86395j141243j093140q18596
943.2E43229637o89278p94219j319161k23389O6529K87971L04642R97391K052345J071892
952.8E44984360O58416j75552j136894j851578j914444j669159j963005j948395k285614
961.5E32698135j496963p27081r12514j738510k482109j228485q41408k393456k528229
$$ plain form
970.2 518349380 517105484 515326881 512664146 510321541 507523460 504547005 502094574 498738365
977.9 498738365 494161682 490191498 486158295 480554085 475134315 471533585 467775955 462932243
985.6 462932243 458945389 455482750 450884094 446324043 442228699 437670822 433810196 430689850
993.3 430689850 427340851 423587227 420963173 418983498 416025429 413057632 410096283 407695122
1001.1 407695122 404573593 401246300 398854637 396145592 393881683 391796379 390219383 388419647
1008.8 388419647 386784592 384876633 382890205 381733589 378810120 376401711 374262466 371854095
1016.5 371854095 369495087 366587601 364617691 362512894 361149292 358775902 355462303 353259392
1024.2 353259392 351930771 350543900 348228645 347000122 346105576 345775833 344900017 344031029 343571091
$$ packed form
970.2E18349380j243896j778603k662735k342605k798081k976455k452431l356209
977.9D98738365m576683l970184m033203n604210n419770l600730l757630m843712
985.6D62932243l986854l462639m598656m560051m095344m557877l860626l120346
993.3D30689850l348999l753624k624054j979675k958069k967797k961349k401161
1001.1D07695122l121529l327293k391663k709045k263909k085304j576996j799736
1008.8C88419647j635055j907959j986428j156616k923469k408409k139245k408371
1016.5C71854095k359008k907486j969910k104797j363602k373390l313599k202911
1024.2C53259392j328621j386871k315255j228523q94546l29743q75816q68988m59938
$$ plain form
1032.9 343571091 342242546 342184448 342511673 344050827 345900230 347794914 349694901 351920586 354408989
1041.6 354408989 355002251 356522293 357450981 357531548 356976089 356245613 356034203 354455109 353867798
1050.2 353867798 351919327 349804420 348736877 347561798 346418686 344219551 343102303 341250916
1058 341250916 340653572 341238899 341760750 343729897 345916252 348199158 349697342 351848183 353580475
1066.6 353580475 355455322 357601585 359343338 360871277 360638542 360804710 360882797 361260567 361578598
1075.3 361578598 362283630 362849274 361823196 362527008 363104057 363864212 363886833 363596573 364862747
1084 364862747 365397263 366697502 368146439 369438591 370299911 371643562 373660126 375478973 377496605
1092.7 377496605 378235359 378567123 379673042 382482719 384343224 385327415 387429581 388961639 390149918
$$ packed form
1032.9C43571091j328545n8098L27225J539154J849403J894684J899987K225685K488403
1041.6C54408989N93262J520042R28688Q0567n55459p30476k11410j579094n87311
1050.2C53867798j948471k114907j067543j175079j143112k199135j117248j851387
1058C41250916n97344N85327N21851J969147K186355K282906J498184K150841J732292
1066.6C53580475J874847K146263J741753J527939k32735J66168P8087L77770L18031
1075.3C61578598P05032N65644j026078P03812N77049P60155K2621k90260J266174
1084C64862747N34516J300239J448937J292152Q61320J343651K016564J818847K017632
1092.7C77496605P38754L31764J105919K809677J860505R84191K102166J532058J188279
$$ plain form
1101.4 390149918 391081619 392383308 393103943 394605942 396151047 396586151 398491325 399610825 400293427
1110 400293427 400787392 401338348 402283630 402822952 404295769 405259399 406156845 407321854 407872658 407774467
1119.7 407774467 407618065 407520676 406483002 406132202 406673317 407280998 407992287 409081688 410097160
1128.4 410097160 411512146 413853531 416235275 418749123 420594635 423137436 426013756 428683167
1136.1 428683167 431811829 434298744 436750755 439011116 441071129 442815170 444580154 446211243
1143.8 446211243 447034035 447850266 448657341 449318771 449774475 450349464 450349159 450345383 450731277 450585060
1153.4 450585060 450699081 449824867 448716469 448096848 447039490 446303139 445475769 445054169 444600143
1162.1 444600143 444743118 445880318 446616974 447897148 450333176 453379250 455667839 457583771 460291939
$$ packed form
1101.4C90149918R31701J301689P20635J501999J545105M35104J905174J119500O82602
1110D00293427M93965N50956R45282N39322J472817R63630Q97446J165009N50804r8191
1119.7D07774467j56402r7389j037674l50800N41115O07681P11289J089401J015472
1128.4D10097160J414986K341385K381744K513848J845512K542801K876320K669411
1136.1D28683167L128662K486915K452011K260361K060013J744041J764984J631089
1143.8D46211243Q22792Q16231Q07075O61430M55704N74989l05l776L85894j46217
1153.4D50585060J14021q74214j108398o19621j057358p36351q27370m21600m54026
1162.1D44600143J42975J137200P36656J280174K436028L046074K288589J915932K708168
$$ plain form
1170.8 460291939 463728752 466956100 469716988 472723694 475728912 478230591 480718880 483685951
1178.5 483685951 486319962 488485909 490428429 492403259 493995552 495418167 497245407 498878670
1186.2 498878670 500107231 500697708 501684189 502564507 502272644 501718407 501439400 501387634 501330643 501175995
1195.9 501175995 500307465 498704605 497293129 496841393 496054077 494336014 493175278 492178040 491073456
1204.5 491073456 489976997 489106560 489143372 489301071 488910522 488180580 487616539 487424240 487395592 486917343
1214.2 486917343 486064873 485987358 486147156 485680466 485241814 485091324 484654388 484264717 484166069 483668022
1223.8 483668022 483132744 482732391 481948624 480765228 479878960 479374809 478401108 477524109 476899567
1232.5 476899567 476118088 475788612 475370331 474792404 474807434 475004539 474748077 474232292 474039574 473939171
$$ packed form
1170.8D60291939L436813L227348K760888L006706L005218K501679K488289K967071
1178.5D83685951K634011K165947J942520J974830J592293J422615J827240J633263
1186.2D98878670J228561N90477R86481Q80318k91863n54237k79007n1766n6991j54648
1195.9E01175995q68530j602860j411476m51736p87316j718063j160736r97238j104584
1204.5D91073456j096459q70437L6812J57699l90549p29942n64041j92299k8648m78249
1214.2D86917343q52470p7515J59798m66690m38652j50490m36936l89671r8648m98047
1223.8D83668022n35278m00353p83767j183396q86268n04151r73701q76999o24542
1232.5D76899567p81479l29476m18281n77927J5030J97105k56462n15785j92718j00403
$$ plain form
1242.2 473939171 473656464 473327827 472688637 471715546 471262131 471093903 470547523 470219803 469882011 469633102
1251.8 469633102 469556046 469244308 469184036 469074936 468806953 468644829 468839989 469139671 468995628 468957977
1261.4 468957977 469025993 468982735 469267616 470062180 470696030 470944786 471483192 472493515 473430328 474002571
1271.1 474002571 474725037 475732193 476609039 477183342 477781334 478608551 479736977 480379333 480909805
1279.8 480909805 482176590 482698250 483164139 484598351 486268730 487546577 488455353 489494896 490541573
1288.4 490541573 491814423 492466545 492884064 493629150 494399223 495437241 496024437 496341972 496489868
1297.1 496489868 496602249 496800880 497192802 497587814 497400436 497134743 496950340 496955299 497066536 497039795
1306.8 497039795 496388855 495473900 494621277 493748322 493288307 492404175 491687927 491279602 490663033 490566139
$$ packed form
1242.2D73939171k82707l28637o39190r73091m53415j68228n46380l27720l37792k48909
1251.8D69633102p7056l11738o0272j09100k67983j62124J95160K99682j44043l7651
1261.4D68957977O8016m3258K84881P94564O33850K48756N38406J010323R36813N72243
1271.1D74002571P22466J007156Q76846N74303N97992Q27217J128426O42356N30472
1279.8D80909805J266785N21660M65889J434212J670379J277847R08776J039543J046677
1288.4D90541573J272850O52122M17519P45086P70073J038018N87196L17535J47896
1297.1D96489868J12381J98631L91922L95012j87378k65693j84403M959J11237k6741
1306.8D97039795o50940r14955q52623q72955m60015q84132p16248m08325o16569r6894
$$ plain form
1316.4 490566139 490729713 491110878 491769142 492908745 493873024 494411316 495259361 496176071 496904449
1325.1 496904449 497609367 498505859 498685341 498601303 498580704 498397446 497970200 496931801 496430016 496089821
1334.7 496089821 496015434 496431580 496469421 496377716 496453285 497233391 497641869 498482018 499873886 500650558
1344.4 500650558 501297722 502269516 503401680 503993721 504895554 505263786 504948196 504543991 503912163
1353.1 503912163 503613968 502904129 502671165 502423325 502152977 502532272 502709122 502277489 501325111 500688972
1362.7 500688972 499536171 499608421 499618187 499019508 498678436 497794838 497518730 497091446 496975555 497154083
1372.3 497154083 496710930 496171570 495870667 496277122 495986824 495739059 495622139 495590439 495385170 494028893
1382 494028893 492169228 490038147 489083214 488568611 487448082 485542984 484610405 484247780 482451401
$$ packed form
1316.4D90566139J63574L81165O58264J139603R64279N38292Q48045R16710P28378
1325.1D96904449P04918Q96492J79482q4038k0599j83258m27246j038399n01785l40195
1334.7D96089821p4387M16146L7841r1705P5569P80106M08478Q40149J391868P76672
1344.4E00650558O47164R71794J132164N92041R01833L68232l15590m04205o31828
1353.1E03912163k98195p09839k32964k47840k70348L79295J76850m31633r52378o36139
1362.7E00688972j152801P2250R766n98679l41072q83598k76108m27284j15891J78528
1372.3D97154083m43153n39360l00903M06455k90298k47765j16920l1700k05269j356277
1382D94028893j859665k131081r54933n14603j120529j905098r32579l62625j796379
$$ plain form
1390.7 482451401 480713768 479248123 477798119 474999199 471536140 470184898 468371925 466506157
1398.4 466506157 463571281 461229668 459847450 457962875 456505585 454698753 451914940 449797707
1406.1 449797707 448311615 446129990 443827057 442191887 440551605 439461899 438550301 437480888
1413.8 437480888 436114464 434815254 433954811 432502708 432293549 430531807 429567184 430543480 430848351
1422.5 430848351 431340675 430766335 431775970 433430977 434404984 435492363 435939026 436974945 437502251
1431.2 437502251 439068451 440513878 442149353 445386276 447492447 448938141 450362053 453080368
1438.9 453080368 455147629 457039299 459188347 460396385 462162437 463177719 465173149 467362556
1446.6 467362556 469169693 470639420 472239532 474540176 475615311 477410774 478542519 479995308
$$ packed form
1390.7D82451401j737633j465645j450004k798920l463059j351242j812973j865768
1398.4D66506157k934876k341613j382218j884575j457290j806832k783813k117233
1406.1D49797707j486092k181625k302933j635170j640282j089706r11598j069413
1413.8D37480888j366424j299210q60443j452103k09159j761742r64623R76296L04871
1422.5D30848351M92324n74340J009635J655007R74007J087379M46663J035919N27306
1431.2D37502251J566200J445427J635475L236923K106171J445694J423912K718315
1438.9D53080368K067261J891670K149048J208038J766052J015282J995430K189407
1446.6D67362556J807137J469727J600112K300644J075135J795463J131745J452789
$$ plain form
1454.3 479995308 481744881 482335892 482983971 483354988 487893372 490849953 493806419 495519180 496610413
1463 496610413 498603363 498351974 500926819 503329811 505970383 508323860 510611801 513728065 514993172
1471.7 514993172 516850853 518655853 522355003 525567970 526705589 529728928 532982903 535343590
1479.4 535343590 537113724 539177361 541115685 542866211 544385719 545695801 547388306 548545036
1487.1 548545036 549199066 550533524 550259399 549994965 552041588 553210335 553020210 552886238 552319679
1495.8 552319679 548380852 548625679 547621994 545037422 544954491 544240837 543234291 542109108 542372169
1504.5 542372169 541791649 534913445 531355858 533173065 534671631 534245834 535488548 534838562 533098412
1513.1 533098412 533096390 532034111 530952148 527264481 525702744 527691841 528544426 525790253 522953796
$$ packed form
1454.3D79995308J749573N91011O48079L71017M538384K956581K956466J712761J091233
1463D96610413J992950k51389K574845K402992K640572K353477K287941L116264J265107
1471.7E14993172J857681J805000L699150L212967J137619L023339L253975K360687
1479.4E35343590J770134K063637J938324J750526J519508J310082J692505J156730
1487.1E48545036O54030J334458k74125k64434K046623J168747j90125j33972n66559
1495.8E52319679l938827K44827j003685k584572q2931p13654j006546j125183K63061
1504.5E42372169n80520o878204l557587J817207J498566m25797J242714o49986j740150
1513.1E33098412k022j062279j081963l687667j561737J989097Q52585k754173k836457
$$ plain form
1521.8 522953796 524165611 525515404 526893845 525496750 525826073 526820679 526787071 527391739 527925644
1530.5 527925644 528125916 527551308 526906395 525946960 527897301 529039154 529339066 530812302 527858696
1539.2 527858696 525504723 527166176 527626801 526897469 528198013 529749374 528990860 530356598 530486946
1547.9 530486946 531042862 530650940 529116173 529974556 529764481 529973335 527175789 527605362 529700050
1556.5 529700050 530204697 524477577 514952888 519498329 521277046 522734222 521467209 519602890
1564.2 519602890 516497536 514368439 514019814 512206192 511003952 501875648 500278435 499261093
1572 499261093 496209373 494023018 491225128 489076958 476466293 475736465 473546638 469804993 466544800
1580.6 466544800 461699982 458559303 452963448 449335175 444433823 440045166 436037369 431101227
$$ packed form
1521.8E22953796J211815J349793J378441j397095L29323R94606l3608O04668N33905
1530.5E27925644K00272n74608o44913r59435J950341J141853K99912J473236k953606
1539.2E27858696k353973J661453M60625p29332J300544J551361p58514J365738J30348
1547.9E30486946N55916l91922j534767Q58383k10075K08854k797546M29573K094688
1556.5E29700050N04647n727120r524689M545441J778717J457176j267013j864319
1564.2E19602890l105354k129097l48625j813622j202240r128304j597213j017342
1572D99261093l051720k186355k797890k148170j2610665p29828k189827l741645l260193
1580.6D66544800m844818l140679n595855l628273m901352m388657m007797m936142
$$ plain form
1588.4 431101227 428135414 422899704 419969788 415064240 411893196 408035469 403101196 400418854
1596.1 400418854 395657387 393517609 389317894 387124863 383739166 380716515 379075737 375087891
1603.8 375087891 373759003 370233803 368833008 365874214 364621201 363387337 360742569 361283836
1611.5 361283836 359015198 359063339 357166824 357712173 358139877 352886429 354853745 353814545 354824524
1620.2 354824524 353497543 354346924 354166145 352521858 354134560 353482208 355260086 354030190 355393257
1628.9 355393257 355833588 356304779 357574692 357625618 360221634 360999985 362924957 360489845 362588310
1637.5 362588310 364148369 365249786 367996559 368922119 371532593 371464424 373760185 375808563 374566231
1646.2 374566231 377170181 376954155 380728951 381819687 384720573 387037086 385271263 385652351 386138153
$$ packed form
1588.4D31101227k965813n235710k929916m905548l171044l857727m934273k682342
1596.1D00418854m761467k139778m199715k193031l385697l022651j640778l987846
1603.8C75087891j328888l525200j400795k958794j253013j233864k644768N41267
1611.5C61283836k268638M8141j896515N45349M27704n253448J967316j039200J009979
1620.2C54824524j326981Q49381j80779j644287J612702o52352J777878j229896J363067
1628.9C55393257M40331M71191J269913N0926K596016P78351J924972k435112K098465
1637.5C62588310J560059J101417K746773R25560K610474o8169K295761K048378j242332
1646.2C74566231K603950k16026L774796J090736K900886K316513j765823L81088M85802
$$ plain form
1654.9 386138153 390124779 391174965 393509750 394860115 396500397 398314209 399897804 402958221
1662.6 402958221 403659401 407419510 409719124 412494888 415318108 417992020 421141243 422489548
1670.3 422489548 427041130 429105453 433424683 437336617 439949417 443209267 446894379 451465111
1678 451465111 454226685 458570900 461600151 465891609 470546150 471347122 475665512 478442345 484641304
1686.7 484641304 488989449 493144112 497503624 501168098 506000519 510085564 514747925 519443283
1694.4 519443283 524121590 524211540 528949394 535235252 540993462 546220169 544072533 550494881 555443039
1703.1 555443039 559047928 562004547 564922562 567410049 570375214 574533501 577277985 579433479
1710.8 579433479 581811142 584427452 587084618 587090569 587881699 591541557 593254318 589766846 593417130
$$ packed form
1654.9C86138153L986626J050186K334785J350365J640282J813812J583595L060417
1662.6D02958221P01180L760109K299614K775764K823220K673912L149223J348305
1670.3D22489548M551582K064323M319230L911934K612800L259850L685112M570732
1678D51465111K761574M344215L029251M291458M654541Q00972M318390K776833O198959
1686.7D84641304M348145M154663M359512L664474M832421M085045M662361M695358
1694.4E19443283M678307Q9950M737854O285858N758210N226707k147636O422348M948158
1703.1E55443039L604889K956619K918015K487487K965165M158287K744484K155494
1710.8E79433479K377663K616310K657166N951P91130L659858J712761l487472L650284
$$ plain form
1719.5 593417130 596718369 598472748 600159531 601124878 602277107 603955345 605643387 607126160
1727.2 607126160 608605652 610336075 609856949 610274811 613543816 616363182 615646133 613707428 617987404
1735.9 617987404 621572495 623415833 626303787 627336960 626756706 630681267 633720016 634839706
1743.6 634839706 636960449 640648727 643894577 646092453 648676147 651441879 656282120 658002548
1751.3 658002548 659071808 663824539 667134018 670486298 673497009 674413147 676902771 679798431
1759 679798431 682290268 685179062 684617844 685215073 688600464 690414886 692267761 694756622 696684723
1767.7 696684723 695155106 697290726 701111908 700177383 697691803 697998047 702669067 704727249 704264450
1776.4 704264450 706616287 707675705 709474335 710274506 709799347 710860291 712292099 713745422 713320236
$$ packed form
1719.5E93417130L301239J754379J686783R65347J152229J678238J688042J482773
1727.2F07126160J479492J730423m79126M17862L269005K819366p17049j938705M279976
1735.9F17987404L585091J843338K887954J033173n80254L924561L038749J119690
1743.6F34839706K120743L688278L245850K197876K583694K765732M840241J720428
1751.3F58002548J069260M752731L309479L352280L010711R16138K489624K895660
1759F79798431K491837K888794n61218N97229L385391J814422J852875K488861J928101
1767.7F96684723j529617K135620L821182r34525k485580L06244M671020K058182m62799
1776.4G04264450K351837J059418J798630Q00171m75159J060944J431808J453323m25186
$$ plain form
1785.1 713320236 713662949 715093994 716453934 717383194 718628616 719356155 719503860 718164825 718207245
1793.8 718207245 721733322 722669373 722734299 724253235 725765381 726422501 725691681 727440414 727332153
1802.4 727332153 727845993 729460526 730196838 731471024 731660767 731746140 732498856 733527832 732886200
1811.1 732886200 733906631 735548019 735610962 736499710 736787262 737546997 737423019 738132553 739662399
1819.8 739662399 739817276 740588760 740136108 741164551 742307510 740480194 741098251 742918930 744270172
1828.5 744270172 743339767 740919189 742474518 744775848 745126114 745682602 746271973 746543732 747067032
1837.2 747067032 746554794 747374954 747606964 747814407 748236084 749219360 749852829 745949707 748231506
1845.8 748231506 750397339 750278168 750122528 750642471 751543045 751428452 752074966 752061081 752226715 752633286
$$ packed form
1785.1G13320236L42713J431045J359940R29260J245422P27539J47705j339035M2420
1793.8G18207245L526077R36051O4926J518936J512146O57120p30820J748733j08261
1802.4G27332153N13840J614533P36312J274186J89743Q5373P52716J028976o41632
1811.1G32886200J020431J641388O2943Q88748K87552P59735j23978P09534J529846
1819.8G39662399J54877P71484m52652J028443J142959j827316O18057J820679J351242
1828.5G44270172r30405k420578J555329K301330L50266N56488N89371K71759N23300
1837.2G47067032n12238Q20160K32010K07443M21677R83276O33469l903122K281799
1845.8G48231506K165833j19171j55640N19943R00574j14593O46514j3885J65634M06571
$$ plain form
1855.5 752633286 752970886 753728104 753611984 753745041 753486557 753973770 754085159 754185791 754770508 754902344
1865.1 754902344 755492706 754905853 755082016 754004593 753139343 754736252 755941849 756795349 756528549
1873.8 756528549 756807938 757014008 757278442 757537003 757677078 758109894 758014603 758381500 757967529 758107147
1883.4 758107147 758165283 757905884 758258057 758381271 759500504 758979950 757888336 758775558 759514771
1892.1 759514771 759499283 759601669 759782562 759031601 759446411 759780045 760087433 760341187 760217972 760239792
1901.8 760239792 760083466 760593033 760485382 761015930 761464920 761257172 761341400 760949631 760834808 760849838
1911.4 760849838 761598969 761492004 761495285 761597748 761590424 762626038 760595398 759887466 761138382 761830063
1921.1 761830063 762272491 761500702 761438293 761919785 762356415 762106094 762036285 762159195 762157516 762494278
$$ packed form
1855.5G52633286L37600P57218j16120J33057k58484M87213J11389J00632N84717J31836
1865.1G54902344N90362n86853J76163j077423q65250J596909J205597Q53500k66800
1873.8G56528549K79389K06070K64434K58561J40075M32816r5291L66897m13971J39618
1883.4G58107147N8136k59399L52173J23214J119233n20554j091614Q87222P39213
1892.1G59514771j5488J02386J80893p50961M14810L33634L07388K53754j23215K1820
1901.8G60239792j56326N09567j07651N30548M48990k07748Q4228l91769j14823J5030
1911.4G60849838P49131j06965L281J02463p324J035614k030640p07932J250916O91681
1921.1G61830063M42428p71789o2409M81492M36630k50321o9809J22910j679L36762
$$ plain form
1930.7 762494278 762454681 762278519 761715622 761992416 762191925 762154846 762150497 761848145 762248077 762403793
1940.3 762403793 762998810 762112808 760582352 761460190 762011108 761597824 761222000 761968384 762082062
1949 762082062 761981049 761979599 761698456 761700821 761460342 761376419 761085129 761436005 761245270 760841217 760983963
1959.6 760983963 760700760 760927811 760694427 761050644 761464157 761448441 761208801 760152893 760242844 760504303
1969.3 760504303 760580215 760343781 760475464 760763626 760531235 760771790 760789948 760810776 760612488 760714188
1978.9 760714188 760780334 760392456 760192413 760009689 760225906 760155563 760299301 760337677 760130615 759556808
1988.6 759556808 758928223 759705124 759981232 759309158 758996887 759146881 759181747 759154739 759110336 758878174
1998.2 758878174 758870468 758506622 758647919 758486938 758239212 758425522 758002853 757765808 757550125 757840195
$$ packed form
1930.7G62494278l9597j76162n62897K76794J99509l7079m349l02352L99932J55716
1940.3G62403793N95017q86002j530456Q77838N50918m13284l75824P46384J13678
1949G62082062j01013j450k81143K365k40479q3923k91290L50876j90735m04053J42746
1959.6G60983963k83203K27051k33384L56217M13513j5716k39640j055908Q9951K61459
1969.3G60504303P5912k36434J31683K88162k32391K40555J8158K0828j98288J01700
1978.9G60714188O6146l87878k00043j82724K16217p0343J43738L8376k07062n73807
1988.6G59556808o28585P76901K76108o72074l12271J49994L4866k7008m4403k32162
1998.2G58878174p706l63846J41297j60981k47726J86310m22669k37045k15683K90070
$$ plain form
2007.8 757840195 757929001 757719193 757442322 757133942 757389221 757182159 757051239 756817398 756695862 756321793
2017.5 756321793 755886230 755975113 755881729 756244736 755961075 755844498 755970535 755703506 755483780 754991226
2027.1 754991226 754948196 754910431 755040054 754571686 754119034 753903198 753518372 753897171 753685074 753510437
2036.8 753510437 753070908 752718964 752917938 752697296 752711868 752782288 752918549 752526398 752408676 752259903
2046.4 752259903 751855927 751855469 751498566 751418991 751303635 751476593 751417770 751232681 751269913 751055832 750963898
2057 750963898 750416336 750464935 750426102 750106125 749727020 749489365 749954376 749801712 749733124 749435883
2066.7 749435883 749585800 749858475 749511642 749386597 749110260 749304810 749084473 749031982 749002686 748925552
2076.3 748925552 749219971 748866806 748786621 748526611 748474808 748349380 748321762 748494110 748314133 748506851
$$ packed form
2007.8G57840195Q8806k09808k76871l08380K55279k07062j30920k33841j21536l74069
2017.5G56321793m35563Q8883r3384L63007k83661j16577J26037k67029k19726m92554
2027.1G54991226m3030l7765J29623m68368m52652k15836l84826L78799k12097j74637
2036.8G53510437m39529l51944J98974k20642J4572P0420J36261l92151j17722j48773
2046.4G52259903m03976m58l56903p9575j15356J72958n8823j85089L7232k14081r1934
2057G50963898n47562M8599l8833l19977l79105k37655M65011j52664o8588k97241
2066.7G49435883J49917K72675l46833j25045k76337J94550k20337n2491k9296p7134
2076.3G48925552K94419l53165q0185k60010n1803j25428k7618J72348j79977J92718
$$ plain form
2086 748506851 748080978 748060532 747981720 747495422 747248840 747196045 747435455 747060699 747141495 746810074 746268921
2096.6 746268921 746299210 746262665 746263351 746011810 746223373 746164703 745964966 745638199 745125656 744888687 744604721
2107.2 744604721 744496536 744566574 745242462 745046616 744624481 744724426 744412003 744167862 743746033 743779984
2116.8 743779984 743627319 743343811 743276825 743359451 743503036 743508759 743710480 742967606 742682800 742820663
2126.5 742820663 742877502 742908173 742552414 742891693 742690964 742620544 742722855 742706985 742881241 742653198
2136.1 742653198 742491302 742053833 741972504 741997147 742266006 742497253 742647400 742934570 742782822 742840347
2145.8 742840347 742279358 742361832 742483292 742410889 742698822 742056885 742148743 742176666 742314987 742387085
2155.4 742387085 742146149 742338409 742275162 742693100 742419586 742190018 742276917 742243805 742213974 741783829
$$ packed form
2086G48506851m25873k0446p8812m86298k46582n2795K39410l74756Q0796l31421n41153
2096.6G46268921L0289l6545O86k51541K11563n8670j99737l26767n12543k36969k83966
2107.2G44604721j08185P0038O75888j95846m22135R9945l12423k44141m21829L3951
2116.8G43779984j52665k83508o6986Q2626J43585N723K01721p42874k84806J37863
2126.5G42820663N6839L0671l55759L39279k00729p0420J02311j5870J74256k28043
2136.1G42653198j61896m37469q1329K4643K68859K31247J50147K87170j51748N7525
2145.8G42840347n60989Q2474J21460p2403K87933o41937R1858K7923J38321P2098
2155.4G42387085k40936J92260o3247M17938k73514k29568Q6899l3112k9831m30145
$$ plain form
2165 741783829 741946640 741950226 742125092 742318802 742594986 742729874 742486191 742851334 742699432 742530899
2174.7 742530899 742411804 742479324 742842331 743122482 743247070 742945557 743146439 743161697 743165817 743050919
2184.3 743050919 742819214 742911911 743086319 743321228 742804947 742714691 742837753 743062439 743469009 743557663
2194 743557663 743773346 743670959 743956757 743723755 743241882 743281250 743382416 743680267 743635941 743746262
2203.6 743746262 743908691 744050064 743700104 743519287 743595276 743298340 743759079 743968582 744129562 744346771
2213.3 744346771 744377594 744289169 743883972 744109802 744399185 744265442 743798599 743838196 744026413 744102707
2222.9 744102707 744297333 744257126 744491501 744301529 744276199 744454575 744509506 744160156 743611069 744020615
2232.5 744020615 744340820 744394989 743953018 743961334 744306107 744314728 744355087 743772659 743700714 743571625 743751144
$$ packed form
2165G41783829J62811L586J74866J93710K76184J34888k43683L65143j51902j68533
2174.7G42530899j19095O7520L63007K80151J24588l01513K00882J5258M120j14898
2184.3G43050919k31705R2697J74408K34909n16281r0256J23062K24686M06570Q8654
2194G43557663K15683j02387K85798k33002m81873L9368J01166K97851m4326J10321
2203.6G43746262J62429J41373l49960j80817P5989k96936M60739K09503J60980K17209
2213.3G44346771L0823q8425m05197K25830K89383j33743m66843L9597J88217P6294
2222.9G44102707J94626m0207K34375j89972k5330J78376N4931l49350n49087M09546
2232.5G44020615L20205N4169m41971Q316L44773Q621M0359n82428p1945j29089J79519
$$ plain form
2243.2 743751144 743866501 743582764 743839264 743654556 744001846 744065933 743816452 743606110 743508453 743935318
2252.8 743935318 743703384 743362122 743165207 743694153 744120102 744215622 744038086 743525848 743639603 743294220
2262.4 743294220 743316498 743277588 743276138 743565216 743700027 743857803 743161850 743256454 743378830 743349838 743346939
2273 743346939 742951431 742662201 742216797 742966461 743405991 743453140 743533173 743559113 743780365 743350220
2282.7 743350220 743278961 742919388 742742310 742394867 742008514 742157822 742166519 742519608 742368546 742771835
2292.3 742771835 742351608 741288528 741156921 740731277 740543442 740319977 740485764 740134964 739990692
2301 739990692 740323563 740305176 740497971 740011597 739783173 739209518 738938904 738391266 737423935 737679138
2310.7 737679138 737761078 738080292 737664185 737528687 737171631 736758194 736714783 735055389 734459000 734013290
$$ packed form
2243.2G43751144J15357k83737K56500j84708L47290O4087k49481k10342r7657M26865
2252.8G43935318k31934l41262j96915N28946M25949R5520j77536n12238J13755l45383
2262.4G43294220K2278l8910j450K89078J34811J57776o95953R4604J22376k8992k899
2273G43346939l95508k89230m45404P49664M39530M7149Q0033K5940K21252m30145
2282.7G43350220p1259l59573j77078l47443l86353J49308Q697L53089j51062M03289
2292.3G42771835m20227j063080j31607m25644j87835k23465J65787l50800j44272
2301G39990692L32871j8387J92795m86374k28424n73655k70614n47638r67331K55203
2310.7G37679138Q1940L19214m16107j35498l57056m13437m3411j659394n96389m45710
$$ plain form
2320.3 734013290 733931122 733667908 733191757 733350143 732735367 732833328 732247772 732359009 732034988 731104813
2329.9 731104813 730449142 730566635 731753159 730810242 731586151 731281891 729999313 730499649 730463104
2338.6 730463104 729938278 728010025 728407440 728901138 728936234 729197311 728853836 729432831 730118484 731409149
2348.3 731409149 731780777 731098404 729510040 728857422 729239960 728586502 727149811 724281616 724770813
2356.9 724770813 725304031 724493256 724180679 723088379 723688354 723830948 724769135 723851013 722977219
2365.6 722977219 723815613 725030899 726614151 725857468 725630264 726184311 727621613 728201218 727789688
2374.3 727789688 728239365 728556671 729445419 729948196 730202026 730253525 730471649 730937119 730896225 731023254
2383.9 731023254 731064377 731428604 731454239 731129227 731260452 731438751 731159363 730513611 730518188 730156326
$$ packed form
2320.3G34013290q2168k63214m76151J58386o14776R7961n85556J11237l24021r30175
2329.9G31104813o55671J17493J186524r42917P75909l04260j282578N00336l6545
2338.6G30463104n24826j928253L97415M93698L5096K61077l43475N78995O85653J290665
2348.3G31409149L71628o82373j588364o52618L82538o53458j436691k868195M89197
2356.9G24770813N33218q10775l12577j092300N99975J42594R38187r18122q73794
2365.6G22977219Q38394J215286J583252p56683k27204N54047J437302N79605m11530
2374.3G27789688M49677L17306Q88748N02777K53830N1499K18124M65470m0894J27029
2383.9G31023254M1123L64227K5635l25012J31225J78299k79388o45752M577l61862
$$ plain form
2393.6 730156326 729544449 729087524 728748627 728906555 728841324 728999939 729101715 729022827 728815155 728359680
2403.2 728359680 727809753 727333221 727099457 726760483 726886978 726921082 726843872 726816483 726499023 726402054
2412.9 726402054 726216965 725837631 725257111 724893646 724519882 724177170 723861008 723691864 724055099 723708038
2422.5 723708038 723211441 722566223 722195892 722396545 722025909 721673431 721047134 720689240 720711899 720619812
2432.2 720619812 720475769 720279236 720221634 719553223 718994293 718755646 718393478 718087006 717791214 717426605
2441.8 717426605 717067261 717154160 717414169 717765961 717399216 716436157 715934296 715653534 715377426 714957809
2451.5 714957809 714338913 713819885 714050598 713925400 713691483 714092026 713885040 713163986 711996384
2460.1 711996384 711561203 711578979 711133118 710972366 710785904 710560684 710161438 709900970 709661789 709392929
$$ packed form
2393.6G30156326o11877m56925l38897J57928o5231J58615J01776p8888k07672m55475
2403.2G28359680n49927m76532k33764l38974J26495L4104p7210k7389l17460r6969
2412.9G26402054j85089l79334n80520l63465l73764l42712l16162j69144L63235l47061
2422.5G23708038m96597o45218l70331K00653l70636l52478o26297l57894K2659r2087
2432.2G20619812j44043j96533n7602o68411n58930k38647l62168l06472k95792l64609
2441.8G17426605l59344Q6899K60009L51792l66745r63059n01861k80762k76108m19617
2451.5G14957809o18896n19028K30713j25198k33917M00543k06986p21054j167602
2460.1G11996384m35181J7776m45861j60752j86462k25220l99246k60468k39181k68860
$$ plain form
2469.8 709392929 708965378 708497009 708214569 707251205 706819077 706642990 706402969 706625824 706558533 706290512
2479.4 706290512 705811234 705305634 704460068 703728256 703237381 702967148 702974014 702734070 702780914 702458801
2489.1 702458801 702106934 701800842 701288300 700774765 699793777 698989182 698489380 698280029 697995377 698381653
2498.7 698381653 698696823 698004150 697536774 696610336 696125793 695665436 694779205 694563599 694243164 694013748
2508.3 694013748 693788681 693503876 693273392 693205032 692874603 692017059 691043396 690297775 690448074 690655823
2518 690655823 690697708 690341263 689959564 689795532 689027328 688388290 687895813 687867050 687436447 686421509
2527.6 686421509 685749664 685125504 685361099 685613098 685441284 685286331 684816666 684122162 683493881 683328934
2537.3 683328934 683156586 682539520 681781845 681356812 680886841 680885849 681132278 680702209 680491562 680060654
$$ packed form
2469.8G09392929m27551m68369k82440r63364m32128j76087k40021K22855o7291k68021
2479.4G06290512m79278n05600q45566p31812m90875k70233O866k39944M6844l22113
2489.1G02458801l51867l06092n12542n13535r80988q04595m99802k09351k84652L86276
2498.7F98381653L15170o92673m67376r26438m84543m60357q86231k15606l20435k29416
2508.3F94013748k25067k84805k30484o8360l30429q57544r73663p45621J50299K07749
2518F90655823M1885l56445l81699j64032p68204o39038m92477k8763m30603j014938
2527.6F86421509o71845o24160K35595K51999j71814j54953m69665o94504o28281j64947
2537.3F83328934j72348o17066p57675m25033m69971r92K46429m30069k10647m30908
$$ plain form
2546.9 680060654 679311676 678803787 678610840 678240662 677607880 677303238 676914520 676798630 676623459 676512680
2556.6 676512680 676411285 675500336 674718323 674341354 673913345 673336487 673304291 673567429 673536072 673158875
2566.2 673158875 672431793 671868134 671584778 671416550 670449677 669591217 669132767 669046173 669792175 669368820
2575.9 669368820 668787994 668723145 668438416 668162537 667433167 666515732 665796814 665746841 665443802 664892349
2585.5 664892349 664646835 664579315 664701004 664376526 664057693 663545914 663023834 662253113 661122208 660776443
2595.1 660776443 660782242 660730972 660437241 660159531 659843750 659495926 658926620 658235626 657956924 657315521
2604.8 657315521 656877441 656473160 656085129 655956802 655494232 655115051 654653702 654258270 653853989 653483505
2614.4 653483505 652696609 651686935 651234360 650883713 650782700 650432663 650160217 649756470 649226990
$$ packed form
2546.9F80060654p48978n07889j92947l70178o32782l04642l88718j15890j75171j10779
2556.6F76512680j01395r10949p82013l76969m28009n76858l2196K63138l1357l77197
2566.2F73158875p27082n63659k83356j68228r66873q58460m58450q6594P46002m23355
2575.9F69368820n80826o4849k84729k75879p29370r17435p18918m9973l03039n51453
2585.5F64892349k45514o7520J21689l24478l18833n11779n22080p70721j130905l45765
2595.1F60776443N799n1270k93731k77710l15781l47824n69306o90994k78702o41403
2604.8F57315521m38080m04281l88031j28327m62570l79181m61349l95432m04281l70484
2614.4F53483505p86896j009674m52575l50647j01013l50037k72446m03747n29480
$$ plain form
2623.1 649226990 648731384 647638321 647345505 647144089 646516953 645924301 645485153 645523529 645044327 644187012
2632.8 644187012 643524323 643349686 643020096 642462540 642016983 641328735 640732956 640013657 639674873 639381523
2642.4 639381523 638773537 638584900 638397942 637857437 637243690 636951103 636477699 635726738 635051117 634637413
2652 634637413 634409218 634127541 633882179 633463020 632919197 632139053 631821899 631521606 630572395 630135345
2661.7 630135345 629952087 629765892 629488564 629255180 628866692 628319778 628315964 628174019 627962189 627500000
2671.3 627500000 626825104 626373634 625845833 625442390 625187912 625113258 624844131 624350853 623854752 623270454
2681 623270454 622620659 622147522 621965828 621660042 621313629 620947456 620820961 620600929 619968491 619584160
2690.6 619584160 619250870 618727760 618329697 618349419 618091927 617545204 617140923 616892624 616983948 616779747
$$ packed form
2623.1F49226990m95606j093063k92816k01416o27136n92652m39148L8376m79202q57315
2632.8F44187012o62689j74637l29590n57556m45557o88248n95779p19299l38784k93350
2642.4F39381523o07986j88637j86958n40505o13747k92587m73404p50961o75621m13704
2652F34637413k28195k81677k45362m19159n43823p80144l17154l00293r49211m37050
2661.7F30135345j83258j86195k77328k33384l88488n46914l814j41945k11830m62189
2671.3F27500000o74896m51470n27801m03443k54478p4654k69127m93278m96101n84298
2681F23270454o49795m73137j81694l05786l46413l66173j26495k20032o32438l84331
2690.6F19584160l33290n23110l98063J9722k57492n46723m04281k48299R1324k04201
$$ plain form
2700.3 616779747 616381950 615756798 615064125 614583778 613993111 613474503 613076591 613135376 613333931 613406677
2709.9 613406677 613031235 612292519 611719818 611040001 610726929 610570602 610348778 610096207 609788857 609488754
2719.5 609488754 609110947 608996696 608928490 608996811 608954506 608840637 608513565 608007278 607679787 606756134
2729.2 606756134 606425362 606617432 606394310 606374855 606125336 605612068 605523453 605382843 604638634 604599457
2738.8 604599457 604739952 604502869 604357758 603748665 603479538 603494301 603544502 603332214 603062477 603132935
2748.5 603132935 602795792 602290230 601558342 601344566 601566772 601657906 601596870 601129990 600821228 600266190
2758.1 600266190 599866257 599647598 599458656 599440956 599112816 598903770 598741379 598481026 597628136 597042923
2767.8 597042923 597168121 596967049 596776962 596408234 596043396 595894127 595814056 595545654 595060043 594566612
$$ packed form
2700.3F16779747l97797o25152o92673m80347n90667n18608l97912N8785J98555P2746
2709.9F13406677l75442p38716n72701o79817l13072j56327k21824k52571l07350l00103
2719.5F09488754l77807j14251o8206O8321m2305j13869l27072n06287l27491r23653
2729.2F06756134l30772J92070k23122j9455k49519n13268q8615j40610p44209l9177
2738.8F04599457J40495k37083j45111o09093k69127J4763N0201k12288k69737P0458
2748.5F03132935l37143n05562p31888k13776K22206R1134o1036m66880l08762n55038
2758.1F00266190l99933k18659j88942j7700l28140k09046j62391k60353q52890n85213
2767.8E97042923J25198k01072j90087l68728l64838j49269q0071k68402m85611m93431
$$ plain form
2777.4 594566612 594038162 593877640 593368073 592801666 592572289 592150993 591732140 591337509 591048889 590805855
2787 590805855 590722656 590149384 589248199 588850365 588321114 587537689 586902313 586578598 586345520 586115570
2796.7 586115570 585740051 585186768 584495201 583969727 583684692 582692986 581658554 581123276 580603027
2805.4 580603027 580085716 579892006 579577255 578897667 578563423 577395821 576159248 575670128 574853935
2814 574853935 574360161 574061508 573685570 573027687 572422943 571899910 570935783 570072441 569182777 568231544
2823.7 568231544 567315254 566639786 565767937 564954071 564698143 563922424 562966881 562331238 561729507 560755196
2833.3 560755196 559618912 558486862 557321396 556630554 555774994 554518356 553222656 552222595 550955391
2842 550955391 549152946 547575684 545988426 544286575 542100143 539769173 537855682 536457024 535229950
$$ packed form
2777.4E94566612n28450j60522n09567n66407k29377m21296m18853l94631k88620k43034
2787E90805855q3199n73272r01185l97834n29251p83425o35376l23715k33078k29950
2796.7E86115570l75519n53283o91567n25474k85035r91706j034432n35278n20249
2805.4E80603027n17311j93710l14751o79588l34244j167602j236573m89120q16193
2814E74853935m93774k98653l75938o57883o04744n23033r64127q63342q89664r51233
2823.7E68231544r16290o75468q71849q13866k55928p75719r55543o35643o01731r74311
2833.3E60755196j136284j132050j165466o90842q55560j256638j295700j000061j267204
2842E50955391j802445j577262j587258j701851k186432k330970j913491j398658j227074
$$ plain form
2850.7 535229950 533860207 533095703 532350502 531844215 531843681 531727142 531163368 530316772 530116539 530086060
2860.3 530086060 530177879 529928284 529367294 529170799 528768234 528086891 526907349 525900269 524987564
2869 524987564 524176216 523884773 523427849 522859154 521890106 521038208 520771065 520650597 520065804 519117546
2878.7 519117546 518502693 517853851 517210693 516469269 515871239 515086403 513866997 513195343 512624130
2887.3 512624130 511953468 511064720 509757614 508495750 507867813 507516518 506492691 505553093 504952736
2896 504952736 504121132 503229370 502702789 502303467 501730652 501073151 500372276 499987221 499211159 497992821
2905.7 497992821 497324944 497082901 496506844 495496140 494413414 493232155 492501526 491614571 490215378
2914.3 490215378 488938179 487776337 486848106 485433426 484046326 483106804 482118988 481231079 480387192
$$ packed form
2850.7E35229950j369743p64504p45201n06287n34j16539n63774q46596k00233l0479
2860.3E30086060R1819k49595n60990j96495m02565o81343j179542j007080r12705
2869E24987564q11348k91443m56924n68695r69048q51898k67143j20468n84793r48258
2878.7E19117546o14853o48842o43158p41424n98030p84836j219406o71654n71213
2887.3E12624130o70662q88748j307106j261864o27937l51295j023827r39598o00357
2896E04952736q31604q91762n26581l99322n72815o57501p00875l85055p76062j218338
2905.7D97992821o67877k42043n76057j010704j082726j181259p30629q86955j399193
2914.3D90215378j277199j161842r28231j414680j387100r39522r87816q87909q43887
$$ plain form
2923 480387192 480116386 479919739 479313507 478714523 478351517 478570747 479175415 479339981 478982849 479080620
2932.7 479080620 479247551 479000587 478959808 479551392 480525169 481225281 481722298 482016983 482300606 483070107
2942.3 483070107 483914032 484370880 485013275 485613632 485649643 485809402 486187744 486973610 487676277 488135872
2952 488135872 488917809 489286270 489502182 489884377 490412674 490884399 491056480 491152306 491150856 491801453
2961.6 491801453 492780647 493284836 493617134 494042015 494818344 495689049 496153946 496575928 497244492 498030930
2971.2 498030930 498852463 499351006 499931831 500377808 500712318 501479034 501904907 502290154 502722092 502925148
2980.9 502925148 502775421 502725868 503104095 503064499 503333168 503591347 503499489 503630638 503980751 504257774
2990.5 504257774 503875465 503764801 503814201 503493347 502833633 502499313 502513885 502119026 502290573 502112312
$$ packed form
2923D80387192k70806j96647o06232n98984l63006K19230O04668J64566l57132R7771
2932.7D79080620J66931k46964m0779N91584R73777P00112M97017K94685K83623P69501
2942.3D83070107Q43925M56848O42395O00357L6011J59759L78342P85866P02667M59595
2952D88135872P81937L68461K15912L82195N28297M71725J72081R5826j450O50597
2961.6D91801453R79194N04189L32298M24881P76329Q70705M64897M21982O68564P86438
2971.2D98030930Q21533M98543N80825M45977L34510P66716M25873L85247M31938K03056
2980.9E02925148j49727m9553L78227l9596K68669K58179r1858J31149L50113K77023
2990.5E04257774l82309j10664M9400l20854o59714l34320J4572l94859J71547j78261
$$ plain form
3000.2 502112312 501419334 500710182 499884758 499458466 498887215 498462067 497713051 497023659 496840858 496486740
3009.8 496486740 496125641 495814590 495764122 495264168 494533920 493735542 493041039 492643433 491841431 491107788
3019.5 491107788 490341072 489944077 489687004 489252930 488862343 487823143 486662750 485523491 484410477
3028.1 484410477 483751221 483436852 482621651 481800804 481511383 480741272 480011559 479194336 478422470 477778015
3037.8 477778015 476781387 475878830 475132446 474667244 473888702 473377228 473259392 472542534 471362305
3046.5 471362305 470078087 469120789 468069153 467445602 467053642 466019363 464960213 464210739 463732147
3055.1 463732147 463079987 462328644 461578217 460612640 459676247 459306908 458680763 457459373 456856155
3063.8 456856155 456095810 455447464 455403557 454977722 453888054 452819939 452477913 451768608 450787125
$$ packed form
3000.2E02112312o92978p09152q25424m26292n71251m25148p49016o89392j82801l54118
3009.8D96486740l61099l11051n0468m99954p30248p98378o94503l97606q02002p33643
3019.5D91107788p66716l96995k57073m34074l90587j039200j160393j139259j113014
3028.1D84410477o59256l14369q15201q20847k89421p70111p29713q17223p71866o44455
3037.8D77778015r96628r02557p46384m65202p78542n11474j17836p16858j180229
3046.5D71362305j284218r57298j051636o23551l91960j034279j059150p49474m78592
3055.1D63732147o52160p51343p50427r65577r36393l69339o26145j221390o03218
3063.8D56856155p60345o48346m3907m25835j089668j068115l42026p09305r81483
$$ plain form
3072.5 450787125 449966087 449420090 449127235 448564262 447980537 447095108 446471024 445805740 445192108 444659271
3082.1 444659271 443399391 442618027 442149658 441802940 441053734 439744835 439086342 438846512 438324928
3090.8 438324928 437303772 436752701 436054153 435236588 434965935 434175262 433475761 432960510 432283630
3099.5 432283630 431346169 430479202 430070839 429374123 428740692 428202515 427436180 426701508 425859833 424995422
3109.1 424995422 424428825 423780136 423175583 423021240 422524567 421488571 420484886 419774208 418890190
3117.8 418890190 417982597 417385521 416917114 416581345 415460052 414287415 413880348 413292694 412529373
3126.5 412529373 411893616 411412315 410732613 409574089 408289566 407681122 407443237 406960487 406337433
3135.2 406337433 405565147 404867744 403956413 403228645 402573967 401737709 400778427 399414940 398825951
$$ packed form
3072.5D50787125q21038n45997k92855n62973n83725q85429o24084o65284o13632n32837
3082.1D44659271j259880p81364m68369l46718p49206j308899o58493k39830n21584
3090.8D38324928j021156n51071o98548q17565k70653p90673o99501n15251o76880
3099.5D32283630r37461q66967m08363o96716o33431n38177p66335p34672q41675q64411
3109.1D24995422n66597o48689o04553j54343m96673j035996j003685p10678q84018
3117.8D18890190r07593n97076m68407l35769j121293j172637m07067n87654p63321
3126.5D12529373o35757m81301o79702j158524j284523o08444k37885m82750o23054
3135.2D06337433p72286o97403r11331p27768o54678q36258r59282j363487n88989
$$ plain form
3143.9 398825951 398771133 398550644 397812157 396895828 396352997 395371246 394555092 393717155 392859001 392251015
3153.5 392251015 391374130 390700531 390062065 389222260 388143578 387481537 386995621 386045952 385219231
3162.2 385219231 384501266 383913536 383368263 382902412 382150993 381271172 380699043 379814682 379000015 378383331
3171.8 378383331 377517624 376482925 375669060 375087357 374697990 374414558 373734856 372906151 372178841
3180.5 372178841 371304474 370090866 369170952 368549690 368009605 367617493 366876488 366296616 365686455
3189.2 365686455 365041885 364396286 363500137 362496490 361493530 361058540 360085945 359360504 359240150
3197.9 359240150 358603668 358300896 357853088 357275543 356311493 355652885 355587921 354588280 353461037 352736397
3207.5 352736397 352704468 352514992 351556244 350711060 350136986 349981766 349231911 348122940 347622948 347202301
$$ packed form
3143.9C98825951n4818k20489p38487r16329n42831r81751q16154q37937q58154o07986
3153.5C92251015q76885o73599o38466q39805j078682o62041m85916r49669q26721
3162.2C85219231p17965n87730n45273m65851p51419q79821n72129q84361q14667o16684
3171.8C78383331q65707j034699q13865n81703l89367k83432o79702q28705p27310
3180.5C72178841q74367j213608r19914o21262n40085l92112p41005n79872o10161
3189.2C65686455o44570o45599q96149j003647j002960m34990r72595p25441j20354
3197.9C59240150o36482l02772m47808n77545r64050o58608o4964r99641j127243p24640
3207.5C52736397l1929j89476r58748q45184n74074j55220p49855j108971m99992m20647
$$ plain form
3217.2 347202301 346615829 346167336 345546761 344679451 344111900 343631516 343367996 342878532 342245903 341562500
3226.8 341562500 340515747 340260658 340242958 339647713 338965149 338690834 338230247 337424164 336927681 335982590
3236.4 335982590 335139008 334798393 334384766 333772850 333316498 333133278 332371292 331802330 331654854 331432724
3246.1 331432724 331134834 330570526 330005112 329430466 329088478 328660622 328107986 327845955 327495880 327185287
3255.7 327185287 327003899 326342850 325492630 325047646 324516106 324296112 324299202 323594246 322587662 322116966
3265.4 322116966 321967964 321692009 321924286 321587944 320503998 319812012 319243488 319022884 318671780
3274 318671780 318412132 318291874 317997017 317772541 317324295 317144165 316766396 315935268 315334320 315277634
3283.7 315277634 315240898 314901333 314788418 314519615 314056873 313365440 313061371 313075848 312495537 312029285
$$ packed form
3217.2C47202301n86472m48493o20575q67310n67551m80384k63520m89464o32629o83403
3226.8C41562500j046753k55089j7700n95245o82564k74315m60587q06083m96483r45091
3236.4C35982590q43582l40615m13627o11916m56352j83220p61986n68962j47476k22130
3246.1C31432724k97890n64308n65414n74646l41988m27856n52636k62031l50075l10593
3255.7C27185287j81388o61049q50220m44984n31540k19994L090p04956j006584m70696
3265.4C22116966j49002k75955K32277l36342j083946o91986n68524k20604l51104
3274C18671780k59648j20258k94857k24476m48246j80130l77769q31128o00948n6686
3283.7C15277634l6736l39565j12915k68803m62742o91433l04069J4477n80311m66252
$$ plain form
3293.3 312029285 311719532 311536369 311347370 310946655 310423908 309960442 309650784 309400787 309362965 308862820
3303 308862820 308536224 308471241 308147182 308028679 307651958 307336960 306826210 305706730 304995804 305281048
3312.6 305281048 305309277 304702091 304383602 303754997 303420506 303069019 302221508 301992550 301822605 301220608
3322.3 301220608 300492630 300219059 300002594 299713192 299192009 298270988 298018436 297502899 296798325 296467953
3331.9 296467953 295790100 295280914 294947376 294280891 293530941 293524704 293419342 292225838 291347504 291350384
3341.6 291350384 291161823 290544968 289955025 289485588 289019356 288641453 288915997 289116116 288333073 287392883
3351.2 287392883 287015228 287114258 287025547 286693306 286162891 285767612 285874920 285778828 285501175 285192032
3360.8 285192032 284956875 284944992 285196915 285155449 284504471 284168758 283904343 283986835 284254684 283684406
$$ packed form
3293.3C12029285l09753j83163j88999m00715n22747m63466l09658k49997l7822n00145
3303C08862820l26596o4983l24059j18503l76721l14998n10750j119480p10926K85244
3312.6C05281048K8229o07186l18489o28605l34491l51487q47511k28958j69945o01997
3322.3C01220608p27978k73571k16465k89402n21183r21021k52552n15537p04574l30372
3331.9B96467953o77853n09186l33538o66485p49950o237j05362j193504q78334K880
3341.6B91350384j88561o16855n89943m69437m66232l77903K74544K00119p83043r40190
3351.2B87392883l77655R9030q8711l32241n30415l95279J07308r6092k77653l09143
3360.8B85192032k35157j1883K51923m1466o50978l35713k64415Q2492K67849n70278
$$ plain form
3370.5 283684406 283191109 283086052 282763138 282581367 282743340 282850933 283033314 282988586 282515469 282138977
3380.1 282138977 282117519 282096310 281560783 281263332 281208897 281327763 281658077 281681442 281832466 281805916
3389.8 281805916 281697788 281487236 281167850 281179123 281472721 281699562 281009083 280701199 280720100 280445805
3399.4 280445805 280470009 279960995 279872894 280117722 279796810 279553947 279686146 280290947 280705833 280689373
3409.1 280689373 280538521 280609589 280861683 280956001 281088963 281370068 281361866 281134510 281302071 281319847
3418.7 281319847 281217346 281396370 282026405 282935123 282728939 282199726 282683620 283243942 283332386 283440056
3428.3 283440056 283495274 283549061 284057407 284887695 285220108 284805794 285157108 285738277 285589466 285673771
3438 285673771 285691166 285886154 286602783 287492733 287942753 287500000 287156601 287799435 288842583 288884773
$$ packed form
3370.5B83684406m93297j05057l22914j81771J61973J07593J82381m4728m73117l76492
3380.1B82138977k1458k1209n35527k97451n4435J18866L30314K3365J51024k6550
3389.8B81805916j08128k10552l19386J1273K93598K26841o90479l07884J8901k74295
3399.4B80445805K4204n09014q8101K44828l20912k42863J32199O04801M14886j6460
3409.1B80689373j50852P1068K52094R4318J32962K81105q202k27356J67561J7776
3418.7B81319847j02501J79024O30035R08718k06184n29213M83894N60322Q8444J07670
3428.3B83440056N5218N3787N08346Q30288L32413m14314L51314N81169j48811Q4305
3438B85673771J7395J94988P16629Q89950M50020m42753l43399O42834J043148M2190
$$ plain form
3447.6 288884773 288861694 289220676 289551220 290078754 290734348 291568584 292124996 292753334 292921238 292807846
3457.3 292807846 293423882 293866882 294361649 294847851 295226078 295364056 295533199 296518383 297287426 297910881
3466.9 297910881 298443241 298854084 299687786 300395737 300570469 300679913 301438828 301967907 301887436 302382584
3476.6 302382584 303638992 304908848 305405045 305419044 305986938 306800346 307160149 307774315 308220482
3485.2 308220482 308624668 309749260 310712967 311483040 312163143 312825966 313728714 314187737 314171600 314698124
3494.9 314698124 315804405 316476345 316975117 317822456 318856697 319657745 320374641 321049194 321263657
3503.6 321263657 321773033 322428474 323182755 324523926 325802917 325944061 326172638 327394104 328073349
3512.2 328073349 329250946 330782280 331395111 331838226 332612762 333536720 333938065 334749374 335834770
$$ packed form
3447.6B88884773k3079L58982L30544N27534O55594Q34236N56412O28338J67904j13392
3457.3B92807846O16036M43000M94767M86202L78227J37978J69143R85184P69043O23455
3466.9B97910881N32360M10843Q33702P07951J74732J09444P58915N29079q0471M95148
3476.6C02382584J256408J269856M96197J3999N67894Q13408L59803O14166M46167
3485.2C08220482M04186J124592R63707P70073O80103O62823R02748M59023j6137N26524
3494.9C14698124J106281O71940M98772Q47339J034241Q01048P16896O74553K14463
3503.6C21263657N09376O55441P54281J341171J278991J41144K28577J221466O79245
3512.2C28073349J177597J531334O12831M43115P74536R23958M01345Q11309J085396
$$ plain form
3520.9 335834770 336704750 337360382 337424469 338529587 339929619 340876884 341983376 342950058 343704147
3529.6 343704147 344574547 345374680 346389999 347629662 348167725 349624634 350789719 350655403 352066231
3538.3 352066231 353540573 354247208 354993057 356485023 357847633 358769569 359664421 360425758 362040138
3547 362040138 362309837 363396225 365263252 366769028 368235283 367713737 369228745 371032944 372238731
3555.6 372238731 373827705 374580307 376378517 377529297 378644409 379854889 381083565 382290764
3563.4 382290764 383445969 386968651 387695923 387137794 388092499 389313087 392659149 394166908 395343513
3572 395343513 397099724 398554039 399459724 400658073 402860374 403942947 405772057 407486572 409002380
3580.7 409002380 410967941 412618332 414418488 415607872 418449211 419866066 419824600 421921387 421834412
$$ packed form
3520.9C35834770Q69980O55632O4087J105118J400032R47265J106492R66682P54089
3529.6C43704147Q70400Q00133J015319J239663N38063J456909J165085j34316J410828
3538.3C52066231J474342P06635P45849J491966J362610R21936Q94852P61337J614380
3547C62040138K69699J086388J867027J505776J466255n21546J515008J804199J205787
3555.6C72238731J588974P52602J798210J150780J115112J210480J228676J207199
3563.4C82290764J155205L522682P27272n58129R54705J220588L346062J507759J176605
3572C95343513J756211J454315R05685J198349K202301J082573J829110J714515J515808
3580.7D09002380J965561J650391J800156J189384K841339J416855m1466K096787q6975
$$ plain form
3589.4 421834412 424337234 427127800 429259758 430716934 431987839 435071030 435840454 438155670
3597.1 438155670 440511208 440875969 443431931 444785500 446566582 449370613 451598244 454287720
3604.8 454287720 457133675 459133415 458935318 461967430 462934456 463829765 469879036 470980568 470276184
3613.5 470276184 473205719 474068565 478486977 481575356 481908455 484320679 484931259 487213860 490865364
3622.2 490865364 493618393 496403046 499805756 502171898 504724960 510225029 509461021 503280945
3629.9 503280945 508535652 514132080 518982964 520516853 521014748 524303818 527647362 530374146
3637.6 530374146 531510696 533860054 537551193 540452423 542347717 543932266 546826324 551022873
3645.3 551022873 556873169 557005501 554104538 557730370 558110161 559217949 560954742 566193504 571209602
$$ packed form
3589.4D21834412K502822K790566K131958J457176J270905L083191P69424K315216
3597.1D38155670K355538L64761K555962J353569J781082K804031K227631K689476
3604.8D54287720K845955J999740j98097L032112R67026Q95309O049271J101532p04384
3613.5D70276184K929535Q62846M418412L088379L33099K412224O10580K282601L651504
3622.2D90865364K753029K784653L402710K366142K553062N500069p64008o180076
3629.9E03280945N254707N596428M850884J533889M97895L289070L343544K726784
3637.6E30374146J136550K349358L691139K901230J895294J584549K894058M196549
3645.3E51022873N850296J32332k900963L625832L79791J107788J736793N238762N016098
$$ plain form
3654 571209602 575610275 579567871 574206429 577515945 582406464 584402733 587275734 588513565 590982475
3662.7 590982475 592416496 594905205 597664680 598538094 602679939 604390793 603651772 604314919 601391792
3671.4 601391792 605923347 613619766 620310173 618241425 605825729 609114418 616225281 620025024
3679.1 620025024 618999901 620459518 623166580 625296326 627207870 628583565 629025345 631767426
3686.8 631767426 636309853 627824249 626793365 634135628 629757385 630835152 636457062 637925301
3694.5 637925301 638871002 638956413 639279671 640640411 640833664 643141251 646059265 641979752 641214905
3703.2 641214905 646051178 647362823 646914368 647283859 649770203 652580338 646832886 650244446 652404709
3711.9 652404709 641916275 647646255 652350082 653205109 654341507 655779877 656469879 653423615
$$ packed form
3654E71209602M400673L957596n361442L309516M890519J996269K873001J237831K468910
3662.7E90982475J434021K488709K759475Q73414M141845J710854p39021O63147k923127
3671.4F01391792M531555P696419O690407k068748j2415696L288689P110863L799743
3679.1F20025024j025123J459617K707062K129746J911544J375695M41780K742081
3686.8F31767426M542427q485604j030884P342263m378243J077767N621910J468239
3694.5F37925301R45701Q5411L23258J360740J93253K307587K918014m079513p64847
3703.2F41214905M836273J311645m48455L69491K486344K810135n747452L411560K160263
3711.9F52404709j0488434N729980M703827Q55027J136398J438370O90002l046264
$$ plain form
3719.6 653423615 654607391 659540329 655461807 652489166 657490921 658485947 658313904 656259384 656597748
3728.3 656597748 659746323 660861588 665677795 662025757 656124420 664188690 663827209 656450119
3736 656450119 657564087 659589767 660217743 663202972 666382828 663371811 666365509 675085144 660325851
3744.7 660325851 650901871 662135544 667303162 671331406 665276871 658080063 668601303 662175293
3752.4 662175293 658332901 665060730 669266357 671777573 667140350 669715347 674408035 667038422
3760.1 667038422 666067505 670480804 671896667 671955490 674213867 671339417 668508606 672124405 676147232
3768.8 676147232 675526199 667990646 670269089 673472290 673923111 674379349 673999252 675041962 675450134
3777.4 675450134 677446671 676133194 669782562 672756348 675100174 676497345 678259277 675673294
$$ packed form
3719.6F53423615J183776M932938m078522k972641N001755R95026j72043k054520L38364
3728.3F56597748L148575J115265M816207l652038n901337Q064270l61481p377090
3736F56450119J113968K025680O27976K985229L179856l011017K993698Q719635j4759293
3744.7F60325851r423980J1233673N167618M028244o054535p196808J0521240o426010
3752.4F62175293l842392O727829M205627K511216m637223K574997M692688p369613
3760.1F67038422r70917M413299J415863N8823K258377k874450k830811L615799M022827
3768.8F76147232o21033p535553K278443L203201M50821M56238l80097J042710M08172
3777.4F75450134J996537j313477o350632K973786K343826J397171J761932k585983
$$ plain form
3785.2 675673294 675233002 676485367 676700134 676961899 677233734 677416229 676743011 676865082 677226791
3793.8 677226791 678341064 680310287 676307449 673368530 676217270 680970917 686502914 677941437
3801.5 677941437 668707504 673930740 677583466 682342453 686365585 676607895 673799286 678516312
3809.3 678516312 679742432 680240021 680900726 680321808 681506653 685125275 680737534 670984802 677140656
3817.9 677140656 682242126 684910660 683679581 669036331 673456497 679285202 680995865 683126907
3825.7 683126907 682298203 678919449 679770737 681496353 683696899 683536301 677219086 680546188 686238022
3834.3 686238022 681601868 682457809 688994217 678949356 675153656 682189331 677935486 678584671
3842.1 678584671 684321823 682120514 680623093 683088684 683157730 683446426 685249786 683976974 685265808
$$ packed form
3785.2F75673294m40292J252365K14767K61765K71835J82495o73218J22071L61709
3793.8F77226791J114273J969223m002838k938919K848740M753647N531997q561477
3801.5F77941437r233933N223236L652726M758987M023132r757690k808609M717026
3809.3F78516312J226120M97589O60705n78918J184845L618622m387741r752732O155854
3817.9F77140656N101470K668534j231079j4643250M420166N828705J710663K131042
3825.7F83126907q28704l378754Q51288J725616K200546j60598o317215L327102N691834
3834.3F86238022m636154Q55941O536408j0044861l795700P035675m253845O49185
3842.1F78584671N737152k201309j497421K465591O9046K88696J803360j272812J288834
$$ plain form
3850.7 685265808 687508469 680442581 682249451 668888855 673246155 684002075 683115540 681148453
3858.4 681148453 682714310 684722748 686660156 682546082 683705673 688395844 681467819 677218857
3866.2 677218857 681701050 686396027 689565201 681263809 675863113 680162811 684800720 685407791
3873.9 685407791 676972656 679265747 683152847 683188248 685880890 689686661 684190216 678736267 683286438
3882.6 683286438 684018707 685804520 688968582 678128128 679810715 683683853 684675522 687677307
3890.3 687677307 685691986 678715515 680470123 683765717 682896347 683514328 683544464 685225143 686556396
3898.9 686556396 679213943 684564514 686304932 680630341 683356705 680299988 679946594 681369247
3906.7 681369247 682329254 684491043 684345016 683922195 683650513 684042282 684498444 684067993 684534912
$$ packed form
3850.7F85265808K242661p065888J806870j3360596M357300J0755920q86535j967087
3858.4F81148453J565857K008438J937408m114074J159591M690171o928025m248962
3866.2F77218857M482193M694977L169174q301392n400696M299698M637909O07071
3873.9F85407791q435135K293091L887100L5401K692642L805771n496445n453949M550171
3882.6F83286438P32269J785813L164062j0840454J682587L873138R91669L001785
3890.3F87677307j985321o976471J754608L295594q69370O17981L0136J680679J331253
3898.9F86556396p342453N350571J740418n674591K726364l056717l53394J422653
3906.7F81369247R60007K161789j46027m22821k71682L91769M56162m30451M66919
$$ plain form
3915.3 684534912 685548553 682552261 680539703 684177628 683778534 681299973 682953262 683979111
3923.1 683979111 684964142 682544632 680043564 682373123 684101105 684673157 683168259 682665863 684322815
3931.7 684322815 681751709 681114502 683461075 683728485 683714218 683397827 682806320 682661209 682627182 684374313
3941.4 684374313 684612961 680683670 680760269 682203827 682740555 683175583 681779709 683123322 683204193
3950.1 683204193 681224442 682427597 682216263 681690445 682355576 683097610 682818298 681613159 681873550
3958.7 681873550 681857834 682834930 683753433 682451935 681865311 681604004 681429977 681805649 681999893 682173996
3968.4 682173996 682620621 683070068 683822479 683405762 682391968 683090820 683166885 682200241 681743622 682083282
3978 682083282 682123947 681861801 682122345 682181549 682445068 682244186 682002716 681792526 681827011 682464752
$$ packed form
3915.3F84534912J013641k996292k012558L637925l99094k478561J653289J025849
3923.1F83979111R85031k419510k501068K329559J727982N72052j504898n02396J656952
3931.7F84322815k571106o37207K346573K67410j4267l16391n91507j45111l4027J747131
3941.4F84374313K38648l929291P6599J443558N36728M35028j395874J343613Q0871
3950.1F83204193j979751J203155k11334n25818O65131P42034k79312j205139K60391
3958.7F81873550j5716R77096R18503j301498n86624k61307j74027L75672J94244J74103
3968.4F82173996M46625M49447P52411m16717j013794O98852P6065r66644m56619L39660
3978F82083282M0665k62146K60544N9204K63519k00882k41470k10190L4485O37741
$$ plain form
3987.7 682464752 682093887 682029800 681983032 682047043 683002243 683371582 682665710 681945419 682503738 682594376
3997.3 682594376 682328262 682331543 682575150
4000.2 682575150
$$ packed form
3987.7F82464752l70865o4087m6768O4011R55200L69339p05872p20291N58319R0638
3997.3F82594376k66114L281K43607
4000.2F82575150
##END=$$ End of the data block
