##TITLE=$$ Begin of the data block
##JCAMP-DX=5.00 $$ ACD/SpecManager v 10.08
##SPECTROMETER/DATA SYSTEM=Varian
##DATE=15 Jan 2013 09:44:12
##DATA TYPE=INFRARED SPECTRUM
##DATA CLASS=XYDATA
##ORIGIN=
##OWNER=
##NPOINTS=3735
##FIRSTX=399.26403809
##LASTX=4000.35498047
##MAXX=4000.35498047
##MINX=399.26403809
##MAXY=76.47430420
##MINY=27.66897774
##XFACTOR=1.0000000000
##YFACTOR=0.000000100000000
##FIRSTY=49.34412003
##DELTAX=0.96440572
##XUNITS=1/CM
##YUNITS=TRANSMITTANCE
##XYDATA=(X++(Y..Y))
399.3D93441200n210457m370956J103935M241944M275703Q40035m021454j392937K28882
407.9D89135895M138984L077622n808945l112869O64749L21350L072777M467010L909531
416.6D99866104P36160j0000953j3218956M218559M039764r43374j814957J215897
424.3D84098244K047119J639938K220803L82080R04541K477913k387658m181823m352074
433D82849083m609413M82063N147095J870346k082481N74073j694488j298676K261887
441.7D83499489J064453L173599K910195j287537k797356K843743K871132n314904
449.4D86962814m952697O54220L236809K777176l02620n429306m841614J85547j565590
458.1D76724739K123756L709603J764984j920204p79686p32536o655808j98021L353386
$$ plain form
399.3 493441200 488230743 483859787 484963722 489205666 493481369 494321404 490299950 488907013 489135895
407.9 489135895 493274879 496352501 490543556 487430687 488095436 488416786 491489563 495956573 499866104
416.6 499866104 500602264 490601311 477382355 481600914 485640678 484697304 482882347 484098244
424.3 484098244 486145363 487785301 490006104 490388184 491292725 493770638 491382980 487201157 482849083
433 482849083 478239670 478721733 483868828 485739174 483656693 484230766 482536278 481237602 483499489
441.7 483499489 484563942 487737541 490647736 489360199 486562843 489406586 492277718 486962814
449.4 486962814 482010117 482664337 485901146 488678322 488375702 482946396 478104782 478290329 476724739
458.1 476724739 478848495 482558098 484323082 482402878 481623192 480890656 474234848 474036827 477390213
466.8D77390213Q23250L351021j456757k253571J953125J273308k659034k465592l478546
475.5D72477417l431206K584648J020241k140083K51617j850700r39598M272j382751
484.1D66593857L308067M41704l549843J960754M141388j880950j632996K389259j894874
492.8D69876366p36161o84852k475357K668190Q52585j115990O27823J48468j803971
501.5D67357101l162574Q55941N95818q87184l78876J586495R62143j555253k58789
510.2D65114822J147004J037712j397553k484360k126426k552109l58086K189598J839409
518.9D62410011k357712k437171M55055J374397K485848p50199k931862j378250p91588
527.5D56078529l88641L3379L85665O95763M47159R81369O78635j523590n40009r49554
$$ plain form
466.8 477390213 478213463 481564484 480107727 477854156 479807281 481080589 478421555 475955963 472477417
475.5 472477417 469046211 471630859 472651100 470511017 470762634 468911934 467972336 467976608 466593857
484.1 466593857 469901924 470343628 466793785 468754539 472895927 471014977 469381981 471771240 469876366
492.8 469876366 469140205 468455353 465979996 468648186 469500771 468384781 469012604 469161072 467357101
501.5 467357101 464194527 465050468 465646286 464759102 464380226 465966721 466928864 465373611 465114822
510.2 465114822 466261826 467299538 465901985 463417625 461291199 458739090 458381004 460570602 462410011
518.9 462410011 460052299 457615128 458070183 459444580 461930428 461180229 458248367 456870117 456078529
527.5 456078529 455689888 455723267 456108932 456804695 457251854 458233223 458911858 457388268 456848259 455898705
537.2D55898705j670075N20935M32320R05418p04040j420975K1629j149063j299476
545.9D51535378K37121J561356j478806k025146J85585j435662n58128R20067M69208
554.5D49410973o71387p0191l08380k930717j706276O9275m73366M63066K368317O31904
564.2D46783218J24474P94105j190986m81339l40538j473808o72874L10058J396637
572.9D45248947J608734J375885P73430K72980N45006j007080j793900j83792o00586
581.5D46239624r18312k96822P86171J742935j043052o54411J512146O56852N8327
590.2D48083458j336937j312943K81106P27195M21372P12394J424180Q11653J65100
598.9D49976578j501999j511421P40356R80492m57688o76498l1204j105385j502724
$$ plain form
537.2 455898705 454228630 454749565 455181885 456087303 455383263 453962288 453983917 452834854 451535378
545.9 451535378 451772499 453333855 451855049 449829903 450015488 448579826 448021698 448941765 449410973
554.5 449410973 448739586 448669395 448361015 445430298 443724022 443793297 443319931 443782997 446151314 446783218
564.2 446783218 446907692 447701797 446510811 446029472 445688934 444215126 443542252 443852310 445248947
572.9 445248947 446857681 448233566 449006996 449279976 449824982 448817902 447024002 446840210 446239624
581.5 446239624 445321312 445024490 445810661 447553596 446510544 445856133 447368279 448025131 448083458
590.2 448083458 446746521 445433578 445714684 446441879 446863251 447575645 448999825 449811478 449976578
598.9 449976578 448474579 446963158 447703514 448684006 448226318 447549820 447518616 446413231 444910507
607.6D44910507j377754n1117N65567j627312j103897l16887k07290L27034p28226
616.3D40390625r37347J147575J495857j19858N59349M03519q95233k04544J067543
624.9D42907486J202202Q23326P40700N66139J555366J447258Q48275P43675N20477
633.6D51354904O56204J13449J481858K241058J255493J109352J208649J080971P36275
642.3D61238213J268463J323204N14526J66893N33104R81522L74374l23448Q7662J705742
651.9D67870255K117614N53589m50668n65491m73595j60293k60391k71225j96762k85225
661.6D67877808N14869Q80585j14212k58598Q04138m44756o115455K825737K557602
670.3D68527718J176948P06101M99496R50966O638O68907J623802N02434O55517J563568
$$ plain form
607.6 444910507 443532753 443481636 444047203 442419891 441315994 440999107 440791817 441118851 440390625
616.3 440390625 439453278 440600853 442096710 441976852 442536201 442939720 442044487 441839943 442907486
624.9 442907486 444109688 444933014 445673714 446239853 447795219 449242477 450090752 450834427 451354904
633.6 451354904 452011108 452124557 453606415 455847473 457102966 458212318 459420967 460501938 461238213
642.3 461238213 462506676 463829880 464344406 464511299 465044403 466025925 466400299 466076851 466164513 467870255
651.9 467870255 469987869 470541458 470090790 469525299 469051704 468891411 468631020 468359795 468163033 467877808
661.6 467877808 468392677 469273262 469159050 468900452 469704590 469259834 463144379 465970116 468527718
670.3 468527718 469704666 470410767 470910263 471861229 471867867 472536774 474160576 474663010 475318527 476882095
679.9D76882095K218209J677818O20193O67839P61261j6632Q65555J534805q0490P78199
689.6D85908852J823043R70078o523K57606J214638K02980R2964N86777R00307N72090
699.2D92522812j045380L55912J946182P13501j42556L14713J002007O43043N46188
707.9D96856422J360550Q73375L91503J259651J362305K54974m61426O23932J358299
716.6E03879585R11217P64198M63600l6544p6142J131897R85909J88293Q78868O85959
726.2E09776840P30972Q41179m57P5073J124191J055145J000367J764869R10340N61599
735.8E17840118N45044K53678R33037J098251L21121j87149R17931J299553J034355
744.5E24055939O46019k23580R6360N72052R14726J082573J876564J468658j99508
$$ plain form
679.9 476882095 479100304 480778122 481398315 482066154 482827415 482810783 483676338 485211143 485130653 485908852
689.6 485908852 487731895 488701973 488695450 488953056 490167694 490370674 490463638 491050415 491950722 492522812
699.2 492522812 491477432 491833344 493779526 494493027 494350471 494665184 495667191 496310234 496856422
707.9 496856422 498216972 499090347 499481850 500741501 502103806 502358780 501897354 502521286 503879585
716.6 503879585 504790802 505555000 506018600 505982056 505905914 507037811 508023720 508212013 509090881 509776840
726.2 509776840 510507812 511348991 511348534 511423607 512547798 513602943 514603310 516368179 517278519 517840118
735.8 517840118 518385162 518638840 519571877 520670128 520991249 520804100 521722031 523021584 524055939
744.5 524055939 524701958 524478378 524574738 525146790 526061516 527144089 529020653 530489311 530289803
753.2E30289803P75947J833115J338958J85395J2054J357994J052094J0109R95598
761.9E37851067J822815O57844l40767N00794J401519M39988L09410L29322l54080
770.6E42617912R8000J73683O27975K58370o34575k59132J98974J249924J061287l93982
780.2E44998436J15852J302376L5515n87845O53229J049690J027832K91176L47214
788.9E49233475R30748P27539O33697L44277n30358j056938K0752L26042Q2932K27852
798.5E50940018J43051K02141k26670j760559k302551o20728j237716j369400l74031
807.2E43393555j109963r79614p79915j88026n67780j381264j772842j520576q23746
815.9E34269829j988449r68972K76642L01895O46439M20418J048431J155968J698418
$$ plain form
753.2 530289803 531065750 532898865 534237823 534423218 534435272 535793266 536845360 536855469 537851067
761.9 537851067 539673882 540331726 539990959 540491753 541893272 542333260 542642670 542971992 542617912
770.6 542617912 542715912 542889595 543517570 543775940 543141365 542882233 543081207 544331131 545392418 544998436
780.2 544998436 545114288 546416664 546452179 545864334 546517563 547567253 548595085 548886261 549233475
788.9 549233475 550164223 550891762 551525459 551869736 551339378 550282440 550303192 550629234 550712166 550940018
798.5 550940018 551083069 551285210 551058540 549297981 546995430 546374702 545136986 543767586 543393555
807.2 543393555 542283592 541303978 540524063 540336037 539768257 538386993 536614151 535093575 534269829
815.9 534269829 532281380 531312408 531589050 531890945 532537384 532957802 534006233 535162201 536860619
824.6E36860619J650695J815071K976418K649879K681618K454148L043785L546562
832.3E57678795L045120K579765J989365K176819J760864J150589J750794K264289
840E74396400J210137K325630K682800J631852K286338R52530P35932Q72116J216011
848.7E88309746J193924L89213L60527M33197K725640J993522J512375J769409P25823
857.4E99413376J211624L52020Q04482Q45184J203690R75265N64156J643219Q66050
866F07879066N84031l53432q32939j849747j707802j401672k464714r06182p37152
874.7E98209457l11164o41137j206932j083755k218132j370201j072541j399879j095657
883.4E87810059o26908r69162J98288J272545m36630k69776k45170n0621m03824j024056
$$ plain form
824.6 536860619 538511314 540326385 543302803 545952682 548634300 551088448 554132233 557678795
832.3 557678795 560723915 563303680 565293045 567469864 569230728 570381317 572132111 574396400
840 574396400 575606537 577932167 580614967 582246819 584533157 585485687 586221619 587093735 588309746
848.7 588309746 589503670 589892883 590253410 590686607 593412247 595405769 596918144 598687553 599413376
857.4 599413376 600625000 600977020 601781502 602626686 603830376 604805641 605369797 607013016 607879066
866 607879066 608463097 608109665 607276726 605426979 603719177 602317505 599852791 598946609 598209457
874.7 598209457 597898293 597257156 596050224 594966469 592748337 591378136 590305595 588905716 587810059
883.4 587810059 587183151 586213989 586412277 587684822 587248192 586978416 586733246 586682625 586278801 585254745
893E85254745k46772l20244R71184K033233J506005K94189k098k58980n07469p83577
902.7E87940216j632881M16756J459579K420845L596268K990227K930183J943054R84764
911.4F03049011k72484R4490m8408j199341j057167j492729j620369j402931m94156
920E95555916k023163k968521k340469l160935l298454l891793l252677l261872l926430
928.7E67431602k822837k282372k591019k312316j251641j701278k286988k207756
936.4E49975395k043381j866989j214790K02980l24364p58743q75397j029281n15938
945.1E41549492o11839n9205P9651J07918K94190J135063J580124L82156N57823Q2550
954.8E45097923j164551j783332k048416k215043k061042j648560k257385j557961
$$ plain form
893 585254745 585007973 584687729 585658913 587692146 589198151 589492340 589490242 589231262 588723793 587940216
902.7 587940216 586307335 586724091 588183670 590604515 594200783 597191010 600121193 602064247 603049011
911.4 603049011 602776527 602871017 602822609 601623268 600566101 599073372 597453003 596050072 595555916
920 595555916 593532753 590564232 588223763 585062828 581764374 577872581 574619904 571358032 567431602
928.7 567431602 564608765 562326393 559735374 557423058 556171417 554470139 552183151 549975395
936.4 549975395 547932014 546065025 544850235 545053215 544728851 543970108 543094711 542065430 541549492
945.1 541549492 540937653 540878448 540958099 541066017 541360207 542495270 544075394 544457550 545015373 545097923
954.8 545097923 543933372 542150040 540101624 537886581 535825539 534176979 531919594 530361633
962.5E30361633o75735q97179j097526j744995j449204j646652k625847k204895j699486
971.2E16320114k319565k754478k368546k477035k559395k226601l294677m207192
978.9D94112625m015350m507981n371856n117913l653030l983574n060463m230690
986.6D58171768l267174m063644m870567m148674m124871m353790l897934k793579
994.3D26651535k656670l422164l152009k304077j908188k987861k924843k934685
1002D04361038l518982l092193k668190k272415k182198j409073j705360j494675j292839
1010.7C84725113j801415k105331l032227k135162j981697j480217k220802k997322
1018.4C66970940j673394k773857k311821j626854k090034k521706j636047j576805
$$ plain form
962.5 530361633 529685898 528788719 527691193 525946198 524496994 522850342 520224495 518019600 516320114
971.2 516320114 514000549 511246071 508877525 506400490 503841095 501614494 498319817 494112625
978.9 494112625 490097275 485589294 480217438 475099525 471446495 467462921 462402458 458171768
986.6 458171768 454904594 450840950 445970383 441821709 437696838 433343048 429445114 426651535
994.3 426651535 423994865 420572701 417420692 415116615 413208427 410220566 407295723 404361038
1002 404361038 400842056 397749863 395081673 392809258 390627060 389217987 387512627 386017952 384725113
1010.7 384725113 382923698 380818367 377786140 375650978 373669281 372189064 369968262 366970940
1018.4 366970940 365297546 362523689 360211868 358585014 356494980 353973274 352337227 350760422
1026.1C50760422k467385j142463j571923q30726q74596k58598K44446j583405p38525
1034.8C41537247J14135J761780J153527J680679L159637K661209K135048M74549J416282
1043.5C56094093O72989j4114L27949J87149o79054k083588j107368k825203j701622
1052.2C48871231K1744j050644j924515k388267o65474j154099n40619o94885P42607
1060.9C41217079K414704J871643L247337K136192K749367K211609J057243R20983
1068.6C57826157O46400Q30994j12076J139450O94695P70301K53640k31362N96428
1077.2C62414627l76434K30293l32146J058617J358147O05888N39474n73654J321564
1085.9C66246376J688194J603852J396522J428719P60917P70798K776146J629524J199341
$$ plain form
1026.1 350760422 348293037 347150574 345578651 344747925 343873329 343614731 343859177 342275772 341537247
1034.8 341537247 341651382 343413162 344566689 346247368 349407005 352068214 354203262 354677811 356094093
1043.5 356094093 356767082 356752968 357080917 357268066 356589012 354505424 353398056 350572853 348871231
1052.2 348871231 348892975 347842331 345917816 343529549 342864075 341709976 341169357 340474472 341217079
1060.9 341217079 343631783 345503426 348750763 350886955 353636322 355847931 356905174 357826157
1068.6 357826157 358472557 359303551 359191475 360330925 361025620 361795921 362049561 361818199 362414627
1077.2 362414627 362038193 362268486 361936340 362994957 364353104 364958992 365498466 364924812 366246376
1085.9 366246376 367934570 369538422 370934944 372363663 373124580 373895378 376671524 378301048 379500389
1094.6C79500389Q03757J525764K255936J079864P13120P46269J673470J462822J700401
1103.3C91461792J084251Q71582J727448J661873J857986R58481J119843L32870j33781
1112D00942345R31511J135215J499863J160622P30362j06583r842J96075J66970L71856
1121.6D07018394k937k7046m23622j91193J97296J957512J948052J100425K440834
1130.3D14017715J917077K613449K434349K238579L133735K156944K302437K813225
1138D33627510K815132K538796K429046K009583J346893J188126J232567J249275Q68759
1146.7D49305687N09376M0780K78396L28331N8441K10762j35345m53529p59163l33977
1156.3D49049759n53436j305886j243171j195221k62337k04010j82915R06372J344986
$$ plain form
1094.6 379500389 380304146 381829910 384085846 385165710 385878830 386625099 388298569 389761391 391461792
1103.3 391461792 392546043 393417625 395145073 396806946 398664932 399623413 400743256 401076126 400942345
1112 400942345 401873856 403009071 404508934 405669556 406399918 406293335 406283493 406479568 406646538 407018394
1121.6 407018394 407015457 406988411 406564789 406373596 406570892 408528404 410476456 411576881 414017715
1130.3 414017715 415934792 418548241 420982590 423221169 426354904 428511848 430814285 433627510
1138 433627510 436442642 438981438 441410484 443420067 444766960 445955086 447187653 448436928 449305687
1146.7 449305687 449815063 449855843 450134239 450462570 450521011 450731773 450596428 450142899 449383736 449049759
1156.3 449049759 448496323 447190437 445947266 444752045 444489708 444285698 444102783 445009155 446354141
1165D46354141J645851K471848K684173K065087K533836K783165K991333L134995K959785
1173.7D69624214L148880L130799K318115J809616K917366K971687K446976K124824
1181.4D90492477J636734J439209J656304K025757J699295J189766O94809Q93287J51863
1190.1E01879501l70865J68038k01645k23389j91459n08385j284637j201172n95208
1198.8D97470779r94949j261940j178245n70145j064568j483612n06248o57768o74859
1207.4D89078445l20625m07753k67944l33443m15382j65673j2931k23847j94015l79868
1217.1D86356964o65016m81262l06626k02407k90490m83818n72281m57153l03307m46929
1226.7D82147675j181221j306572n95131p47567q79821p16210n22079k58217m89082
$$ plain form
1165 446354141 447999992 450471840 453156013 455221100 457754936 460538101 463529434 466664429 469624214
1173.7 469624214 472773094 475903893 478222008 480031624 482948990 485920677 488367653 490492477
1181.4 490492477 492129211 493568420 495224724 497250481 498949776 500139542 500834351 501727638 501879501
1190.1 501879501 501508636 501676674 501475029 501251640 501060181 500551796 499267159 498065987 497470779
1198.8 497470779 496475830 495213890 494035645 493465500 492400932 490917320 490411072 489753304 489078445
1207.4 489078445 488757820 488350067 488082123 487748680 487333298 487167625 487154694 486930847 486736832 486356964
1217.1 486356964 485691948 485210686 484904060 484701653 484411163 483927345 483355064 482897911 482594604 482147675
1226.7 482147675 480966454 479659882 479064751 478317184 477437363 476721153 476199074 475940857 475451775
1235.4D75451775l89672k16293J3618k11029n40275l66478l74336N1117k08283m98886
1245D72711258n03769q03223n08384m06952l38555m02336R0828M69742k65236o36520
1254.7D69406853n26047O0997J95122P0266N3788o6490J02462J25809j7509k5025L14980
1265.3D69695206L77578P00150P09419Q05626J257134O52999O08750N36995P15217
1274D76059074R56345O10886P97958R64546J023865P62978J055145J332779J097450
1282.7D84661026J225090J374893J046601P04689J109199J171074R48143M53529N09301
1291.3D93203545J025734R76638Q13294K55050J01395J62964L56255J53198p6409L72429
1301D97344093J19591j49803J06087K91786Q7204n3826o51512r62524m95987p99904
$$ plain form
1235.4 475451775 475062103 474845810 474859428 474648399 474108124 473741646 473367310 473418427 473210144 472711258
1245 472711258 472207489 471404266 470895882 470488930 470150375 469748039 469838867 470308609 470043373 469406853
1254.7 469406853 468880806 468941803 469136925 469207191 469260979 469194489 469296951 469422760 469405251 469380226 469695206
1265.3 469695206 470072784 470772934 471482353 472287979 473545113 474198112 474806862 475343857 476059074
1274 476059074 477015419 477626305 478424263 479388809 480412674 481175652 482230797 483563576 484661026
1282.7 484661026 485886116 487261009 488307610 489012299 490121498 491292572 492240715 492694244 493203545
1291.3 493203545 494229279 495205917 496019211 496274261 496375656 496538620 496894875 497048073 496971664 497344093
1301 497344093 497463684 497313881 497419968 497711754 497798958 497745132 497093620 496131096 495635109 494835205
1310.6D94835205r23309j078186q36945k59552m29420l62816J11160M92592N1193P77168
1320.3D92377090J578446O38389P54586J376495J158333M22516L3073L20091L05748
1328.9D98964767k91023m40101m94423m93965k92016n83419j6976L60718K83890M14009
1338.6D97411461R1362L64036K74811R66034J108513O89507J099815O43730N07546
1347.3E03156815P61871J081047L85475j57814k87895m63753k15416q57658l67241
1355.9E03035431m1237J33667M1847m90722l29361n02091p49855j819382N1003K67296
1365.6D99596596m35066P8887p38601k81182k04849k58331k87399o45066p7820l77426
1375.2D96369743L30658P8354l18336j81313K36740j69983j415100j583175k184678
$$ plain form
1310.6 494835205 493911896 492833710 491996765 491737213 491307793 490944977 491056137 491548729 491599922 492377090
1320.3 492377090 493955536 494593925 495348511 496725006 497883339 498305855 498338928 498659019 498964767
1328.9 498964767 498673744 498233643 497739220 497245255 496953239 496369820 496352844 496713562 496997452 497411461
1338.6 497411461 497502823 497866859 498141670 499107704 500216217 500905724 502005539 502649269 503156815
1347.3 503156815 503918686 504999733 505385208 505227394 504939499 504475746 504260330 503402672 503035431
1355.9 503035431 502994194 503127861 503169708 502678986 502349625 501847534 501097679 499278297 499329300 499596596
1365.6 499596596 499161530 499240417 498501816 498220634 498015785 497757454 497470055 496824989 496747169 496369743
1375.2 496369743 496700401 496778755 496460419 496279106 496515846 496345863 494930763 493347588 491162910
1383.9D91162910j414985o67572j240654k175637q76541j8844j535187j651764j575890
1392.6D80005836j852569l124962l491898j127128j667175j688309k817269k590637
1400.3D61645889j358261j872635j381836j587791k695503k558632j794358j846771
1408D46550102k007408j631203j857185j283340j367722j225357m49104q79403r23995
1416.7D34925385j319504l36724j875839n63125J007347k28577M26178l55034J121903
1425.4D32802010J520805L76129J249123L42216O19469R54742J604462J606026J740570
1434.1D42815552K675171J478347J622696K458153L226814J817055J502152J863327
1441.8D59459267R91974K234993J300621J763191J883888J793861J897812J611519
$$ plain form
1383.9 491162910 489747925 489080353 487839699 485664062 484787521 484768677 483233490 481581726 480005836
1392.6 480005836 478153267 475028305 471536407 470409279 468742104 467053795 464236526 461645889
1400.3 461645889 460287628 458414993 457033157 455445366 452749863 450191231 448396873 446550102
1408 446550102 444542694 442911491 441054306 439770966 438403244 437177887 436728783 435849380 434925385
1416.7 434925385 433605881 433269157 431393318 430830193 431837540 431608963 432035141 431680107 432802010
1425.4 432802010 434322815 434698944 435948067 436290283 436909752 437864494 439468956 441074982 442815552
1434.1 442815552 445490723 446969070 448591766 451049919 454276733 456093788 457595940 459459267
1441.8 459459267 460451241 462686234 463986855 465750046 467633934 469427795 471325607 472937126
1449.5D72937126K133522R05647J878853R25522J061554J712380R89723K417106L09754
1458.2D85271187L666229K456284K776603K035103J255226J959839k01340K402382
1465.9E01621513K266007K495270K222099K371254L315201J311493K095756K552490
1473.6E20251083L312912K735367J678009K764473K589951K668304K456932K061005
1481.3E40518036J418953J864929J600113Q51288J300812R23805Q17871J387558k37770
1490E50445595l37525K336426J689491j63612l19328r93576m314156M80728o61354
1498.7E48162689k185974k17628q07572q36220q98399j56517j084022m095612m162331
1507.3E33718414k56347J381607K746J232186q69980j707459J44081j026496j324425
$$ plain form
1449.5 472937126 475070648 475976295 477855148 478780670 479842224 481554604 482544327 484961433 485271187
1458.2 485271187 488937416 491393700 494170303 496205406 497460632 499420471 499219131 501621513
1465.9 501621513 503887520 506382790 508604889 510976143 514291344 515602837 517698593 520251083
1473.6 520251083 523563995 526299362 527977371 530741844 533331795 536000099 538457031 540518036
1481.3 540518036 541936989 543801918 545402031 546253319 547554131 548477936 549295807 550683365 550445595
1490 550445595 550108070 552444496 554133987 553970375 553651047 552657471 548343315 548824043 548162689
1498.7 548162689 545976715 545759087 544951515 544115295 543216896 543060379 541976357 537880745 533718414
1507.3 533718414 533462067 534843674 534846420 536078606 535208626 533501167 533645248 532618752 531294327
1516E31294327l099900j852149J933441J690712k625161l608169M88319J424294J837425
1524.7E27483139j068344N79376R04389j1177M35028K18582M75158N150o11648j501236
1534.3E26908417J748848J393928O46172J316643k995568k520485J788407N49736j242562
1543E27593536J439057J551666p80945J367226N70488Q41980j067505j765709J086655
1551.7E30836449P08923J216240l173561o13175J257744J114998k530098j1365127
1559.4E17452393M456787J119079R69544j396866j399040k922287k726441n96733j992340
1568.1E12964096j372757q021393j518440j606865l346672k435532k753524j450959
1575.8D90457954j2491645j188775k378997l650170l422355n119591l252373n522957
$$ plain form
1516 531294327 528194427 526342278 528275719 529966431 527341270 523733101 524221420 525645714 527483139
1524.7 527483139 526414795 526994171 527898560 527887383 528322411 528540993 529016151 529021301 528409653 526908417
1534.3 526908417 528657265 530051193 530697365 532014008 529018440 526497955 528286362 528836098 527593536
1543 527593536 529032593 530584259 529803314 531170540 531741028 532583008 531515503 529749794 530836449
1551.7 530836449 531545372 532761612 529588051 528974876 530232620 531347618 528817520 517452393
1559.4 517452393 521909180 523028259 523997803 522600937 521201897 518279610 515553169 514956436 512964096
1568.1 512964096 511591339 503569946 502051506 500444641 497097969 494662437 491908913 490457954
1575.8 490457954 477966309 476777534 474398537 470748367 467326012 462206421 458954048 453431091
1583.5D53431091l335571m812660m197655l959885n079307l340149n617943k641563
1591.2D20446358m904976l610611m019432m703522k848473m975013j828919m138145
1599C89417267k319451l545036l183021j992455m107704r98001l288956j167183l330726
1607.6C65484734j491890j204644k862396M07715k454224K92588j833649K19498k67792
1616.3C56289940n302849K647972j223030R05609j287193P17201o55327j833687K315636
1625C52574272j16005K006073j670418P95823L68843O54220J296540j96801K349129
1633.7C58061676l61481J102753j31035L076477J690827Q93287K623406N54886K710990
1642.4C70221786N67360K250100J895103j26533K921829j026192L503380J301956K954750
$$ plain form
1583.5 453431091 450095520 445282860 441085205 437125320 432046013 428705864 423087921 420446358
1591.2 420446358 415541382 411930771 407911339 403207817 400359344 395384331 393555412 389417267
1599 389417267 387097816 383552780 380369759 378377304 374269600 373271599 369982643 368815460 365484734
1607.6 365484734 363992844 362788200 359925804 360333519 357879295 358171883 356338234 356557732 356289940
1616.3 356289940 350987091 353635063 352412033 353317642 352030449 352747650 352092323 350258636 352574272
1625 352574272 352458267 354464340 352793922 353589745 353958588 354612808 355909348 355712547 358061676
1633.7 358061676 357700195 358802948 358671913 361748390 363439217 364332504 366955910 367510796 370221786
1642.4 370221786 370789146 373039246 374934349 374807816 377729645 376703453 380206833 381508789 384463539
1651C84463539R96742o152229L243256J912918N150108J795311K458954J272774J957969
1659.7C97099342J776924J196366K913894P40319M021225K289314K824745K887345
1667.4D15749474K239837L119087J722451M932556K558784M431153L888702K511520
1675.1D41153564L073884L446693M732971L133659M409981K936020M094162M630966
1682.9D71611900J057930L016281L296357O935081M492340L644562M267769M058037
1690.6E02380257M873390L985519M730912M663314M600830P46727M773369O141434
1698.3E36895752N420761L511772j072998O960030M983940L797989K696228K392654
1706E65586128K647209L320351M286385K683220J997604K305336K637024K649116J51787
$$ plain form
1651 384463539 385460281 379308052 382551308 384464226 389614334 391409645 393868599 395141373 397099342
1659.7 397099342 398876266 400072632 402986526 403726845 407748070 410037384 412862129 415749474
1667.4 415749474 417989311 421108398 422830849 427763405 430322189 434753342 438642044 441153564
1675.1 441153564 444227448 447674141 452407112 455540771 459950752 462886772 466980934 471611900
1682.9 471611900 472669830 475686111 478982468 485917549 490409889 494054451 498322220 502380257
1690.6 502380257 507253647 511239166 515970078 520633392 525234222 525980949 530754318 536895752
1698.3 536895752 542316513 545828285 544755287 551715317 556699257 560497246 563193474 565586128
1706 565586128 568233337 571553688 575840073 578523293 580520897 582826233 585463257 588112373 588264160
1714.7E88264160J178818L406830J322288k923050L791657L436203J861305J387024
1722.4F01725235N42221J336098J958198J487198J236038J351090J589699k86141P60613
1731.1F11700249L266296K995491o40907l018456M690323M234658K177314K608757
1738.8F28013725Q087n11016M658699L151474J073570K454719L706665L287354K574005
1747.5F48417282K433395J487122M214783K211227J809387N067902L150787K879029
1755.2F71670914K856292J264801K829590K814789K486420L040771n33371P03507L459625
1763.9F90593338J680450J623230K408295K113800j219711J725616L360291m18549
1771.6G01866760j907501k35748M413147K224121l65448K240600J109391J752700Q92182
$$ plain form
1714.7 588264160 589442978 592849808 594172096 591249046 595040703 598476906 600338211 601725235
1722.4 601725235 602267456 603603554 605561752 607048950 608284988 609636078 611225777 610939636 611700249
1731.1 611700249 614966545 617962036 617321129 614302673 618992996 623227654 625404968 628013725
1738.8 628013725 628021812 627510796 632169495 635320969 636394539 638849258 642555923 645843277 648417282
1747.5 648417282 650850677 652337799 656552582 658763809 660573196 665641098 668791885 671670914
1755.2 671670914 674527206 675792007 678621597 681436386 683922806 686963577 686430206 687133713 690593338
1763.9 690593338 692273788 693897018 696305313 698419113 697199402 698925018 702285309 701866760
1771.6 701866760 699959259 699723511 704136658 706360779 705995331 708235931 709345322 711098022 711990204
1780.3G11990204o46210J011963J902542J481247o10962O18134J561889J038208R18885
1788.9G19265900J507644L56064n8060j094589o4697L335419R36737L43933J593780
1797.6G26122131J360093P4691r90448K042313K79465Q94317J603928O37588J311264
1806.3G33335342J42975l9215Q47550J276016o89392P07626J623993L95432R61532
1815G38561859R0180N40084j13296R22241J449585Q4229Q49533k26822J059265P99789
1824.6G44016647j857986P50275J967544J445236r97467k565536J298599K483978N97992
1833.3G47139282M26560O12640K07748J99051l14178J021652Q7128K83890M90188J121750
1842.9G51275711N16434m398651K797241K260666l50037l81M69818R55505N3787N10788
$$ plain form
1780.3 711990204 711343994 712355957 714258499 715739746 715128784 715746918 717308807 718347015 719265900
1788.9 719265900 720773544 721129608 721071548 719976959 719912262 723247681 724184418 724528351 726122131
1797.6 726122131 727482224 727556915 726566467 728608780 728888245 729782562 731386490 732024078 733335342
1806.3 733335342 733478317 733439102 734286652 735562668 734873276 735580902 737204895 737600327 738561859
1815 738561859 738652039 739192123 739078827 740001068 741450653 741534882 742384415 742157593 743216858 744016647
1824.6 744016647 742158661 742908936 744876480 746321716 745324249 742758713 744057312 746541290 747139282
1833.3 747139282 747565842 748178482 748386230 748585281 748271103 749292755 749379883 749663773 750153961 751275711
1842.9 751275711 751792145 747393494 750190735 752451401 752101364 752100983 752570801 753526306 753580093 754090881
1852.6G54090881J3275K57645J70365R0789Q05283J11542J85012l61328L83454K6169
1862.2G55773087R0255P00836L55607N10788p00760J61056j318207m53796J887131
1870.9G57005997J034698N78613m54254L14102K33460L63083K11639R4300O41326j16882
1880.6G59906082K26975m51737J53580K5253N5695Q01315n6839R43070n12009j380158
1890.2G59711227P19605Q53805L23716K54364O6223q54263L37753J60904L25088L40424
1899.8G62238846l36380J88064J59989M85077j09787K03552M1199j96305K77863m47998
1909.5G62504120k64130L05710R69238m2495Q0948n5542j31073J110458j554031l81623
1919.1G62541580R55734M65470M63943j031341k91901N58243L44086l46604J31378
$$ plain form
1852.6 754090881 754104156 754361801 754532166 754622955 755428238 755539780 755724792 755363464 755746918 755773087
1862.2 755773087 755863342 756564178 756919785 757430573 756729813 756890869 755572662 755118866 757005997
1870.9 757005997 758040695 758619308 758165054 758479156 758712616 759075699 759287338 759381638 760022964 759906082
1880.6 759906082 760133057 759681320 759834900 759860153 759915848 760717163 760660324 761603394 761091385 759711227
1890.2 759711227 760430832 761284637 761608353 761862717 761928940 761074677 761412430 761573334 761898422 762238846
1899.8 762238846 761902466 762090530 762250519 762735596 762625809 762829361 762870560 762674255 762952118 762504120
1909.5 762504120 762239990 762545700 763514938 763472443 763553391 763497849 763366776 764477234 762923203 762541580
1919.1 762541580 763497314 763962784 764426727 763395386 763103485 763661728 764005814 763659210 763790588
1927.8G63790588K48337J0376L50418k44827j06430p1259K30027j64032M4326J0224
1937.5G64097748o85425M45251M65394M20074q65631j227341R28726N43747n15136
1946.1G63607407m19770O86417K84195j90582m12980k20565J66168J47629K17361n68237
1955.8G63297043P7972j46179j85699J29547l48358J20773l37448K97394J97601J5182
1965.4G63117828J48850r16901k61078L55759M04205j26648j24740k33689P4540M63104
1975.1G62901230j35193J43127j86309J24206k50244m93088j29318l60260L30658J02081
1984.7G62046890K77863J9455j82114m23889l87039O14853o33393r72290o027M61426
1994.3G60815735L24783O7673m3869m36783j14288n33982J94245k1515l76968L55529
$$ plain form
1927.8 763790588 764038925 764049301 764399719 764154892 764048462 763977203 764207230 764043198 764087524 764097748
1937.5 764097748 763412323 763857574 764322968 764743042 763877411 762650070 763578796 764122543 763607407
1946.1 763607407 763187637 763874054 764158249 763967667 763554687 763334122 763500290 763647919 763865280 763297043
1955.8 763297043 763375015 763228836 763043137 763172684 762824326 762945099 762607651 762905045 763102646 763117828
1965.4 763117828 763266678 762349777 762088699 762444458 762848663 762722015 762597275 762363586 762438126 762901230
1975.1 762901230 762766037 762909164 762722855 762847061 762596817 762103729 761974411 761614151 761944809 762046890
1984.7 762046890 762324753 762344208 762162094 761738205 761351166 761966019 761332626 760360336 760354309 760815735
1994.3 760815735 761140518 761208191 761164322 760727539 760613251 760079269 760273514 760251999 759875031 760230560
2004G60230560k51922k289m6463m8981l46527m1046J93710o08139j27563r9564N3711
2014.6G58905487k95639m19388j61896k66037J10169J32828K0294n81665J77688J84708
2024.2G57806549l69339j83258o47659k85111j2665M82560K6703l76206o38657p23342
2033.9G55079575L08380k2354J09253l19520l00750Q3084l98178J43966L52936O7597
2043.5G55103989q97522k95945N1117l49884R2316m17633l14178n2643K96478N5695
2053.2G53271790j11924o4544p3700n0354p94907p1945l4943J22223J3123l86429K78320
2063.8G52096710l23562J0452M272J86997J07651n12619l70865m08860M12293l21732
2073.4G50880737m18167O7826J64947M43573k96936L510J02462J02997m58755l71170
$$ plain form
2004 760230560 759978638 759976349 759929886 759880905 759534378 759493332 759687042 759078903 758951340 758851776 758905487
2014.6 758905487 758609848 758190460 758028564 757762527 757872696 758005524 758025818 757444153 757621841 757806549
2024.2 757806549 757437210 757253952 756606293 756321182 756308517 756791077 756817780 756441574 755802917 755079575
2033.9 755079575 755387955 755365601 755474854 755155334 754854584 754937668 754539490 754683456 755036392 755103989
2043.5 755103989 754206467 753910522 753961639 753611755 753704071 753286438 752972260 752919617 753216095 753271790
2053.2 753271790 753159866 753095322 753021622 752971268 752176361 752104416 752069473 752191696 752204819 751818390 752096710
2063.8 752096710 751773148 751783600 751787872 751974869 752082520 751569901 751199036 750790176 751202469 750880737
2073.4 750880737 750462570 750530396 750695343 751138916 750841980 750845490 750947952 751050949 750592194 750221024
2083.1G50221024J07803k76184j51673m73556L90701L66364o3095p8278n86090l92303
2092.7G49064713l21579o257m71801k12937k91290k29034O60324K4032o4392k94418
2102.4G47857361M6081Q0262l40958l92685m66843R4986m5089K93274k60926k65197
2112G46600266K67486k06299j24893m91486j19857l98560l19748L20282J21155J297
2121.6G45649643n6458J77765m29840q5830o4164j52130r7198m98886L37219L0212
2131.3G44810333J72043J47705j42898k26746m13589K57034j29395K8916j46637q0490
2140.9G44276276O5689P7285N47867j18942P0801m65470j02310M65164K7543K88772
2150.6G45132675m03213k68860j09253K19879J18256j55945K92435P8353K42539k66342
$$ plain form
2083.1 750221024 750328827 750052643 749900970 749427414 749818115 750184479 750121384 750043106 749457016 749064713
2092.7 749064713 748743134 748736877 748265076 748052139 747760849 747531815 748192139 748216171 748151779 747857361
2102.4 747857361 747903442 747983704 747642746 747250061 746783218 746878204 746833115 747126389 746865463 746600266
2112 746600266 746867752 746661453 746536560 746045074 745925217 745526657 745206909 745527191 745648346 745649643
2121.6 745649643 745593185 745770950 745341110 745255280 745191116 745038986 744941788 744442902 744780121 744810333
2131.3 744810333 744982376 745130081 744987183 744760437 744346848 744603882 744474487 744503403 744356766 744276276
2140.9 744276276 744341965 744419250 744967117 744848175 744918976 744453506 744351196 744816360 744843903 745132675
2150.6 745132675 744729462 744460602 744351349 744571228 744689484 744533539 744825974 744904327 745146866 744880524
2160.2G44880524l87192k64664R6512K05460j80664J65634q3695L06931J15356j44500
2169.9G44709702k02561k79388L46222Q2626J34964k4109J40991K82364J42899j23368
2179.5G45210342l41491N35278K42462P1182m3106j60675k62069m60358K22549J68839
2189.1G45182953L08227L69721M52347k51770m42047Q3465k40173L88717l79028k02026
2198.8G45270386M34112R8572L69263m0283K63214k24381m53796j15967K89764M56467
2208.4G46347351m25415k45438n5770M37622L06396J00174J18027k81525k0218j06888
2218.1G46174316L23563j32065l44314J73874K40707K38113j0147L53623k91825k13852
2227.7G46511993J57700k8687p6141l08380M92020K23999q5602k08893m51050m0130
$$ plain form
2160.2 744880524 744493332 744228668 744325180 744530640 744349976 744515610 744431915 744738846 744854202 744709702
2169.9 744709702 744507141 744227753 744573975 744656601 744791565 744767456 744908447 745190811 745333710 745210342
2179.5 745210342 744868851 745404129 745646591 745717773 745674667 745513992 745251923 744791565 745014114 745182953
2189.1 745182953 745491180 745860901 746313248 746061478 745619431 745702896 745462723 745851440 745472412 745270386
2198.8 745270386 745704498 745803070 746172333 746132050 746395264 746170883 745717087 745601120 745890884 746347351
2208.4 746347351 745921936 745676498 745620728 746058350 746364746 746464920 746582947 746301422 746281204 746174316
2218.1 746174316 746497879 746365814 746021500 746195374 746436081 746674194 746664047 747017670 746725845 746511993
2227.7 746511993 746669693 746641006 746564865 746256485 746748505 746972504 746886902 746678009 746226959 746186829
2237.4G46186829K32849J08413k40860J29090n2414K43149q7662l97797L37143J5717
2247G46474457J83258k61536k55279m7303Q0796L33862l86047k32163j00174L44544
2256.7G46134415J75705J35116J19019k67411K40860j69448n0583n14450k79084L28064
2266.3G45852203Q4000M50211j56861N1804j71433m13513k94266n7907K47956l74298
2275.9G45217896K29492L81L3417K69012J61438J04752n41611q7356k67640j50985
2285.6G44968796k97547j38168K05383l9825K89230m75158L0365l1586k79770n8060
2295.2G44173660p27005n21316m15497L30505o10l815P4311j95084K14386l42102l63922
2305.8G42223511r94339k97699k45133o21414J07575k66266J21765n97153M28009l17993
$$ plain form
2237.4 746186829 746419678 746528091 746287231 746416321 746363907 746607056 746519394 746121597 746458740 746474457
2247 746474457 746657715 746396179 746140900 746093597 746174393 746508255 746122208 745890045 745789871 746134415
2256.7 746134415 746310120 746445236 746564255 746296844 746537704 746368256 746317673 745803223 745524139 745852203
2266.3 745852203 745936203 746386414 746229553 746281357 746109924 745696411 745402145 745344238 745592194 745217896
2275.9 745217896 745447388 745447769 745481186 745750198 745911636 746016388 745474777 745387421 745119781 744968796
2285.6 744968796 744671249 744533081 744738464 744698639 744987869 744512711 744543076 744511490 744231720 744173660
2295.2 744173660 743446655 742925339 742509842 742840347 742839737 742835922 742910233 742715149 742929535 742587433 742223511
2305.8 742223511 741229172 740931473 740686340 740064926 740172501 739906235 740028000 739430847 739858856 739540863
2315.5G39540863j368790L73459l95813l57589q25196j8997O4774r78241j69831m02984
2325.1G35461655R6512n33219j37024k30255j057053j462173n21927J352234l24936
2333.8G32643814N4932M83780q6899r67713j42974N31845j532517m05960K73972J096649
2343.4G31948929l46375j093445L73993P40738K097702R00956o70929j774292j327439
2352.1G30849838o13403l37524k95487j734085K33612q72955j152268r94415r03091
2360.8G24180222O96563o92596J565704J46561p8812J383133R70001N75943o04324
2369.5G28142395O97861P22656J108704J10778m59060L61023J99890P84454N88303
2378.2G32257004N29632J79673M47006K13241l26995J92108N4321L54080J28403o409
$$ plain form
2315.5 739540863 738172073 738545532 738149719 737792130 736966934 736947937 737012711 736034470 735864639 735461655
2325.1 735461655 735558167 735024948 734887924 734657669 733600616 732138443 731616516 732968750 732643814
2333.8 732643814 732698746 733182526 733095627 732127914 731984940 732516785 730984268 730578308 730852280 731948929
2343.4 731948929 731602554 730509109 730883102 731623840 733721542 734622498 733951569 732177277 730849838
2352.1 730849838 730236435 729898911 729603424 727869339 728102951 727229996 726077728 725083313 724180222
2360.8 724180222 724876785 724184189 725749893 725896454 725817642 727200775 728170776 728746719 728142395
2369.5 728142395 728840256 729562912 730671616 730782394 730323334 730684357 730884247 731668701 732257004
2378.2 732257004 732786636 732966309 733413315 733626556 733299561 733491669 733545990 733900070 734028473 734022064
2387.8G34022064j26724j58539m9515m58297M8217k20642l39737n34439n78232q8500
2397.4G31515656L2119K99378m92401l98407j49231j74408j41754m02680l60336m82941
2407.1G29244995L35083J10397m6997J603m16336r92o76041r29642o62231k71378m57
2417.7G26688004j73722j10931M1733R7351n41001k49710k51846m35715j34048l74451
2427.3G24555664l78799n24292k02256k53448k41776j2817k6627N2796l33710l58429
2437G22276306n48706n47790o62690m53491k24380j53504M33808O5765K03934n64270
2446.6G19824982r41391k14539n41000k28729m12980l61328k61917l04184j54648n2719
2456.3G16351547L98026m47083j006164r47571k84577M1047m29306P7056J04218j92719
$$ plain form
2387.8 734022064 733895340 733736801 733687286 733228989 733277206 733056564 732716827 732182388 731604156 731515656
2397.4 731515656 731547775 731847153 731354752 730956345 730807114 730632706 730490952 730088272 729727936 729244995
2407.1 729244995 729580078 729690475 729643478 729645081 729228745 729227753 728551712 727622070 726959839 726688461 726688004
2417.7 726688004 726514282 726403351 726445084 726542435 726001434 725751724 725499878 725064163 724930115 724555664
2427.3 724555664 724176865 723652573 723450317 723196869 722955093 722942276 722915649 722968445 722634735 722276306
2437 722276306 721727600 721179810 720517120 720063629 719839249 719685745 720119553 720185318 720389252 719824982
2446.6 719824982 718883591 718669052 718128052 717899323 717486343 717125015 716863098 716558914 716404266 716351547
2456.3 716351547 716749573 716302490 715296326 714348755 714064178 714105225 713675919 713752975 713857193 713664474
2465.9G13664474l13186k93198n11169o15921m65317m74472m10614n53436k64359n72739
2475.6G09190063k02255K88544k95792j11389l13568o53534p57599n24597n93567n38330
2485.2G05487976N1727k1515j3122n06973m56620l17764p14035o12106l00064l85819
2494.8G02211685j153564o67420k8610L98026n3330q06656M2572l38440p39135n72052
2504.5F98293076l38974l51410r70917n88379j37100J49994n3025l95736o41556o94885
2514.1F94271088n47715m55398k44217m95453Q4305q2932m15649l4638m02145m18625
2523.8F91258621q17566o10962l86657p26242n47181l22647j03454p7820K20337K4643
2533.4F87911072k16751m48914n99670p21512j095963o28128l65982N493j08032J99204
$$ plain form
2465.9 713664474 713351288 713058090 712546921 711931000 711465683 710991211 710580597 710027161 709762802 709190063
2475.6 709190063 708987808 709276352 708980560 708869171 708555603 707902069 707144470 706619873 706026306 705487976
2485.2 705487976 705539703 705518188 705505066 704998093 704541473 704223709 703509674 702897568 702597504 702211685
2494.8 702211685 701058121 700390701 700362091 700760117 700706787 699900131 699942703 699604263 698865128 698293076
2504.5 698293076 697954102 697602692 696631775 696043396 695906296 696056290 696003265 695607529 694965973 694271088
2514.1 694271088 693723373 693267975 693023758 692528305 692612610 692529678 692114029 692079391 691677246 691258621
2523.8 691258621 690441055 689830093 689443436 688717194 688170013 687847366 687743912 687666092 687886429 687911072
2533.4 687911072 687694321 687245407 686645737 685924225 684828262 684200134 683834152 683839645 683731613 683930817
2543.1F83930817M00467p02515m78516n28030p20062o29654m58527l36609p16705l63693
2552.7F79396973k52838J3656o0348k58866m45785p13196l05710n89371n61905n73577
2562.4F75649033l28446J93787j40076l81317l11432J2589m02756o33545o21643o24390
2572F72411804k07596k7618j30158n15136j33362j36719l69186l52097o72607p09381
2581.6F69157944o98929k91443m85458m26178J12075J67923q9492n38330l48664o25076
2591.3F65934372o19431p32269j054764l97873O6986J28022n20554m75082J02920Q5297
2600.9F62517624l27988q47015r33762p95974m09241n12161q1254P8660o24848m94308
2610.6F57569733k23008l82308r40629o61239n15900n96313l90320n88455k84500j06125
$$ plain form
2543.1 683930817 684331284 683628769 683150253 682622223 681902161 681272507 680813980 680477371 679760666 679396973
2552.7 679396973 679144135 679157791 679097443 678838577 678392792 677679596 677373886 676784515 676222610 675649033
2562.4 675649033 675320587 675514374 675374298 674992981 674681549 674694138 674291382 673657837 673036194 672411804
2572 672411804 672204208 672176590 672046432 671531296 671397934 671261215 670892029 670539932 669867325 669157944
2581.6 669157944 668459015 668167572 667682114 667255936 667368011 667535934 667446442 666908112 666559448 665934372
2591.3 665934372 665314941 664582672 663527908 663130035 663197021 663325043 662804489 662329407 662432327 662517624
2600.9 662517624 662189636 661342621 660408859 659612885 659203644 658691483 658610229 658688889 658064041 657569733
2610.6 657569733 657346725 656964417 656023788 655362549 654846649 654250336 653860016 653271561 652987061 652880936
2620.2F52880936l2959n83878n21316k13089r19114p82241o02188k93046n22155n67780
2629.9F47843170j08108m15955l90015n63354l68805k02179n57022r12705q64791m69056
2639.5F42991180m57763p9956L8452k34680q05054q87528o06956m14352j31569q23708
2649.1F38588066o60057n29861n80712o2523k69622j68190m99344q28820m15649n112
2658.8F34568176k34642n83000o83517r89647o92635k74467K87170O9504m37393m34761
2668.4F30594788n25475j40114m97894p98607o41251k07748n9319k13050J83525l17040
2678.1F27377815m43001m08210n58625p54242p56835N760j99089l54195m77371j45455
2687.7F23286552L8872n52063m77867j016350p55119J13029J01090k74735n84907l07617
$$ plain form
2620.2 652880936 652847977 652264099 651742783 651529694 650610580 649828339 649226151 648933105 648410950 647843170
2629.9 647843170 647735062 647319107 646929092 646365738 645996933 645794754 645237732 644325027 643460236 642991180
2639.5 642991180 642533417 642453461 642491913 642257233 641452179 640564651 639957695 639543343 639411774 638588066
2649.1 638588066 637928009 637398148 636817436 636754913 636485291 636317101 635817757 634988937 634573288 634568176
2658.8 634568176 634333534 633750534 633067017 632077370 631384735 631110268 631397438 631466942 631029549 630594788
2668.4 630594788 630069313 629929199 629431305 628632698 627991447 627783699 627724380 627511330 627694855 627377815
2678.1 627377815 626934814 626526604 625967979 625213737 624456902 624462662 624263573 623909378 623432007 623286552
2687.7 623286552 623325424 622773361 622295494 621279144 620524025 620637054 620738144 620463409 619878502 619570885
2697.4F19570885J2397j26342n49240l98865l73154l28483m87366o96602l11470m65584
2707F15846176o5727r6283n19066j69411O256j38587n88761p54509p05223k05078j68152
2717.6F12441635j24435R6779l43323j42250k13166k44903j75247j98479k76794o01235
2727.3F10218582o67839o31904J96113l2387k75383J07918k98729j47438j94244l68233
2736.9F07906456n83611k90412r766k09923j25275k85987k5101l50876m23241j6174
2746.5F05586090j67999l09677k79427j3809n29556m70353k9678J98097M349r07745
2756.2F03080292p26128j35765L62167j35269n81398Q9455N1880n16892m60586k365
2765.8F01025391o60057n47181o8702m73442k95487j04484K8267k64435k73438l68728
$$ plain form
2697.4 619570885 619583282 619456940 618907700 618508835 618135681 617807198 617319832 616623230 616311760 615846176
2707 615846176 615780449 615684166 615165100 614995689 615001945 614863358 614274597 613520088 612814865 612609787 612441635
2717.6 612441635 612317200 612413979 612070656 611928406 611715240 611470337 611295090 611096611 610819817 610218582
2727.3 610218582 609550743 608918839 609114952 609082565 608807182 608915100 608616371 608468933 608274689 607906456
2736.9 607906456 607322845 607032433 607022667 606812744 606687469 606401482 606376381 606025505 605602264 605586090
2746.5 605586090 605418091 605108414 604828987 604815178 604285622 603815269 603785591 603983688 603988037 603080292
2756.2 603080292 602354164 602218399 602580566 602445297 601863899 601953354 602005234 601488342 601027756 601025391
2765.8 601025391 600365334 599818153 599749451 599276009 598980522 598876038 598904305 598639870 598366432 597997704
2775.5E97997704o01387n42450o18973j66283l00751j78794j71433o72150m47464k12402
2785.1E94085617l50304n37490r8801m52042p55653l36952n51682q87794p91283k10648
2794.8E89112968l19709k38533j79062o47316o81076p07932p17201n41687j93939p65686
2804.4E84120827p47681m74014q08563l83759l58200m96559j125984q85201o04019
2813.1E78236847j041527l03650n36041p07665n38024m67759m59900p64770o89125
2821.8E72728386j113243r43566o74171n07088q25004j266747p00912p46193o38466
2830.4E65312996o23894n99975n65224j042252j165504j083603j073952j405411j038284
2839.1E56714897r62562j236229j229363j653633j815681j862793j520119j494560
$$ plain form
2775.5 597997704 597396317 596853867 596234894 596068611 595767860 595589066 595417633 594745483 594298019 594085617
2785.1 594085617 593735313 593197823 593099022 592646980 591891327 591554375 591002693 590114899 589323616 589112968
2794.8 589112968 588793259 588554726 588375664 587728348 587047272 586339340 585622139 585080452 584886513 584120827
2804.4 584120827 583373146 582899132 582090569 581706810 581348610 580852051 579726067 578840866 578236847
2813.1 578236847 577195320 576891670 576355629 575647964 575109940 574642181 574182281 573417511 572728386
2821.8 572728386 571615143 570671577 569997406 569490318 568665314 567398567 566697655 565951462 565312996
2830.4 565312996 564689102 564089127 563523903 562481651 561316147 560232544 559158592 557753181 556714897
2839.1 556714897 555752335 554516106 553286743 551633110 549817429 547954636 546434517 544939957
2846.8E44939957j922455k313729j973571j275864j354141r23004o14968l92799l98598
2855.5E33770828m10003k80762l01285M70047K9793o99310q00057m43420r4338o24199
2865.2E30617294m26101m87519o99310q86459j127167q80509o06651l26881o11267
2873.8E24565430r07822q26263l0632k33765q89282n35088r97696j109695r15833n88913
2883.5E17530441m95224o07757j57967n53551j009063j332550j276360j169090q94280
2892.2E10034599m29115r32770q61206o51550o32820q68798j137580o84281l82309
2900.8E03454170m49714p73011k99606l95508j040420n14946m32358r08508r22318
2909.5D97717781q73108j070976j069832j211586j012382j135827j407661p94601j371727
$$ plain form
2846.8 544939957 543017502 540703773 538730202 537454338 536100197 535177193 534562225 534169426 533770828
2855.5 533770828 533360825 533080063 532778778 533248825 533278618 532579308 531779251 531335831 531241493 530617294
2865.2 530617294 530191193 529703674 529004364 528117905 526990738 526110229 525503578 525176697 524565430
2873.8 524565430 523657608 522831345 522800713 522566948 521677666 521142578 520144882 519035187 518119354 517530441
2883.5 517530441 517035217 516427460 516269493 515715942 514706879 513374329 512097969 510928879 510034599
2892.2 510034599 509605484 508672714 507811508 507159958 506527138 505658340 504520760 503836479 503454170
2900.8 503454170 503004456 502231445 501931839 501536331 500495911 499980965 499548607 498640099 497717781
2909.5 497717781 496844673 495773697 494703865 493492279 492479897 491344070 489936409 489141808 487770081
2918.2D87770081j633416j375694j203880m42734m21371k62146l77121p17774q43239
2926.9D80492706k55699Q02536L99628P5226r194l25241k0256K88468L20549J15585
2936.5D81884308P4501O81038N24101J51215J150665R91058K13585O21987Q15734N67437
2946.2D87675629N17730O75393L74183M17519L40614K68211O18363L09791L28255L62053
2955.8D91887741M68674M25644K66113N08842O83175P35626K43606O80771O61927K1057
2965.5D96583176M42886P88689J137008O82373J96419N90897J082763P78275K04544
2974.1E02487030N72014N62477L58200K27089N18112Q90083K71454m56504n55153K15377
2983.8E05090179M66614K77367L13759J39732J411N3216L20282K82173k03934n77507
$$ plain form
2918.2 487770081 486136665 484760971 483557091 483114357 482692986 482430840 482053719 481335945 480492706
2926.9 480492706 480237007 481039543 481439171 481514397 481505203 481179962 481159706 481448174 481768723 481884308
2936.5 481884308 481958809 482639847 483163948 483315163 484465828 485456886 485670471 486292458 487108192 487675629
2946.2 487675629 488193359 488868752 489242935 489660454 490001068 490269279 490887642 491197433 491525688 491887741
2955.8 491887741 492356415 492782059 493048172 493557014 494240189 494975815 495219421 495900192 496562119 496583176
2965.5 496583176 497026062 497814751 498951759 499634132 499830551 500421448 501504211 502282486 502487030
2974.1 502487030 503059044 503621521 503979721 504206810 504724922 505615005 505886459 505429955 504874802 505090179
2983.8 505090179 505556793 505834160 506147919 506287651 506289062 506342278 506662560 506944733 506740799 506163292
2993.4E06163292k12097j79367k08817j73454m28200M5357k51961m49486n99632j104469
3003.1E02601166o96717m18663o1683l91083q29506o53191m49867l94401o10733k74353
3012.7D97820969l40500o60744p38831n22003n65605q22182m59938o05125p53174o80084
3022.4D91672783k87018l59802j012650j067848q65250l61061m47197n99441j203499
3031D85469017j249504k73781o09589p26470o67458n77774q36601j080284p14531p01409
3040.7D78031616n86166j070862q12607l58238l20854m38996r96360p84951j344490
3049.4D71318092j118164l87001p81097q97484r66148p30935o49871r22280q47511
3058D64017601k71988o59752j182365q54149p29408m91295j061745o44417r5939q55408
$$ plain form
2993.4 506163292 505951195 505771828 505563011 505389557 504961357 505006714 504754753 504305267 503705635 502601166
3003.1 502601166 501904449 501485786 501424103 501033020 500203514 499550323 499100456 498706055 498095322 497820969
3012.7 497820969 497480469 496819725 496080894 495558891 494993286 494171104 493711166 493106041 492352867 491672783
3022.4 491672783 491385765 491025963 490013313 488945465 488080215 487719154 487271957 486672516 485469017
3031 485469017 484219513 483945732 483336143 482609673 481942215 481364441 480527840 479447556 478733025 478031616
3040.7 478031616 477445450 476374588 475561981 475203743 474882889 474443893 473447533 472662582 471318092
3049.4 471318092 470199928 469812927 469031830 468134346 467168198 466437263 465787392 464865112 464017601
3058 464017601 463745613 463085861 461903496 461049347 460319939 459828644 458766899 458122482 458026543 457171135
3067.7D57171135j045418q69751l39660n34325o86989r11331j025391n09720m57344
3076.4D50791206j70593n76973o10008n99289j032105r72213p48558l14637p88383
3085D44978447p37991q54531j032600n21698n80902m00582m80499l38592r57909j292038
3094.7D37781105o83594q75435m54559n76591p55463n29175n98373o08712q45870p10564
3104.3D31142769o36177o36749p39708p20101p85599q73947n02205m68559m75082o35681
3114D24668961r15604j018181o24962m90188q52814p42493n25207n17388j111564r13925
3123.6D16956635p00646j015930p36313q81004m99382m19541q90197j098710q24432
3132.3D09890480k16370o81266n56679l98750n48478l15475r24721j457748j158448
$$ plain form
3067.7 457171135 456125717 455255966 454916306 454381981 453694992 452783661 451758270 451248550 450791206
3076.4 450791206 450620613 450043640 449433632 448834343 447802238 446830025 446081467 445766830 444978447
3085 444978447 444240456 443385925 442353325 441831627 441250725 440850143 440369644 440031052 439073143 437781105
3094.7 437781105 437097511 436222076 435767517 435190926 434435463 433906288 433307915 432699203 431853333 431142769
3104.3 431142769 430506592 429869843 429130135 428410034 427624435 426750488 426248283 425779724 425304642 424668961
3114 424668961 423753357 422735176 422110214 421620026 420767212 420024719 419499512 418982124 417870560 416956635
3123.6 416956635 416255989 415240059 414503746 413622742 413123360 412703819 411813622 410714912 409890480
3132.3 409890480 409674110 408992844 408436165 408037415 407488937 407173462 406248741 404790993 403632545
3141D03632545o82487q08105n84298l46603q03795o89125m33350p83577j111030p02019
3150.6C96688156o10542q25463p43865j014405j023407n90553l58429l77998m44451
3159.3C90699043p58438j089897j210213q06350l32299p89566r97658p92655p43905
3168C83178062o27479n57785q52089j034355q64907p57255l17307n13420o61239o31943
3177.6C76360283r58672p82470j027871p81402n15137n73234q18558j078606m58336
3186.3C69365997n65109o05164q63761q50144o26945r93195j76887l87879j154938
3195C63141975j033783o05316n87883q19244k97318o45446q25692o83059l58582k65045
3204.6C57020607j065025q52013l90587r1781n28908r33380r07441q47015j00365n13725
$$ plain form
3141 403632545 402950058 402141953 401557655 401211052 400407257 399718132 399284782 398501205 397390175 396688156
3150.6 396688156 396077614 395252151 394508286 393493881 392470474 391879921 391521492 391143494 390699043
3159.3 390699043 389940605 388850708 387640495 386834145 386501846 385712280 384714622 383921967 383178062
3168 383178062 382550583 381992798 381140709 380106354 379241447 378484192 378166885 377653465 376992226 376360283
3177.6 376360283 375401611 374619141 373591270 372809868 372294731 371721497 370902939 369824333 369365997
3186.3 369365997 368800888 368195724 367331963 366481819 365854874 364861679 364684792 364296913 363141975
3195 363141975 362108192 361502876 360914993 360095749 359798431 359152985 358327293 357644234 357285652 357020607
3204.6 357020607 355955582 355103569 354712982 354621201 354092293 353158913 352251472 351404457 351304092 350790367
3214.3C50790367p43446l91960m68026n53741p06940q77800j067314m46243m08440
3222.9C45126457n14068m09012q62389p69348n83649m30259n33524l04565l17688p22733
3232.6C39679222n93910n75562k08969q47969j053200M9973m77715j054992p11136
3241.3C34205742m45557k49824m47159n28069k68097l71971m64744o32706o33964k69051
3250.9C29894600o28166m65393j02234p03163o07109k16256n44471n87616m16260o46782
3260.5C24977150k72141Q1673k43873o38161o43540l10287m98695k13280p4578o10008
3270.2C21554260n67131k82860k84042m37870k85168q29944r27296m21581k33002L47042
3279.8C17632408k08473n36480m87747m75598j39331l81565j97506n60112m44279l31688
$$ plain form
3214.3 350790367 350046921 349654961 349186935 348633194 347926254 347048454 345981140 345534897 345126457
3222.9 345126457 344612389 344203377 343340988 342571640 341987991 341557732 341024208 340719643 340401955 339679222
3232.6 339679222 339085312 338509750 338300781 337452812 336399612 336449585 335971870 334916878 334205742
3241.3 334205742 333760185 333510361 333063202 332535133 332267036 331895065 331430321 330797615 330163651 329894600
3250.9 329894600 329266434 328801041 328698807 327995644 327388535 327172279 326627808 326040192 325623932 324977150
3260.5 324977150 324705009 324786682 324542809 323904648 323261108 322950821 322452126 322238846 322164268 321554260
3270.2 321554260 320987129 320704269 320420227 319982357 319697189 318867245 317939949 317518368 317285366 317632408
3279.8 317632408 317423935 316887455 316399708 315924110 315784779 315403214 315205708 314645596 314201317 313869629
3289.5C13869629p87754K10914j09806p77702j29681j80206m04243m09413k41012j41888
3299.1C10898838n65319m92439M4117k43092m45499k61116n89409p54643m64039j47056
3308.8C06980343q1425m51164o66409n13191p32841n00508l7098j98555k62107m37050
3318.4C03099995l47500o09284r15928j37882O3401m47751p38830o88572p58038o86741
3328.1B97832870m12063m09412l13645m94404l12290l17116j072845p96890k62509
3336.7B93441696p17869n38578k1400o11401o58493o72664q85964m76341o98147n59292
3346.4B87601547l41663k78340j06658m94347m05712j6861j96324n76953K3212L40366
3356B85548267l08628n31158l97244j297l45077o15692j02635j18732k47860k5883
$$ plain form
3289.5 313869629 313081875 313292789 313182983 312405281 312275600 312095394 311691151 311281738 311040726 310898838
3299.1 310898838 310333519 309841080 309885197 309642105 309196606 308935490 308346081 307591438 307127399 306980343
3308.8 306980343 306898918 306447754 305781345 305268154 304535313 304034805 303997707 303799152 303537045 303099995
3318.4 303099995 302752495 302143211 301227283 301089401 301152802 300705051 299966221 299277649 298519611 297832870
3328.1 297832870 297420807 297011395 296697750 296203346 295891056 295573940 294501095 293704205 293441696
3336.7 293441696 292723827 292185249 292163849 291552448 290893955 290221291 289335327 288858986 288160839 287601547
3346.4 287601547 287259884 286981544 286874886 286380539 285974827 285957966 285761642 285184689 285207901 285548267
3356 285548267 285239639 284708481 284311237 284309940 283964863 283349171 283246536 283127804 282879944 282854061
3365.7B82854061j00212o35376l28159M6482k50721j79196j63135l48225k54364n0964
3375.3B80590191m20132m47864k1725k35519k69127k47650l08457j2188M2343n8384
3384.9B78611488J37387J07212m03214l81355K84138L1070m61387k2793q3942p3720
3394.6B77744884K13891m8924j54915o5422J13144p572j28021l47462m15096j99490
3404.2B76705017j5240N84927K39906K4529r5959m40845K24094K27337M7226j21517
3413.9B77379475J71623M76875n9910n8479l357L8567k69623J32580N08423o2256K12269
3424.5B78466187N48629M61674J47724M30355J76869k00653K61001J35575K48050M9114
3434.1B80724525N57785Q54950m310j62068j10607N23720Q48961O80447k72198k56195
$$ plain form
3365.7 282854061 282753849 282118473 281790314 281836796 281586075 281406879 281243744 280895519 280641155 280590191
3375.3 280590191 280170059 279722195 279700470 279464951 279195824 278948174 278639717 278627529 278669872 278611488
3384.9 278611488 278748875 278856087 278452873 278071518 278355656 278386726 277925339 277902546 277818604 277744884
3394.6 277744884 277958775 277909851 277754936 277689514 277802658 277795086 277667065 277319603 276904507 276705017
3404.2 276705017 276689777 277274704 277514610 277539139 277443180 277002335 277226429 277453766 277500992 277379475
3413.9 277379475 277551098 278027973 277968063 277909584 277906227 277944794 277675171 277807751 278316174 278253918 278466187
3424.5 278466187 279014816 279476490 279624214 280054569 280231438 280030785 280291786 280427361 280675411 280724525
3434.1 280724525 281282310 282137260 282132950 281970882 281860275 282383995 283232956 283913403 283641205 283385010
3443.8B83385010R51442P17144N64156k07748j53294M85840M21047R51748O89240K38780
3453.4B88043365J15738J82114K27127P46174J035194K58103J01681K58617P07512
3462.1B91675625N04932Q15621J164055K64968M80462M67834K91805L24860N74303
3470.8B96564465O74762M49925J142883Q04348K52476K11525L44772M84123O12984
3479.5C01542263J363888J084099J88350k50339O42929P26147K03895J206207J012421
3488.1C07719860P88002J016388P65228Q10623O88744N42870N12447Q15048P74784
3496.8C14433994M82502L76950O41880P34577J009254J402989K17132K79980R99241
3505.5C20578499R63631R22012P18727O69212P71599J252480O24771P59163J342735
$$ plain form
3443.8 283385010 284336452 285053596 285617752 285410004 285256710 285742550 286163597 287115345 287804585 288043365
3453.4 288043365 288159103 288341217 288568344 289314518 290349712 290607815 290709496 290968113 291675625
3462.1 291675625 292180557 292996178 294160233 294425201 294905663 295373497 295665302 295990162 296564465
3470.8 296564465 297239227 297689152 298832035 299636383 299888859 300100384 300445156 300929279 301542263
3479.5 301542263 302906151 303990250 304178600 303928261 304571190 305297337 305501232 306707439 307719860
3488.1 307719860 308507862 309524250 310289478 311100101 311788845 312331715 312844162 313659210 314433994
3496.8 314433994 314916496 315293446 315935326 316669903 317679157 319082146 319299278 319579258 320578499
3505.5 320578499 321542130 322464142 323182869 323852081 324623680 325876160 326500931 327260094 328602829
3514.2C28602829K38152R6931Q72192J406670J073074N98641Q88481J106491P08275
3522.9C35591736P92999J455650J032601O51703K58598O30341R71336J153526J381455
3531.5C43919945P93037J511574J356468J073303N52521q7814J515846J362114R51118
3540.2C52948112Q97408J123619J380348J480294J262855M2267J313095R56535J144562
3548.9C62549095J757088J378708J394195J72654J913681J598167J166458J898651
3556.6C73828697J156807J906128J314735P45698N06019J920586J577644N16472L340759
3565.3C86813545R68437K93236O16646O84967L440170J888123J684341J489258J118965
3574C98997688J105194J692620K271080J161422K054100J286622J495170J946259J690521
$$ plain form
3514.2 328602829 328840981 328937912 329810104 331216774 332289848 332888489 333776970 334883461 335591736
3522.9 335591736 336384735 337840385 338872986 339524689 339783287 340413628 341384964 342538490 343919945
3531.5 343919945 344712982 346224556 347581024 348654327 349206848 349119034 350634880 351996994 352948112
3540.2 352948112 353845520 354969139 356349487 357829781 359092636 359134903 360447998 361404533 362549095
3548.9 362549095 364306183 365684891 367079086 367251740 369165421 370763588 371930046 373828697
3556.6 373828697 374985504 376891632 378206367 378952065 379458084 381378670 382956314 383472786 386813545
3565.3 386813545 387781982 388075218 388691864 389376831 392817001 394705124 396389465 397878723 398997688
3574 398997688 400102882 401795502 404066582 405228004 407282104 408568726 410063896 412010155 413700676
3582.6D13700676J903343Q20275K922973J185723j06850K790108L71017K564850L047294
3591.3D29199409K726899J408004J060791L158570L69644J970596K924729R75570K235566
3600D46029778J825523K074699K211838J891060K471390K900161K357407N36118L592071
3608.7D65890045O0425j68953O296959J590309m21715L459473P13158M253921L641586
3617.4D85315208P89032K089806O17104K542572L885192K995911J917648K692872K807731
3626E05653076K941971O306992N45272o911506N039482N710411M952850J552429l31153
3634.7E25459824L284759M309845K950020J253738K053070L164215L144150J653481
3642.4E47273102J337356K972031M038582N325889N1156j270409M155311L25509J429519
$$ plain form
3582.6 413700676 415604019 416424294 419347267 420532990 420426140 423216248 423587265 426152115 429199409
3591.3 429199409 431926308 433334312 434395103 437553673 437923317 439893913 442818642 443794212 446029778
3600 446029778 447855301 449930000 452141838 454032898 456504288 459404449 461761856 462297974 465890045
3608.7 465890045 465950470 465781517 472078476 473668785 473247070 476706543 477419701 481673622 485315208
3617.4 485315208 486104240 488194046 488811150 491353722 495238914 498234825 500152473 502845345 505653076
3626 505653076 508595047 514902039 515447311 508535805 513575287 519285698 524238548 525790977 525459824
3634.7 525459824 528744583 533054428 536004448 537258186 539311256 542475471 545619621 547273102
3642.4 547273102 548610458 551582489 555621071 560946960 560998116 559727707 563883018 564208527 565638046
3651.1E65638046J987267M831085M410820M376183M479141n337486K624511M783058
3658.8E87792625K009774K702064J217957L051452K210617J665841J704597J034012
3666.5F03388939M503021J637955o43120J259384m305801M124641Q167572P391510
3674.3F25524101j003647j3024406L686295P491912L751984j939354J418381L304405
3682F29209671J738014J684761J300812L25584K942620M887008p823677j063194P551041
3690.6F40752640m239655J116295M718666N95780K054138O94275k82517J237335N27420
3699.3F47174377K121582K448426l810578q17031M747467J218261l76205O51398K439651
3708F55797348K887421o130524K787399K011338r865418N821152M503479N27267J182938
$$ plain form
3651.1 565638046 567625313 572456398 576867218 581243401 585722542 580385056 583009567 587792625
3658.8 587792625 589802399 592504463 593722420 596773872 598984489 600650330 602354927 603388939
3666.5 603388939 607891960 609529915 608886795 610146179 605840378 609965019 618132591 625524101
3674.3 625524101 624520454 611496048 615182343 622674255 626426239 624486885 625905266 629209671
3682 629209671 630947685 632632446 633933258 634258842 637201462 642088470 634264793 633201599 640752640
3690.6 640752640 636512985 637629280 642347946 642943726 644997864 645692139 645409622 646646957 647174377
3699.3 647174377 649295959 651744385 647933807 647116776 651864243 653082504 652706299 653357697 655797348
3708 655797348 658684769 652554245 655341644 657352982 647487564 653308716 657812195 658339462 659522400
3716.7F59522400K194672O98547l094330J682510N151597l374482l647308M484787
3724.4F63618393J169357o56204j744614N41840K702408Q75244M790420l790512o673431
3733.1F60832901P756119j03760p286987K541885L059387J85471K389526K512436k745743
3741.8F69141235L574372R268493j3293914j2848587J1062850N893250M305954l304672
3749.5F73798981o466828R424591p286605n170289P017518M585876K378540m625931
3757.2F73655853K208786L945694o667785m81034M166031J127625n11475K288971k922745
3765.9F76809921l002777L920517L956299k63367o686630K128754K901306O94809N75790
3774.5F81034622o73370J088486L31573K358933k55280o383057K277451J585617N49393
$$ plain form
3716.7 659522400 661717072 662415619 659321289 661003799 666155396 662780914 659133606 663618393
3724.4 663618393 664787750 664131546 662386932 662928772 665631180 666506424 671296844 667506332 660832901
3733.1 660832901 668589020 668485260 661198273 663740158 666799545 666985016 669374542 671886978 669141235
3741.8 669141235 672715607 681984100 668690186 655841599 666904449 672797699 677103653 673798981
3749.5 673798981 667332153 676756744 669470139 664299850 671317368 675903244 678281784 673655853
3757.2 673655853 675864639 679810333 673142548 672661514 676827545 677955170 677443695 679732666 676809921
3765.9 676809921 673807144 677727661 681683960 681420593 674733963 676862717 679764023 680458832 681034622
3774.5 681034622 680361252 681449738 681781311 684140244 683884964 677501907 679779358 681364975 681914368
3783.2F81914368J448364j503754k08130P32575L44543J19095n8060j58386n6534J270523
3792.9F83844604K42844O41861K036743l382034k562409L086243M037018L936920p228546
3801.5F84653244r194260L288422L283234M579315L661957q700257j752319N029373
3809.3F84848709J327286R7504Q21151k90374J200332M322434m727631j1154022O003036
3817.9F82448425N214081L538971K64664j3623276K982101N282364J673661J363906
3825.7F89144897j279449l230667J240921J850204K123413J35422o494522L417206
3833.4F86907425N512466n233612R68552N650330j0009766k604294O658325l800735
3841.1F84048691P86209N281067k414246j812820K559891P51495O03332J197815k180633
$$ plain form
3783.2 681914368 683362732 681858978 681650848 682383423 682727966 682847061 682789001 682630615 682574081 683844604
3792.9 683844604 684087448 684729309 686766052 683384018 680821609 683907852 687944870 691881790 684653244
3801.5 684653244 675458984 678747406 682030640 686609955 690271912 681571655 679819336 684848709
3809.3 684848709 686175995 686273499 687094650 686804276 688004608 692327042 687599411 676445389 682448425
3817.9 682448425 687662506 691201477 691466141 677842865 680824966 686107330 687780991 689144897
3825.7 689144897 687865448 684634781 685875702 687725906 689849319 689984741 683490219 686907425
3833.4 686907425 692419891 687186279 688154831 693805161 683795395 681191101 687849426 684048691
3841.1 684048691 684834900 690115967 687701721 685888901 688448792 689200287 689803619 691001434 688820801
3849.8F88820801J135711L240204n769195J279526j1513901L673935Q840408j756592
3857.5F87950897j145248K223511J501083P56149m471206J467666N085831n894394
3865.2F87474289l205032M318237M123382L412095r070054o272125N123291N536118
3872.9F91440201J494598q650894J826096L619232k43225K296600L135223n935134
3880.6F88982697n229111N435562J459732J588135K684402j0609741K218475L272934
3888.3F89803085K58561K827606k116928n618821K486649K426071j405105J373825
3896.1F90034943P41500J488953R94110p030945M561539R12705m237748L924332k670441
3904.7F88718948k049789Q3923J005936J835785L69339K00271m05807J90048N9204
$$ plain form
3849.8 688820801 689956512 693196716 687427521 688707047 677193146 680867081 689707489 687950897
3857.5 687950897 686805649 689029160 690530243 691286392 686815186 688282852 693368683 687474289
3865.2 687474289 684269257 688587494 692710876 696122971 687052917 680780792 685904083 691440201
3872.9 691440201 692934799 684283905 686110001 689729233 689486008 691782608 694917831 688982697
3880.6 688982697 683753586 689189148 690648880 692237015 694921417 684311676 686530151 689803085
3888.3 689803085 690061646 692889252 690772324 685153503 687640152 690066223 688661118 690034943
3896.1 690034943 690776443 692265396 693259506 686228561 690790100 691702805 687465057 691389389 688718948
3904.7 688718948 686669159 686753082 687759018 689594803 689964142 690164413 689758606 689948654 690007858
3913.4F90007858l9673O35605R72901k212601k215042K901001q01468j992111K381515
3922.1F89637985J103058Q17795k160492k854462J783753J366424N59769p33109n86242
3930.8F88934479J186294j936035l5095K082062l16849k02408o08978q09250L66135
3939.5F88660355K43988R56192N34668k114182j75400J039582M99954J61133j999665
3948.1F87806625M55552O38198j217346J502533K17590m24499M76074K99683n11780
3956.8F89242630j851425L80783N63736K87323N63736j120835k00958O23627L10135
3965.5F88798752L13186J91117k71530n65262k88162J89972j77231o69632K77176L88870
3975.1F88187256k9526L0213M27474K68784j24969o6681l37906N6228m71420j15433
$$ plain form
3913.4 690007858 689968185 690603790 691576691 689364090 687149048 690050049 689248581 687256470 689637985
3922.1 689637985 690741043 691558838 689398346 686543884 688327637 689694061 690253830 689520721 688934479
3930.8 688934479 690120773 688184738 688149643 690231705 689914856 689712448 689103470 688294220 688660355
3939.5 688660355 688904343 689860535 690395203 688281021 688105621 689145203 689645157 689806290 687806625
3948.1 687806625 688262177 688900375 687683029 689185562 689403152 688978653 689454727 689754410 689242630
3956.8 689242630 687391205 687771988 688335724 688623047 689186783 688065948 687864990 688488617 688798752
3965.5 688798752 689111938 689303055 689031525 688466263 688178101 688368073 688190842 687521210 687798386 688187256
3975.1 688187256 688157730 688187943 688615417 688884201 688759232 688692551 688354645 688410873 687939453 687824020
3984.8F87824020L18146k36893M75769j01776K87857P72477k80304o21186k24838K45667
3994.4F88458939m04282J09100K40631M1199O08444L63465
4000.2F89417496
$$ plain form
3984.8 687824020 688142166 687905273 688381042 688279266 688567123 689339600 689059296 688438110 688213272 688458939
3994.4 688458939 688054657 688163757 688404388 688445587 689054031 689417496
4000.2 689417496
##END=$$ End of the data block
