##TITLE=$$ Begin of the data block
##JCAMP-DX=5.00 $$ ACD/SpecManager v 10.08
##SPECTROMETER/DATA SYSTEM=Varian
##DATE=15 Jan 2013 09:44:04
##DATA TYPE=INFRARED SPECTRUM
##DATA CLASS=XYDATA
##ORIGIN=
##OWNER=
##NPOINTS=3735
##FIRSTX=399.26403809
##LASTX=4000.35498047
##MAXX=4000.35498047
##MINX=399.26403809
##MAXY=76.99153137
##MINY=26.98675728
##XFACTOR=1.0000000000
##YFACTOR=0.000000100000000
##FIRSTY=49.27259064
##DELTAX=0.96440572
##XUNITS=1/CM
##YUNITS=TRANSMITTANCE
##XYDATA=(X++(Y..Y))
399.3 492725906 483550835 483148537 494748268 493187332 485364914 494145813 496658974 483515625
407 483515625 484787140 494877434 494932098 489580727 489394798 491741219 490966454 496877975 504596138
415.7 504596138 507165985 504453278 486826019 474285622 479827843 486084366 485643997 481283417
423.4 481283417 480857430 486119537 491460342 489086494 488755341 486555710 484833069 485547638 482619858
432.1 482619858 481640663 478081474 477336731 485356026 490911713 488113480 484473724 483050766 482622299
440.7 482622299 484501266 483590088 483307228 485179939 485016785 486607704 486977081 486191559 486310577
449.4 486310577 487835121 490044060 488665504 483626747 478502083 475038910 474362450 475598640 477089500
458.1 477089500 481699028 484063721 484135246 484362488 480425644 476760368 477104530 480059929 482019196
466.8 482019196 482281265 483540573 482212563 481762390 481811523 477852898 476502495 475693398 471827812
475.5 471827812 469095192 473096542 474768181 469779358 469388504 471457481 472462921 474959755 472730255
484.1 472730255 469158478 469807129 471474953 473856201 473433495 468146820 464829979 464427147 463439293
492.8 463439293 463616066 462841644 462452316 465566673 467200050 468407097 468968773 467999153 467108955
501.5 467108955 465048447 464895668 464392509 462016449 461159668 464193535 466119576 464541817 464285736
510.2 464285736 465546265 465591469 464255638 464372940 463237991 459696007 457952499 456874657 458149147
518.9 458149147 458573341 456617699 457117081 457831192 457352448 456368980 456696167 456391602 455062828
527.5 455062828 456619682 458774452 457652092 455252647 455308952 456238708 456273499 454924927 453699760
536.2 453699760 453516083 451918564 451415329 451911201 451840858 451364059 449825249 448929024 448809013 449131889
545.9 449131889 449025421 449319992 450979538 451003761 449086456 447384605 446787224 447672691 447519531
554.5 447519531 445217400 444948540 445726318 444253426 442914429 442810135 442557564 442535095 443518867
563.2 443518867 444521065 444707947 443468933 442884789 443259315 442774620 443745842 444240494 442985954
571.9 442985954 443229523 444730186 445087700 444221802 443328171 442773933 442778816 443171921 443605995 443097992
581.5 443097992 442942276 444006157 444728661 444629059 443309059 443240013 444333191 444572983 444217072 444178925
591.2 444178925 445271072 444328270 442789955 442883568 444357147 446073341 446690445 446940384 445455246
599.9 445455246 444658966 445822258 446636429 445953331 443843079 443564568 443600960 442679977 442040787 441975060
609.5 441975060 442139130 441388893 440403519 438735619 438151817 438867073 439059792 439134140 439344330 439755630
619.2 439755630 439618225 439892235 440116692 440019455 439805832 439942360 442164040 443357697 443354340 444928513
628.8 444928513 447032776 447740250 447785072 448615341 450455437 452429237 453269081 454253006 455357475
637.5 455357475 455539627 456167526 457776299 459356461 460567932 461646385 462563896 463018036 463241920
646.2 463241920 464813347 465742073 465437546 466312523 467167358 468131294 468275642 468220100 469739342 471016884
655.8 471016884 471972275 471508179 470614853 470663147 469816246 469447823 469234161 468870049 469858742 471158600
665.4 471158600 471935349 470071144 461529350 464488258 468655472 471376648 471486511 470930824 471754951
674.1 471754951 473307152 474764137 475579872 476477547 476942215 477254829 478242035 479779663 482262840
682.8 482262840 483935127 484136848 483872604 484917450 486227303 486077538 487402573 489155083 489605217
691.5 489605217 489527206 490158081 491143341 490515137 491393661 493341217 493806877 493920784 493989449 494811058
701.1 494811058 495105324 495253487 496556549 497360725 497986031 498552704 499137306 500264702 501113319
709.8 501113319 501696625 502019501 502029953 502558975 504231567 506315460 507164268 506333656 505606270 506384087
719.5 506384087 506958656 507018661 507450218 508217735 510374336 512123146 512978668 514289665 514515343
728.1 514515343 514471741 515733948 516537247 516729546 518908348 519985428 519118996 520162010 521506271
736.8 521506271 522589531 522361832 521909676 522299690 522027855 523740082 524492340 524530029 526968842
745.5 526968842 528192787 528001671 527961884 528619118 529576759 530888672 531888237 531996651 533050537
754.2 533050537 534597702 536210747 537526817 538112144 538808632 539555283 539912491 540165405 541248436
762.8 541248436 542702599 543094215 543206635 544106369 545003815 545684700 545702934 545845947 546290665 545594406
772.5 545594406 545398598 546138458 546607742 546460266 546598930 547231636 547475204 547598877 547561874 547799606
782.1 547799606 547962456 548838959 549878006 550018768 550896225 551431084 552090263 553383179 554316177
790.8 554316177 554256935 553371620 552972641 552601395 552656784 553200912 554466171 555055962 554292183 554349518
800.5 554349518 553974533 552037125 549817696 548663139 547641754 546757469 545722237 544369926 543270874
809.1 543270874 541599388 541115036 540657654 539371262 538172073 536998558 535988388 534274254 533404236
817.8 533404236 533172798 533600616 535090179 536297073 536392670 536463585 539011230 541656189 544148407
826.5 544148407 546872787 549380112 552493858 554523697 557038193 560174446 563620567 566517754
834.2 566517754 568832664 571094894 571465950 572402916 574285088 576652069 577944527 579384232 582614937
842.9 582614937 584493637 586125946 587663345 588819427 589157715 589989891 591091690 591194038 591846123
851.6 591846123 592237358 594382896 597045326 599105492 600609932 601224823 602699394 603705521 604651299
860.3 604651299 605006714 605278893 605748634 606938248 608792877 610126991 611084290 609482689 608191872
868.9 608191872 606965561 605502815 604224319 601986656 601173859 599862442 598759842 598177834 597587280
877.6 597587280 596434174 594654045 593998146 593022766 592633820 591148758 589449463 589100609 588905640
886.3 588905640 589357719 589062080 588942947 588555527 588368607 588116112 587469864 587579842 586831055 587279015
895.9 587279015 589314919 591051140 591678886 591561813 590364799 588587799 588245773 587892609 588471642
904.6 588471642 590136986 592389336 595463066 598534203 601288147 602992210 604506493 604604111 604401474
913.3 604401474 604154930 602655602 601358604 599726944 598422203 597654648 596350098 593970528 591633263
922 591633263 588989944 585338287 581802330 578371887 575038605 571017189 567463188 564851837 562667961
930.7 562667961 560876770 558739281 556532402 553987236 552042656 550888481 549464111 547655525
938.4 547655525 546980667 547002144 545209045 543809395 543564301 543526192 542928848 541957016 542024384 541426849
948 541426849 541565857 542780228 543644333 544683990 545286484 545416832 544832001 544077682 542400742 540156898
957.7 540156898 538315811 536496353 535160904 533195267 530837212 529018593 528111839 527227287 525404587
966.3 525404587 523952866 522182655 519893799 518024864 516515274 514787788 512159348 509538651
974.1 509538651 506953049 504269676 501801834 497968407 493472900 489959030 485869560 480650673
981.8 480650673 475565681 471064720 466782608 462492447 458235130 454177399 449712753 445508003
989.5 445508003 441597023 437091026 433427467 429768562 426157990 423066978 420430717 418128853
997.2 418128853 415029984 412198105 409367981 407162857 404422417 400818481 398199158 395581284
1004.9 395581284 393543015 391559525 389469452 387358055 385600319 383833122 382098618 380615501
1012.6 380615501 377727280 375947495 374233551 371746445 369614296 367496071 365598907 363325653
1020.3 363325653 361385612 358246536 355693779 353777618 351630440 350575981 349726448 349134445 347574501
1029 347574501 347059479 345796623 344222946 343505516 341690216 342131882 343198204 344439240 345801544
1037.7 345801544 347935448 350334435 351894112 353727913 354239578 356005402 357092896 356918869 356875992
1046.4 356875992 356593857 356731949 354947014 353310738 351467133 350011292 349647751 348204727 346138763
1055.1 346138763 343785973 342421227 341636620 342063408 342371750 343077507 344391251 346111069 349412346
1063.7 349412346 352008476 354362679 355501480 356697922 357214737 357640953 359791565 360512352 361223221
1072.4 361223221 361408005 361841202 362029762 362104645 362778282 362114563 362281227 362406998 363514977 364607468
1082.1 364607468 365060577 365619202 366062851 368263359 369614754 370915718 372188911 372903137 373794746
1090.7 373794746 375122833 377044334 378063850 379604759 381094627 382806053 384453392 385894356
1098.5 385894356 387162361 387803497 389205894 390160217 391931992 393574181 395190430 397505951 398928070
1107.1 398928070 400607643 401467094 401830940 401912346 402225876 403326073 404354019 405207825 405844154
1115.8 405844154 406851540 407246590 408010406 408186874 407638969 407862358 407366638 406997871 407288551
1124.5 407288551 408167458 408487129 409363708 411096611 412693977 415270844 417595406 419919319 421268883
1133.2 421268883 423201599 426512718 428901672 431530380 434156189 436868210 439553070 441880493
1140.9 441880493 443752174 445218239 446980095 448258934 449089890 449516563 449482651 449816284 450687065
1149.6 450687065 451291008 451402054 451373825 451002693 450759811 450526276 450281677 449990616 448783607 447011299
1159.2 447011299 445595322 445043716 444871597 445208397 446094322 447313881 448900566 450838547 453486176
1167.9 453486176 456036263 458463440 460834503 463296509 466443634 469884491 473000946 475942421
1175.6 475942421 478599968 481224022 484170151 486884766 489244347 490574608 491955376 493855476
1183.3 493855476 496143570 498516312 499618797 500392532 500928230 501555214 502178307 502362328 502228928
1192 502228928 501782570 501873703 501677628 500961037 500207405 499224968 497986183 497252960 496748047 495642509
1201.6 495642509 494953079 493787308 491902428 490705948 490255165 490416145 490191383 489615479 489356346
1210.3 489356346 489174271 488966522 488435402 487889366 487730675 487749939 487645187 487137718 486336212 485709229
1220 485709229 485389099 485274277 484917221 484140434 483404922 482833328 482293663 481555214 481085396 480544472
1229.6 480544472 479348869 478814507 478412514 477176857 476314735 476078682 476002884 475952568 475772934 475404663
1239.3 475404663 474949226 474469490 474240494 474292793 474244919 473938675 472999611 472271385 472037125 471469879
1248.9 471469879 471117401 470992088 471081619 471252251 470772438 470018616 469874878 470247879 470405197 470545158
1258.5 470545158 470532417 470415421 470512276 470690689 470854149 470848961 471105995 471471138 471985970 472637062
1268.2 472637062 473409615 474406624 475240440 476053162 476717453 477723732 478525925 478996506 479935493
1276.9 479935493 480961456 482025261 482722321 483315659 484338493 485614052 486811447 488026886 489379005
1285.5 489379005 490430222 491168938 492080574 493421402 494263153 494830971 495477791 496095810 496787910
1294.2 496787910 497375717 497850227 498139000 498637733 498756332 499018898 499285622 499143524 499385986 499208946
1303.9 499208946 498988037 498756676 498614426 498193359 497511444 497216454 496318741 495555573 494807129 494305916
1313.5 494305916 493968468 493183823 493093071 493198128 493419380 493733025 494411697 495479660 496134644 496924934
1323.2 496924934 498040848 498965302 499324608 499910049 500429459 500672493 500596619 500208321 499940834 499109268
1332.8 499109268 498473701 498328400 498270798 498109665 498456306 499068985 498906517 499563713 500021210 500889587
1342.4 500889587 502292671 503008728 503768005 504273796 505052299 505792618 506559715 506879616 506685028
1351.1 506685028 506522560 505989571 505694313 505014000 504581184 504426956 504281883 504119263 503815918 503494568
1360.8 503494568 502862473 502724457 501996613 502123299 502044983 501379433 501440735 500367355 499730568 499732208
1370.4 499732208 499496422 499055023 498568649 498484001 497730827 498028069 498317337 498334503 498227577 498063278
1380.1 498063278 497952957 496942291 495659370 493928833 492584839 491430397 489810257 487716980
1387.8 487716980 486715012 486431236 484889946 482946701 481200790 479790611 477178497 473962631
1395.5 473962631 472709389 470548592 468390846 465511971 463199348 462154121 460554199 459227333
1403.2 459227333 457346306 454159241 452057343 450766144 448760414 446500778 444860992 443061562
1410.9 443061562 441546593 440171127 439074516 438355484 437434349 436685791 435356789 434597702 432068253
1419.6 432068253 431916618 433607368 434015427 434561501 434386864 435354309 436292267 436417961 437805176
1428.3 437805176 438494492 439105568 439975853 441767502 443148537 444273605 446684990 448710709 450569916
1437 450569916 452256470 455578384 457499237 458869171 460885277 461926384 463854599 465303383 467321968
1445.6 467321968 469158859 471078949 472585793 473882065 476334457 477440681 479424820 480757027
1453.3 480757027 482081947 483722534 484152832 485619469 486424904 490732918 493112564 495672035 497739754
1462 497739754 499236183 501445122 501385880 503980141 506348267 508819199 511276398 513591805 516687775
1470.7 516687775 518076515 520456238 523326225 526106110 528472900 529827728 532646599 535624580
1478.4 535624580 538062286 539934006 542087364 544158440 546185989 547647858 548584671 550060654
1486.1 550060654 551020813 551846619 553294182 552706299 552333755 554526405 555892944 555773735 555717506
1494.8 555717506 555131226 550361557 550449295 549349937 546813698 547076874 546411362 545792389 545199966
1503.5 545199966 545001755 543441582 536647644 533330765 535629539 537780304 537205391 537856674 537010841
1512.2 537010841 535473099 535810928 535124855 534099731 530677414 528648453 530301094 531295471 528832626
1520.8 528832626 525344696 527062836 529190979 530391083 528618317 529277000 530517960 530283241 530757370
1529.5 530757370 531435394 532031326 532222214 531191559 529371719 531804504 533145638 533616257 535461426
1538.2 535461426 533941765 530016632 530679016 531388855 530721550 531980972 532934456 532579956 534513245
1546.9 534513245 534927216 535408745 534496346 533222885 534347076 534811516 535652809 532070694 531954117
1555.6 531954117 533953934 535282249 530469704 518170357 523941040 525865784 527294350 526102867
1563.3 526102867 524640350 521444550 518633957 517843781 515512428 514117088 506452751 505094528
1571 505094528 503420868 499957809 497591362 494663391 492508812 479784966 479319267 477368622 473782349
1579.7 473782349 470248032 464866486 461342049 455726852 452275085 447373009 443030243 438728256
1587.4 438728256 433722267 430551682 424526329 421208496 415929489 412806625 409016151 404104996
1595.1 404104996 401529884 396533661 394189377 389725685 387461700 383607674 380239601 378548622
1602.8 378548622 374285965 372872581 369293327 368216515 364991417 363560371 362390709 359230766
1610.5 359230766 359275894 356368752 356536827 354405327 354254875 354186058 349163933 351469612 350371056
1619.2 350371056 351570053 349787140 350401535 350069427 347904396 350002174 349656830 351856880 350201530
1627.9 350201530 351332817 352077217 352416763 353498459 353415337 356221809 356900063 358814583 356872444
1636.6 356872444 359461899 361533127 362807121 365452995 365791130 368688812 369184837 371485329 373803482
1645.3 373803482 373603821 376952896 376104851 379670067 381030502 384449387 387990456 390159721 387650032
1653.9 387650032 386754189 391234970 392807503 394955978 396050072 398144112 400417633 402059975
1661.6 402059975 404940987 405323563 409287758 411825256 414947014 418218346 420916824 424096107
1669.4 424096107 425711288 430373955 432908707 437517929 441145821 443470650 447377434 450941048
1677.1 450941048 455713005 458918037 462889099 465539856 469760208 474206657 474740906 478641891
1684.8 478641891 482353439 489116783 493669739 497750092 502212601 506063576 510979919 515326042
1692.5 515326042 520032768 524720802 530023117 530163002 534097672 540103302 545288162 548200760
1700.2 548200760 548016777 555343323 560563126 564418259 567238235 569962044 572278824 575445786
1707.9 575445786 579706573 582275200 584762802 587526855 590379868 593357773 593215904 593584747 597469177
1716.6 597469177 599644814 595329857 598878784 602451744 604009094 605444794 606508026 607763252
1724.3 607763252 609492569 611090584 612125511 613321991 615221786 615404930 616644516 620176926
1732 620176926 623148727 621480713 618274651 623361206 627165833 628980789 632006760 633024979 632120514
1740.7 632120514 635766563 638684235 640067215 642763672 646389084 649167404 651742783 654570236
1748.4 654570236 656761627 661687164 664104385 665291595 669850311 673018036 676141205 679061737
1756.2 679061737 680086288 682759094 685799484 688202972 691333237 691586685 691817398 694883041 696814651
1764.8 696814651 698410568 700424881 702248459 701388016 703676529 707129059 706244812 703996048 704215088
1773.5 704215088 708946838 711331787 711056671 713246613 714286118 715841446 716462097 716310349 717566376
1782.2 717566376 718914337 720171738 719688263 720177917 721856918 722935257 723764343 725709457 726587143
1790.9 726587143 726319351 724844360 724876404 728195496 729042511 729359055 730760574 732245636 733009415
1799.5 733009415 732140732 733674240 733628387 734550323 736252060 736957474 738105392 738227158 738534317
1808.2 738534317 739230347 740056992 739563065 740450897 741938629 742457352 743353043 743333664 744273148 744235916
1817.9 744235916 744805756 746172028 746225586 746986694 746722031 747930984 748950653 747087173 747929764
1826.5 747929764 749879303 751260757 750463257 747708740 748978958 751456375 751976700 752457504 752820358
1835.2 752820358 753053589 753630905 753298111 754261856 754639969 755140915 755572815 756733246 757359314
1843.9 757359314 752959824 755437012 757404251 757069778 757031250 757542267 758629227 758684464 758900299
1852.6 758900299 758583069 759141159 759703522 759786072 760447540 760402832 760622787 760502930 760879745 760840302
1862.2 760840302 761053238 761628952 761975021 762669754 761768570 761776733 760825119 760358658 761997604 762970810
1871.9 762970810 763454437 763238831 763776398 763951187 764196243 764106903 764167099 764860458 764729996 765103912
1881.5 765103912 765103455 765677338 765531769 765187225 765523148 765365753 766465530 765861893 764502335 765376740
1891.2 765376740 766546707 766886826 766972885 767025604 766042480 766447144 766939621 767465363 767581406 767171021
1900.8 767171021 767325668 767309647 767778778 767459259 767728348 768057938 767673264 767644119 767426529 767593994
1910.4 767593994 768010406 768866653 768391266 768273087 768534927 768510666 769335251 767855988 767731781 768653412
1920.1 768653412 769110413 769381561 768301773 767994843 768621597 769207916 768768845 768899765 769286194
1928.8 769286194 769474030 769613571 769326096 769562836 768933945 768645782 768588791 769028320 769281006 768682785
1938.4 768682785 769210587 769282837 769915314 769404297 767769470 768536987 769092865 768824921 768324814 768587265
1948.1 768587265 768626785 768683929 768814545 768875580 768867111 768447189 768551102 768382568 768654175 768092804
1957.7 768092804 767509155 768021393 768122787 768476562 768044281 767945175 767937393 767874680 767904510 767147980
1967.3 767147980 767202225 767547913 767887268 767513351 767448425 767422180 767005310 767345810 767605820 768003845
1977 768003845 767777176 767848129 767799683 767207031 766972275 766770706 767113876 767048187 767431870 767645645
1986.6 767645645 767291031 766813354 766342926 766922531 766563568 765627594 765728302 766463242 766471176 765861588
1996.3 765861588 765690231 765319366 765243759 765058899 765329819 765363007 765217743 765296249 764623795 764461288
2005.9 764461288 764471512 764843826 764861221 764568329 764450836 764081268 764101028 763808899 763739853 763448257
2015.6 763448257 763125763 763006668 763067627 763412323 763126068 763061066 762690964 762698441 762707443 762407990 762259293
2026.2 762259293 761564102 761504135 761664734 761829147 761309357 760901337 760982056 760901260 761138077 760434418
2035.8 760434418 760166550 760028839 759829178 760076065 760026245 760154724 759794464 759384918 758986053 759248810
2045.5 759248810 759320602 758894653 759029236 758796539 758672791 758566666 758788681 758795853 758649139 758461990
2055.1 758461990 758030701 758005753 757326355 757180328 757310562 757425613 757303009 756817017 757061768 756979904
2064.7 756979904 757358856 757607651 757444916 756993790 756531525 756816788 756844711 756758728 756207123 756063843
2074.4 756063843 755935059 756048889 756577759 756265335 756134949 755929260 756228943 756032333 755775986 756073608
2084 756073608 755781937 755869293 755404816 755164566 755301514 755446472 755313492 754721146 754573746 754227676
2093.7 754227676 754509888 754566879 753876190 753266449 753431396 753892517 753665466 753715439 753611984 753741913
2103.3 753741913 753559570 753285217 753088913 752473984 752518463 752691727 753161697 752749786 752380066 752623901
2113 752623901 752495117 752433319 751740265 751587219 751365891 751417770 751645737 751423492 751535339 751234741
2122.6 751234741 751350021 751135406 750967560 750855026 750576172 750786057 750724869 750895767 750616302 750611343
2132.3 750611343 750905685 751085129 751032486 750498810 750363846 750076141 750230331 750369644 750470428 750422745
2141.9 750422745 750450134 750875397 750885315 751212616 750666122 750591507 750826874 750615005 750702667 750080032
2151.5 750080032 750335464 750524139 750678253 750872116 750529709 750685196 750495148 750434341 750657196 750946426
2161.2 750946426 750796814 750759735 750718689 750513687 750657272 750448837 750885468 751045685 751272049 751395264
2170.8 751395264 751197357 751508865 751119537 751140289 750902863 750846710 751209259 751315308 751477432 751220016
2180.5 751220016 751679001 751801605 751769028 751709671 751451416 751413040 751196594 751465836 751439819 751679306
2190.1 751679306 751883163 752087097 752274857 752059021 752374496 752270660 752203674 751909714 751851578 752195969
2199.8 752195969 752330704 752513275 752447052 752925797 752820969 752493362 752331009 752203445 752251129 752202148
2209.4 752202148 752729492 752697296 752884979 753060074 753079910 753272629 753092575 753138504 752620773 752592850
2219 752592850 752643280 752725677 753087769 753054276 753184662 753042450 753626862 753729401 753315964 753317184 753121490
2229.7 753121490 753057632 752753830 752994308 753226089 753120193 753033600 753231888 753516464 753135452 752931213
2239.3 752931213 752937698 753015289 752785721 752811661 752752914 752698669 753187408 752914352 752880783 752951889 752894516
2249.9 752894516 752584991 752413406 752911148 752876740 752656250 752431488 752900772 753121872 753033524 753041763
2259.5 753041763 752794342 752939224 752343063 752267685 752434235 752405624 752578583 752548904 752771988 752289581
2269.2 752289581 752280731 752477341 752587357 752602997 752218781 752178650 751893539 752095261 752234726 752567444
2278.8 752567444 752674026 752289047 752329407 752092514 752124329 751843719 751779404 751676712 751385193 751378632
2288.5 751378632 751249695 751589890 751502228 751497345 751138000 750894775 750835876 750105133 749792328 749394760
2298.1 749394760 749709778 749854279 749923096 749898682 749604492 749929810 749399261 749005280 748490143 748324203
2307.8 748324203 747959061 747203369 747476654 747352600 747586746 747234192 746917648 746441040 745723343 745282898
2317.4 745282898 743921585 743584747 742928696 743046570 743057556 742374802 742347717 741475220 741460037 741005859
2327.1 741005859 741258240 741020660 740137177 740292740 739913254 739941254 739479904 739913177 739568024 738686752
2336.7 738686752 738501740 738319092 738042755 736973343 737764053 737983932 738314133 738282700 737874908 739022064
2346.3 739022064 739459000 740305557 740895920 740604553 739158173 738316727 737910538 736313629 734998322
2355 734998322 733085861 734128342 735138168 733249435 731815033 732194290 733218307 732004776 731812210
2363.7 731812210 731560516 731886215 732352676 732786407 733690033 733646774 734486389 734892426 736145096 736815033
2373.3 736815033 736514053 736937790 737553177 738941956 739489594 739395676 739608612 740264664 740510712 740453644
2383 740453644 740731201 740739746 740834351 740382004 740218201 740362549 740433502 740501862 739980011 740129395 739987183
2393.6 739987183 739467163 739081955 738606720 738368301 738224182 738393860 738292770 738296814 737858124 737256012
2403.2 737256012 737186584 736725464 736153412 735688705 735706863 735988235 736308594 736008301 735703278 735960693
2412.9 735960693 735478592 734778671 733991013 733554459 733425064 733507004 733538284 733232803 733471069 733338623
2422.5 733338623 733133621 732522125 731714783 731454239 731023712 730712128 730278854 730135803 729905319 729972534
2432.2 729972534 730240173 729935303 729881058 729550858 729091339 728466110 727869720 727288666 726912918 726960068
2441.8 726960068 726753311 726963425 726975098 726834030 726375580 725621948 724979935 724194717 724258575 724135437
2451.5 724135437 723671951 723385086 723322220 723294678 723073044 723351364 722993851 722246704 721518784 720904312
2461.1 720904312 720815430 720467682 720022507 719866943 720070496 719955750 719605484 719169998 718478622 717974854
2470.7 717974854 717639084 717374802 716899109 716440277 715911331 715604477 715639343 715544434 715242233 714649353
2480.4 714649353 714254990 713684082 713043823 712596359 712449722 712571259 712365646 712239914 712090149 711651688
2490 711651688 710852585 710263672 709736557 709152908 708716888 707989426 707743530 707562256 707679672 707439270
2499.7 707439270 706704559 706634903 705805969 705003357 704518967 704267883 704261932 703730011 703254929 702807465
2509.3 702807465 702708664 702449875 702087402 701671829 700987473 700312119 699645157 699587555 699275131 698932877
2519 698932877 698763962 698770370 698820801 698151474 697670670 697108765 696638412 696183319 695711365 695344315
2528.6 695344315 694556961 694157104 694053802 694276123 694381866 694134216 693789444 693138428 692347183 691607895
2538.2 691607895 691269379 690765228 690377579 690166931 690306244 690459366 689851837 689676666 689153137 688328400
2547.9 688328400 687882996 687311707 686768265 686344604 686234665 686094818 686152344 686050644 685658417 685227509
2557.5 685227509 684398651 683696289 683484268 683366089 682845688 682560577 682352066 682117462 681784058 681158600
2567.2 681158600 681176071 681035690 680473480 679792633 679171143 678528290 678020935 678191299 677975845 677821121
2576.8 677821121 677647095 677008820 676631393 676414108 675928955 675326538 675123978 674649277 674216309 673966675
2586.5 673966675 673994370 673951492 673155289 672775497 672195129 671518707 671004639 670393829 669994736 669593964
2596.1 669593964 669599838 669298325 668715439 668473969 668589172 668210602 667559280 667358017 666592636 665978851
2605.7 665978851 665515137 665335617 665247040 664582214 664328003 664069138 663504944 662603226 661987762 661446304
2615.4 661446304 660727615 660272446 659895477 659890594 659348373 658874817 658635712 658403397 658115311 657127762
2625 657127762 656566086 655702209 654898224 654581299 654083405 653816681 653570709 653501816 653110809 652479172
2634.7 652479172 651878052 651529770 651000366 649975739 649371796 648825531 648698349 648632812 648228226 647833405
2644.3 647833405 647184448 646514740 646006165 645695496 645022888 644300461 643626709 643125381 642921371 642452469
2654 642452469 642199554 642052231 641761398 641131058 640908966 640738678 639801064 639275665 638713989 638125954
2663.6 638125954 637894783 637963371 638108788 637855415 637466507 636777000 636002846 635369148 635225067 635026016
2673.3 635026016 634524384 634171257 633707619 633750916 633754311 633399086 633136673 632730331 632137833 631603508
2682.9 631603508 631193275 630648003 630213127 629737549 629654999 629542122 628933563 628622704 628032837 627432823
2692.5 627432823 627259750 627303238 627109299 626495934 626063461 625907097 625842400 625379448 624784813 624358826
2702.2 624358826 624178391 623870392 623066788 622323570 621962852 622136002 622207565 622210846 621953430 621286240
2711.8 621286240 620927658 620621033 620124130 619400940 619052048 618818207 618693695 618714333 618422165 618318405
2721.5 618318405 618002930 617864189 617775002 617558784 617172699 616583481 616464195 615873413 615385094 615296249
2731.1 615296249 615457993 615608025 615184174 615173187 615110779 614791107 614127045 613546219 613403168 613236618
2740.8 613236618 613354759 613257408 612874146 612328796 612428207 612736092 612445755 612208099 611782417 611509132
2750.4 611509132 611047134 610485001 610319176 610563889 610545959 609469147 608871422 608959656 609113960 608888283
2760 608888283 608368225 608390427 608595009 608712883 608444099 607818451 607108307 606800957 606629181 606073112
2769.7 606073112 605534286 605267181 605383301 605304604 605217628 604838486 603961868 603249359 602790756 602660904
2779.3 602660904 602161789 601797409 601574936 601108932 601096573 601156731 600639572 599573631 599191551 599178619
2789 599178619 598780289 598366280 597651138 596698112 595985451 595958557 595928764 595400124 594844551 594366646
2798.6 594366646 593741341 593281746 592831993 591752548 590837135 590120811 589666214 589442024 589049110
2807.3 589049110 588504105 587714653 587465096 586877747 585795403 584795914 583678246 582806702 582086487
2816 582086487 582084846 582096138 581479950 580774193 580091972 578949547 577431946 576726952 576280479 575679398
2825.6 575679398 574704933 573888702 573666420 573110733 572411308 571428070 570741348 570029564 568796120
2834.3 568796120 567779312 566908798 566017990 564792252 563603058 562388229 561297989 559809570 557870674
2843 557870674 556376762 554582863 553028183 551502647 549570732 547282104 545059166 543567505 542231331
2851.7 542231331 541780586 541313477 540558128 540234413 539707756 539193764 538910637 539293327 539335556 538616753
2861.3 538616753 538058205 537986603 537824020 537134933 536562042 535793037 535070992 534110107 533023643 532545395
2870.9 532545395 532146759 531794052 531014442 530051575 529357300 529067841 528520203 527352524 526831665
2879.6 526831665 526488991 525809174 524893723 523841934 522748032 521942482 522005959 521817970 520892563
2888.3 520892563 519696579 518351860 517350960 516632805 515618668 514854584 514357567 513580475 512782440
2897 512782440 511906319 511519623 511123085 510220413 509105530 508126221 508028831 507438049 506477127 505890465
2906.6 505890465 505370941 504950714 504084396 503249855 502350693 501085129 499696579 498571167 497435417
2915.3 497435417 496172523 495168877 493790932 492428665 491018257 490120239 489643631 488811569 488436966
2924 488436966 488032303 487621384 486965942 486830406 487415886 487485085 487541504 487631416 487951736 487808647
2933.6 487808647 487604370 487861938 487797699 488132133 489090080 490110245 490473251 490966797 491633530 491981392
2943.3 491981392 492664642 493314209 493798180 494104118 494803581 495686646 496239014 496738129 497430916 498143578
2952.9 498143578 498047218 498225861 498696747 499192467 499919052 500168152 500322227 500428200 501067047 502155533
2962.6 502155533 503069763 503471909 503561554 504147720 504747429 505416374 505928383 506372795 507189713 507884979
2972.2 507884979 508472061 509113274 509627953 509964676 510674934 511449928 512097778 512663651 513013916 512942734
2981.8 512942734 512297401 512351875 512873230 513202362 513327217 513466187 513951492 514083633 514137459 514108467
2991.5 514108467 514042740 513685074 512879944 512783470 513020363 512842560 512609558 512696838 512279282 511553726
3001.1 511553726 510988350 510101891 509435196 508954086 508560410 508005867 507495041 507382469 506937218 506381721
3010.8 506381721 506003876 505260506 504117546 503674622 503613167 503124504 502288017 501217461 500948334
3019.5 500948334 501023903 500270271 499158363 498635674 498262558 497396774 496520996 495647430 494813461 494142380
3029.1 494142380 493779297 493030701 492028465 491440163 490528488 490044861 489627991 488617249 487768021
3037.8 487768021 486912231 485923538 485215530 484883537 484125557 483153687 482406120 482024841 481596985 480517502
3047.4 480517502 479567719 478662872 478033752 477343750 476175079 475406342 474587173 473602066 472793884
3056.1 472793884 472024422 471160469 470547485 470079918 469058113 467861443 467306061 467085686 466155968
3064.8 466155968 465478401 465469971 464855881 463730202 462935829 462465897 461660271 460892754 460136032 459354477
3074.4 459354477 458930664 458449097 457608681 456852875 456890907 456217651 454760132 453894196 453123779 452555962
3084.1 452555962 452131958 451459084 450374794 449502602 449404716 449498177 448950043 447879791 447066078 445931282
3093.7 445931282 445200348 444737549 443263817 442224770 441978226 441806183 441363716 440469475 439602737
3102.4 439602737 439184494 438544197 437576027 437084312 436758270 436096840 434853592 434124947 433816032
3111.1 433816032 432776184 431852646 431328125 431085510 430362244 429210434 428475151 427752609 426979103
3119.8 426979103 426294327 425875168 425083427 423921165 423196068 422729950 421903610 420778694 420271912
3128.4 420271912 419875107 418895836 417793922 417296219 416726456 415817680 415572777 415053139 414218712
3137.1 414218712 413536148 412708244 411703949 410570030 409823647 409099197 408084373 407115822 406814880
3145.8 406814880 406634064 405942459 405160370 403991814 402931099 402382736 402159042 401499023 400362625
3154.5 400362625 399584084 398481445 397361755 396605988 395777855 395345154 395312958 394724731 393818016
3163.1 393818016 393160744 392261086 391495323 390742989 389986267 389276733 388242340 387388496 386832848
3171.8 386832848 386355553 385250626 384191704 383598404 382900848 382308769 381433144 380833931 380196609
3180.5 380196609 379164848 378416901 377570114 376580963 375766220 375120316 374402962 373991776 373522186
3189.2 373522186 372840309 372084885 370964088 370503426 369975815 368861237 368035126 367368469 366631088
3197.9 366631088 365687828 365004120 364512291 363935509 363292160 362748604 362198448 361344185 360648689 359978447
3207.5 359978447 359337807 358799896 358218040 357668724 357155113 356830902 356403122 355779991 354812469 353646927
3217.2 353646927 353191452 352876129 351751022 350917931 350634575 350009422 349408798 348955154 348671150
3225.8 348671150 348089676 347186356 346771278 346228714 345544815 345135117 344647789 343580437 342757759
3234.5 342757759 342757759 342372589 341501465 340528526 339978180 339635277 338927727 338476524 338191833 337802467
3244.2 337802467 337091866 336335640 335897446 335495262 334905739 334214020 333693581 333113098 332602348 332313957
3253.8 332313957 332253647 331927834 331056824 330528412 330263672 329605675 328898849 328767014 328539772 328020401
3263.4 328020401 327574997 327169571 327066040 326611595 325983124 325417671 324774818 324386101 324073982 323709373
3273.1 323709373 323087883 322780647 322257996 321243896 320826416 320865669 321060371 320784149 320303078 319890194
3282.7 319890194 319480343 319245625 318761997 318378029 317881680 317182064 316950245 317106419 316902447 316227627
3292.4 316227627 315800705 315369358 314968319 314608841 313902035 313490086 313537312 313288784 312757206 312270794
3302 312270794 311784363 311666031 311682777 311006527 309949474 309727383 309735584 309097080 308680058 308262062
3311.7 308262062 307758026 307122402 306388969 306009445 305897617 305875645 305005550 304072304 303444157 302899952
3321.3 302899952 302949753 302450047 301722755 301415081 301103783 300261078 299151096 298362141 297595005 297557392
3330.9 297557392 297465744 296520290 295574703 295002041 294753208 294370308 293861847 292930336 291836224 290979748
3340.6 290979748 290422020 290122585 289477615 289084549 288930740 288379993 287571907 286804276 285765839
3349.3 285765839 284637814 284773197 285217247 284662857 283918896 283636341 283253918 282754040 282566433
3357.9 282566433 282162685 282007923 281830559 280814648 280002441 280094986 280103760 279463196 279243412 279071922
3367.6 279071922 278597870 278368168 277894802 277317505 277031956 276854382 276566105 276360016 276109715 275991879
3377.2 275991879 276195354 275950184 275400734 274823399 274596996 274642754 274124031 273542671 273436832 273620110
3386.9 273620110 273616486 273397961 273252544 273155708 273263149 273156319 272553806 271959534 271880074 272260838
3396.5 272260838 271995430 271409035 271523991 271495609 270990925 270683861 270773392 270758438 270477180 270418053
3406.2 270418053 270519829 270600128 270182915 269867573 270438519 270811234 270862083 270974045 271280403 271422901
3415.8 271422901 270957279 270719318 271034546 271570644 271651917 271574898 271565762 271158886 271236629 271913662
3425.5 271913662 272397404 272379036 272540359 272805614 272558327 272480640 272716808 273406696 273948689 273715553
3435.1 273715553 274000320 274668064 274921627 275276585 275395432 275526638 276176319 276201553 276262054 277008610
3444.7 277008610 277878265 278351269 277950974 278194523 278618660 278890610 279386311 279552708 280222378 281169548
3454.4 281169548 281989250 282752361 283280602 283640842 283807278 284076347 284452229 284874191 285336075 286266804
3464 286266804 287169380 287808151 288344288 288686771 289820251 290575657 290952663 291611786 291792965 292610378
3473.7 292610378 293370838 293702927 294755821 295551987 295654850 296105614 297010307 297839661 298425922
3482.3 298425922 298999424 300160446 301016960 301390953 301830902 302317257 303323669 304132957 304950085
3491 304950085 306020832 306778049 307271099 307943974 308838100 309479389 310394993 311033802 311450405 312444630
3500.7 312444630 313895435 315041351 315040207 315670643 316868782 317912273 319028797 319794750 319910374
3509.4 319910374 320297661 321876602 322862625 323746529 325097237 326119423 327293549 328209839 329141769
3518 329141769 329911919 330592575 331411858 332404289 333702393 334331551 335133018 336357079 337664337
3526.7 337664337 338768044 339599495 340463524 341343956 342179184 343183708 345086708 346387596 347076607
3535.4 347076607 347648010 348496780 350568085 351940346 352838554 353980179 355315056 356308289 356993561
3544.1 356993561 357870865 358827858 360877228 361730652 362919426 364822426 366562958 368494148 368911285
3552.7 368911285 370625687 371966171 373087730 374796333 375630226 377449684 378429146 379494591 381149483
3561.4 381149483 382995605 384440231 385527077 388650093 389527740 390597610 392170067 393105049 396093140
3570.1 396093140 397573242 399269218 401133385 402576485 404119987 405862846 407740936 408768654
3577.8 408768654 411204987 413195114 414453773 416203804 418176079 420127831 421776161 425221939
3585.5 425221939 426383514 426719933 429393387 429609299 432131538 435082436 438114243 440170746 441849937
3594.2 441849937 445080795 445011902 447117310 450678902 452252922 454433250 455273323 457187386 460335541
3602.9 460335541 462394981 464522095 467350540 469791603 471290436 475216904 474898186 475283623 481479416
3611.6 481479416 482948074 483582115 487670364 488306999 492207680 496231232 497227669 498393402 498489075
3620.3 498489075 501648293 506151276 509466743 512416267 515262909 517466507 521176262 526912766
3628 526912766 525688896 520715714 525994911 531904373 537276421 538764763 538046532 541105347 545371552
3636.6 545371552 548365097 550011177 552703514 555659676 557876244 559812546 562309685 565547562
3644.4 565547562 569263802 573972321 573860016 574296036 580451050 580007553 577856102 580065689 586064491
3653 586064491 590650330 594744835 599160500 594660454 597452240 602568550 604891281 607147598 608379555
3661.7 608379555 611136284 613008957 615170555 617311287 618865395 623303757 624643898 624215355
3669.4 624215355 625358582 621810913 625537491 633153839 640779648 638516884 623131409 628171654
3677.1 628171654 637177010 641782074 639260788 640080185 643524704 645753250 647659988 648987427
3684.9 648987427 649272919 652148590 657631378 649605713 647752151 655376129 650171432 651205978
3692.6 651205978 656969376 658172226 659631348 660173035 660375671 661686172 662348099 664836731 667657776
3701.3 667657776 662979965 661800385 666761703 667662888 667760696 668754272 671178207 674302750 668881226
3709.9 668881226 672851257 674222183 662974243 669021530 673349380 674085922 675357132 677180634
3717.7 677180634 677905426 674881134 676244278 681545868 678166275 674600754 679161835 679647369 679060440
3726.3 679060440 677181549 678003387 681612625 682820587 687651672 683602829 677824402 686082382
3734 686082382 685350723 677198105 678085251 680725632 681264038 684141769 686958618 684174576 688215561
3742.7 688215561 697866821 685432663 672340240 682338409 687670746 692354889 688650131 680880508
3750.4 680880508 691086197 685957870 680622406 686189270 690512085 693579254 688782196 691264801
3758.2 691264801 695462875 688195038 688232040 692241516 692773514 692866898 696270981 694154968 690416031
3766.8 690416031 693383484 697488251 697409058 690358276 692838211 695536041 695516815 696161728 695749054
3775.5 695749054 696681366 697309570 700003052 699109268 691982040 694830017 697254715 698197098 699752045
3784.2 699752045 697405853 696550369 697354584 697744522 698014221 698119583 698827438 699257050 700064011
3792.9 700064011 700155487 700752335 702672577 698500137 695745392 698851547 702595673 707118835 700042877
3801.5 700042877 691393127 695880508 699411240 703748779 707018051 697555237 695080872 700229416
3809.3 700229416 702162552 702398224 702723694 702379684 704017944 708508224 703694687 692547455 699407806
3817.9 699407806 704451828 706814270 707353134 693247070 695921326 700904236 702385406 704951096
3825.7 704951096 704450760 701013412 702084503 703769684 705506058 705113068 699311523 702944717 707983704
3834.3 707983704 702207031 703184891 709587784 700051193 697814178 704915848 700058670 700631943 706402512
3843 706402512 703751678 701441422 703683167 704105301 704830475 706869736 705286026 706724396 710983734
3851.7 710983734 705608902 706172485 692071762 695515594 705358429 704103928 702794418 704851990
3859.4 704851990 706569595 707292633 702798843 704603729 708712692 701846771 698991089 703722610
3867.1 703722610 708420258 711819763 702855606 696385956 701686401 707609177 708438416 699332047
3874.8 699332047 701470718 705431137 705493622 708023682 711817551 706237411 700413208 705091705 705851364
3883.5 705851364 707818832 711217499 699936371 701969910 705876923 706509628 709502029 707072830
3891.2 707072830 700035095 702196198 705138016 704174271 705697250 706904678 709103775 710238800
3898.9 710238800 702577362 707208176 708052063 702843170 705849609 702696457 701775131 702497482 703484497
3907.6 703484497 705683746 706033630 706029053 705759659 706033554 705773926 705133743 706308212 708498383
3916.3 708498383 705738373 702848663 706313553 705248718 702325363 704967651 706650848 706999817
3924 706999817 704759064 703037643 704757156 705750351 706374359 705493774 704617310 705259705 703136292
3932.7 703136292 702874298 704845657 705029526 704947433 705075836 705456314 705651093 705607910 707098541 706897812
3942.3 706897812 702758636 702730637 704728012 705792770 706429901 704798965 705476837 705626297 703411713
3951 703411713 704121475 703962860 704236908 705125961 704816284 704611206 704007797 704595795 704720001 705002365
3960.7 705002365 705501251 703982620 703755875 704304504 704389038 704674606 704919586 705161896 705052948 704936371
3970.3 704936371 705066147 704663544 704442291 705113525 705363235 704694214 704078979 704590836 705106277 705156860
3980 705156860 705176926 705148849 705758133 705626450 705267487 705007172 704607773 704977875 705043488 705108871 704638824
3990.6 704638824 704281998 704923630 704996567 704786758 704987183 705230789 704903717 704809189 704635162 704988937
4000.2 704988937
##END=$$ End of the data block
