##TITLE=$$ Begin of the data block
##JCAMP-DX=5.00 $$ ACD/SpecManager v 10.08
##SPECTROMETER/DATA SYSTEM=Varian
##DATE=15 Jan 2013 09:43:58
##DATA TYPE=INFRARED SPECTRUM
##DATA CLASS=XYDATA
##ORIGIN=
##OWNER=
##NPOINTS=3735
##FIRSTX=399.26403809
##LASTX=4000.35498047
##MAXX=4000.35498047
##MINX=399.26403809
##MAXY=77.29889679
##MINY=26.90773201
##XFACTOR=1.0000000000
##YFACTOR=0.000000100000000
##FIRSTY=50.84534454
##DELTAX=0.96440572
##XUNITS=1/CM
##YUNITS=TRANSMITTANCE
##XYDATA=(X++(Y..Y))
399.3E08453445o339531J401101l721733m255715m255104k368507O354065J509285
$$ 508453445 502113914 503515015 499793282 495537567 491282463 488913956 495268021 496777306
407D96777306K325515j108284m609031q34465Q339958O576118p882232q07267J022149
$$ 496777306 499102821 497994537 493385506 492551041 500890999 507467117 499584885 498777618 499799767
415.7D99799767J056060O864281Q67386p529335o004334J652184j489830k790337L057556
$$ 499799767 500855827 507720108 508587494 501058159 495053825 496706009 495216179 492425842 495483398
424.3D95483398k021560r852944l204422P804337M007568L92266k680245n248642l915520
$$ 495483398 493461838 483608894 480404472 488208809 492216377 492608643 489928398 484679756 480764236
433D80764236l378562J444473Q02574J91879L89099K799530M147149J892166J059532
$$ 480764236 477385674 478830147 479632721 479824600 480213699 483013229 487160378 489052544 490112076
441.7D90112076k158280j4572j860924k171402J693230M041252M373207j494712n147019
$$ 490112076 487953796 487939224 486078300 483906898 485600128 489641380 494014587 492519875 487372856
450.4D87372856j951713K520790J871299j970825k407722p33147k302322j458702N216865
$$ 487372856 485421143 487941933 489813232 487842407 485434685 484701538 482399216 480940514 486157379
459.1D86157379J877175K578887m111099p869720o20117J268463J242752k691994J447334
$$ 486157379 488034554 490613441 486502342 478632622 478012505 479280968 480523720 477831726 479279060
467.7D79279060J007080l246955P17659r9526j27525m721642j486130P68929J651001
$$ 479279060 480286140 477039185 477756844 477657318 477529793 472808151 471322021 472090950 473741951
476.4D73741951J392517m714432j175499o02417n10215K694130J557960j099396q54377
$$ 473741951 475134468 470420036 469244537 468642120 468131905 470826035 472383995 471284599 470430222
485.1D70430222K135314k25601j058616j691208n56832O17943o09588J716575k36816
$$ 470430222 472565536 472339935 471281319 469590111 469033279 469651222 469041634 470758209 470521393
493.8D70521393k457924o48422N97191k543297j012574K139512J84631L63312n52368
$$ 470521393 468063469 467415047 468012238 465468941 464456367 466595879 466780510 467143822 466591454
502.5D66591454O54335J19514j478767j028557j896401r24377k88429R9029J96953
$$ 466591454 467245789 467365303 465886536 464857979 462961578 462037201 461748772 461847801 462044754
511.1D62044754J921692j044273j722756P05109k854386l280067k059059K652664J771164
$$ 462044754 463966446 462922173 461199417 461904526 459050140 455770073 453711014 456363678 458134842
519.8D58134842j945305L47672j257210J181144J083527j705475p17239q00438j4381
$$ 458134842 456189537 456537209 455279999 456461143 457544670 455839195 455121956 454321518 454307137
528.5D54307137J004257K027893M22516j124802o18095q0376j091461k907295j796799
$$ 454307137 455311394 457339287 457761803 456637001 456018906 455938530 454847069 451939774 450142975
537.2D50142975k22626J412430J644325Q08563j152839j259156q42514k126655M06265
$$ 450142975 449920349 451332779 452977104 453785667 452632828 451373672 450531158 448404503 448810768
545.9D48810768M06113m77143j57966l56865K81372l22647L00980j004258j833915
$$ 448810768 449216881 448739738 448581772 448224907 448506279 448183632 448484612 447480354 445646439
554.5D45646439q56781j532059j221428N16205Q58307n36118o07605n61333N77736
$$ 445646439 444789658 443257599 442036171 442552376 443410683 442874565 442266960 441705627 442283363
563.2D42283363J708031J585617K43340j114006q16422j626778l25470O25382J057701
$$ 442283363 443991394 445577011 445820351 444706345 443889923 442263145 441937675 442563057 443620758
571.9D43620758J313782n45349j107369q12950J414909M20990o89506n20897j55487
$$ 443620758 444934540 444389191 443281822 442468872 443883781 444304771 443615265 443094368 442938881
580.6D42938881J640472j162223K7542J563339m84505K95487J42059L99094m69590
$$ 442938881 444579353 443417130 443444672 445008011 444523506 444818993 444961052 445360146 444890556
589.3D44890556q90960N29861L26080j30996L77273M07563n89371j54343P62863J023026
$$ 444890556 443999596 444529457 444855537 444724541 445101814 445509377 444920006 444765663 445528526 446551552
598.9D46551552p31354j231842M80194J22566J73607j24512j13143j004906k132301
$$ 446551552 445820198 444588356 445068550 445191116 445364723 445240211 445127068 444122162 441989861
607.6D41989861l62511j86234l82881k13928j119690r64622M41665N38635Q8196J16081
$$ 441989861 441627350 441441116 441058235 440844307 439724617 438759995 439201660 439740295 439828491 439944572
617.2D39944572n7678M1809o89277n9204M30069M60891J678925R77363K43874N44281
$$ 439944572 439886894 439928703 439239426 439180222 439610291 440071182 441750107 442727470 442971344 443515625
626.9D43515625M99725O63109J692772J940117J794548J522331l8681M72183J358300
$$ 443515625 444015350 444678459 446371231 448311348 450105896 451628227 451589546 452061729 453420029
635.5D53420029J559295J836281P29332L19061J137314K466698K326660O08749k56080
$$ 453420029 454979324 456815605 457544937 457863998 459001312 461468010 463794670 464403419 464147339
644.2D64147339m03328N31387J384278J164970J68457l50265J306571J533852M2839
$$ 464147339 463744011 464275398 465659676 466824646 466993103 466642838 467949409 469483261 469526100
652.9D69526100j64375J40610J178054J295319k66991k89077R75570N6725j979447
$$ 469526100 469361725 469502335 470680389 471975708 471708717 471419640 472395210 472451935 470472488
661.6D70472488j516456M5929N29594J079483J232796j564598o118012L826714K747497
$$ 470472488 468956032 469001961 469531555 470611038 471843834 470279236 464161224 467987938 470735435
670.3D70735435J892014Q26530l03535O02798Q19321J103554J611748P28836J6060
$$ 470735435 472627449 473453979 473150444 473753242 474572563 475676117 477287865 478016701 478032761
678.9D78032761J297683K609024J067772J86539J101379J732140J493416J193161N87196
$$ 478032761 479330444 481939468 483007240 483193779 484295158 486027298 487520714 488713875 489301071
687.6D89301071r67140J75896J794281J217193M17710k2011K6550j14021J047592J367645
$$ 489301071 488333931 488509827 490304108 491521301 491939011 491917000 491943550 491829529 492877121 494244766
697.3D94244766K97547R51805M88090n88569K68707J375313J160125N22423L42751
$$ 494244766 494542313 495494118 495982208 495393639 495662346 497037659 498197784 498720207 499062958
705.9D99062958J16920P66602J323471Q91456R69506J290931J358872N46112j97372
$$ 499062958 499179878 499946480 501269951 502161407 503130913 504421844 505780716 506326828 506129456
714.6E06129456O69021R95293M30679m4060j39312P41119Q61092M53109J314164J677970
$$ 506129456 506798477 507793770 508224449 508180389 508041077 508782196 509643288 510096397 511410561 513088531
724.3E13088531J046753Q35457L18222k1782M03939J216545J459007N6610N79148J420440
$$ 513088531 514135284 514970741 515288963 515267181 515671120 516887665 518346672 518403282 518982430 520402870
733.9E20402870P48635J438865Q87680o599o8779J08528M05731P2289J046104J513863
$$ 520402870 521151505 522590370 523478050 523471451 523402672 523511200 523916931 523989220 525035324 526549187
743.6E26549187J078376Q46978L10478O36711Q91380O90232J162834J242561M69589
$$ 526549187 527627563 528474541 528785019 529421730 530313110 531003342 532166176 533408737 533878326
752.2E33878326N59502O68945P63092J051445J191445J255035J13716N24063J318360
$$ 533878326 534437828 535106773 535869865 536921310 538112755 539367790 539481506 540005569 541323929
760.9E41323929Q00438Q81653O65474K89344M54445J493302J419677L82996k4338K32887
$$ 541323929 542124367 543006020 543671494 543960838 544415283 545908585 547328262 547711258 547686920 547919807
770.6E47919807J09406j124535j48162R80186L56941K9869K19078O75278M30985j87302
$$ 547919807 548029213 546904678 546756516 547736702 548093643 548123512 548342590 549017868 549448853 549261551
780.2E49261551l55148L83987N12123K00539J25084Q89663K165070Q59413k84729o8474
$$ 549261551 548906403 549290390 549802513 550003052 550128136 551017799 553182869 554042282 553757553 553689079
789.9E53689079L78914R91554P47490O6033l03879k63405n12771K82974L83606J45530
$$ 553689079 554067993 555059547 555807037 555873070 555569191 555305786 554793015 555075989 555459595 555605125
799.5E55605125L56675p42951j960831k293357r23958j314583j276093l32450j023941
$$ 555605125 555961800 555218849 553258018 550964661 550040703 548726120 547450027 547117577 546093636
808.2E46093636r21097j428643j216735p42989j57394q24471k133903j091614j632614
$$ 546093636 545172539 543743896 542527161 541784172 541626778 540802307 538668404 537576790 535944176
816.9E35944176j032143L2959L7651P74460R38492J539268J176338J486207J940536
$$ 535944176 534912033 534944992 534982643 535757103 536695595 538234863 539411201 540897408 542837944
825.5E42837944K010498K194252J800308L266144L226586K960128L490486K784806
$$ 542837944 544848442 547042694 548843002 552109146 555335732 558295860 561786346 564571152
833.3E64571152K429962K314567K525864J528015M01078J602249K625579J607171K129440
$$ 564571152 567001114 569315681 571841545 573369560 573770638 575372887 577998466 579605637 581735077
841.9E81735077K197494J418991J934929J207238J128235R98954J455460J283684L40614
$$ 581735077 583932571 585351562 587286491 588493729 589621964 590620918 592076378 593360062 593700676
850.6E93700676j19095m17786K221871L047638K435608R97963M01230J911239J284409
$$ 593700676 593581581 593163795 595385666 598433304 600868912 601866875 602268105 604179344 605463753
859.3F05463753J031112L01018L36418K03286M38690J328239P26967Q28362O0768m47617
$$ 605463753 606494865 606795883 607132301 607335587 607774277 609102516 609829483 610657845 610718613 610270996
868.9F10270996k105675j999969j173439j670990q55942j345138n79453p12700n82161
$$ 610270996 608165321 606165352 604991913 603320923 602464981 601119843 600540390 599827690 599245529
877.6E99245529o79817k105713r75952q86383j762314j904068k57454m07982p85141
$$ 599245529 598565712 596459999 595484047 594597664 592835350 590931282 590673828 590265846 589480705
886.3E89480705P36161M00962r5443q82492l66936q82874m63295Q29048n86357N45884
$$ 589480705 590216866 590617828 590522385 589639893 589272957 588390083 587926788 588755836 588169479 588715363
895.9E88715363J108665R24759Q38203m1694q00286j147308o7215o42357O3477J964187
$$ 588715363 589824028 590748787 591586990 591545296 590745010 589597702 589530487 588888130 588951607 590915794
905.6E90915794K700119L243561K891884K116585J774978J847954L34893K365r27773
$$ 590915794 593615913 596859474 599751358 601867943 603642921 605490875 605825768 605828133 604900360
914.3F04900360j999626j090317j952820j725311q65021j760177k521019k082215k417640
$$ 604900360 602900734 601810417 599857597 598132286 597267265 595507088 592986069 590903854 588486214
922.9E88486214l084946l018723l296585l208236l249588l095818l182716k653466
$$ 588486214 585401268 582382545 579085960 575877724 572628136 569532318 566349602 563696136
930.7E63696136k229537k485009k068977k159500j679230j652908j835747j667938
$$ 563696136 561466599 558981590 556912613 554753113 553073883 551420975 549585228 547917290
938.4E47917290j366654j47056m00162q12378m51355n39627r99603r66797m24881j17417
$$ 547917290 546550636 546403580 546003418 545191040 544739685 544200058 543200455 542233658 541808777 541691360
948E41691360N80864N91546R16290J044769M95415M96712j40419l55835j254197k581176
$$ 541691360 542272224 542863770 543780060 544824829 545320244 545816956 545676537 545320702 544066505 541485329
957.7E41485329k713051j995430j944809k246285q55941p48139j752548j723709j595459
$$ 541485329 538772278 536776848 534832039 532585754 531729813 530981674 529229126 527505417 525909958
966.3E25909958j416702j930924k559662k020416j681557k054214k007828k155495
$$ 525909958 524493256 522562332 520002670 517982254 516300697 514246483 512238655 510083160
974.1E10083160k532539k513809k971726m403381m554558l576431m206619n014992
$$ 510083160 507550621 505036812 502065086 497661705 493107147 489530716 485324097 480309105
981.8D80309105m945564m238396l885536m276276m625435m519005m387512m351806
$$ 480309105 475363541 471125145 467239609 462963333 458337898 453818893 449431381 445079575
989.5D45079575l696251m016724m543877l758735k636223l139343l439980k688141
$$ 445079575 441383324 437366600 432822723 429063988 426427765 423288422 419848442 417160301
997.2D17160301k429352k041435k834015k786216l153496l619461k437477k249184
$$ 417160301 414730949 412689514 409855499 407069283 403915787 400296326 397858849 395609665
1004.9C95609665k107353k269097k040901k130966j684074j555253j675949j412544
$$ 395609665 393502312 391233215 389192314 387061348 385377274 383822021 382146072 380733528
1012.6C80733528l030853k370606k060127k135620k034302k256050j322174k009315
$$ 380733528 377702675 375332069 373271942 371136322 369102020 366845970 365523796 363514481
1020.3C63514481k120667k544098j907615k033082k160682r51920j680755j370430
$$ 363514481 361393814 358849716 356942101 354909019 352748337 351796417 350115662 348745232
1028.1C48745232j852379q39730m22554m71801l48854j191712M37546O0692L71780
$$ 348745232 346892853 346053123 345630569 345158768 344809914 343618202 344055748 344116440 344488220
1036.7C44488220Q22106K051315K539558J608239K769584J154595J193390J187706
$$ 344488220 345310326 347361641 349901199 351509438 354279022 355433617 356627007 357814713
1044.5C57814713j20850m97093m62151n34897j976165j071892j257668r92508j026840
$$ 357814713 357693863 357196770 356734619 356199722 354223557 353151665 351893997 350901489 349874649
1053.1C49874649j553078j113739k117996j093063j133270l06511J48964M38461J919975
$$ 349874649 348321571 347207832 345089836 343996773 342863503 342556992 342705956 343144417 345064392
1061.8C45064392K004280K609711K020721K464104K416420J431999K32315K56424J177178
$$ 345064392 347068672 349678383 351699104 354163208 356579628 358011627 358243942 358500366 359677544
1070.5C59677544Q51631J142120L19367N95436l32909k34413J085701L65601J05514
$$ 359677544 360529175 361671295 361990662 362586098 362253189 362018776 363104477 363470078 363575592
1079.2C63575592r58443Q84896J113205N16319Q67538Q36563J727868M38385J502723
$$ 363575592 362617149 363502045 364615250 365131569 365999107 366835670 368563538 369001923 370504646
1087.9C70504646J484452J350288J814919J331481J824112Q20809J494522J436462
$$ 370504646 371989098 373339386 375154305 376485786 378309898 379130707 380625229 382061691
1095.6C82061691J569252J275139J196137K514572R27772P17125J095200J488495J539879
$$ 382061691 383630943 384906082 386102219 388616791 389544563 390261688 391356888 392845383 394385262
1104.2C94385262J194038J707725J803208J272392L84560J507721J045265J13144M75921
$$ 394385262 395579300 397287025 399090233 400362625 400747185 402254906 403300171 403413315 403889236
1112.9D03889236L31803Q35762J271515K085876J223107k60430o13098L11737N27268
$$ 403889236 404221039 405056801 406328316 408414192 409637299 409376869 408763771 409075508 409602776
1121.6D09602776q23670m37813O0730P18804M66194N97839J707764J577148K275696
$$ 409602776 408779106 408341293 408402023 409120827 409587021 410184860 411892624 413469772 415745468
1130.3D15745468K685471K038040J218300K251091K978210K728729K801514K132530
$$ 415745468 418430939 420468979 421687279 423938370 426916580 429645309 432446823 434579353
1138D34579353K341538K490997K416763K306366J787835J282005J271133O35643j62964
$$ 434579353 436920891 439411888 441828651 444135017 445922852 447204857 448475990 449111633 448948669
1146.7D48948669Q15964P70302K89230P27768Q67310p897q71734o4926k82517o33545
$$ 448948669 449764633 450534935 450824165 451551933 452419243 452411346 451539612 451474686 451192169 450558624
1156.3D50558624l80325j034966j367111r13162k76489p03926j40877P88383Q88596
$$ 450558624 450178299 449143333 447776222 446863060 446586571 445882645 445741768 446530151 447418747
1165D47418747J384201J931686K993355K710152K084579K904015L070030K460594K792206
$$ 447418747 448802948 450734634 453727989 456438141 458522720 461426735 464496765 466957359 469749565
1173.7D69749565K951851L154984L071937K649002K934036K059784J799508K016944
$$ 469749565 472701416 475856400 478928337 481577339 484511375 486571159 488370667 490387611
1181.4D90387611J992836J759415J565056K146797J717720J181679O36940P87086Q94356
$$ 490387611 492380447 494139862 495704918 497851715 499569435 500751114 501388054 502175140 503069496
1190.1E03069496R2926J793j51787p82623p50160l3036p40470j242714m28467l78838
$$ 503069496 503162422 503164215 503012428 502229805 501479645 501446609 500706139 499463425 499034958 498656120
1199.7D98656120j142769j549339j077156j088219q08525o27441j471901r42802Q3465
$$ 498656120 497513351 495964012 494886856 493798637 492990112 492362671 490890770 489947968 490031433
1208.4D90031433K8763k87476l43170j04446r2583m45480j47515j08604q79555m47426
$$ 490031433 490060196 489772720 489429550 489325104 489232521 488787041 488639526 488530922 487651367 487203941
1218D87203941o1760r0026l06397o70547l52593q68034p03507k53982q44498j218872
$$ 487203941 487142181 487052155 486745758 486075211 485722618 484854584 484151077 483897095 483052597 481833725
1227.7D81833725j248627m27856m76418r29794n84602m11110k84958o64330n83000
$$ 481833725 480585098 480157242 479680824 478751030 478166428 477755318 477470360 476806030 476223030
1236.4D76223030r4833M8332j40190l00751k46048m60892j32637P897l95966p45506
$$ 476223030 476128197 476176529 476036339 475735588 475489540 475028648 474896011 474903908 474507942 473762436
1246D73762436m29039k23427p07550l04718j74446j42975p6752l43284m20990m39415
$$ 473762436 473333397 473109970 472402420 472097702 471923256 471780281 471703529 471360245 470939255 470499840
1255.7D70499840J99127J01433r8114l09525m00696M63524M28505L35694M02526M63448
$$ 470499840 470698967 470800400 470702286 470392761 469992065 470455589 470884094 471219788 471622314 472085762
1265.3D72085762L80974J88980M11911R17816J187401P82585Q18863R00307Q11844
$$ 472085762 472466736 472655716 473067627 473985443 475172844 475955429 476774292 477674599 478486443
1274D78486443L21121M32243J218338J214371J122970Q39577Q33244P42836R30863
$$ 478486443 478807564 479239807 480458145 481672516 482795486 483635063 484468307 485211143 486142006
1282.7D86142006J297188J210937J271553J058846J097069J101074J119957N78193
$$ 486142006 487439194 488650131 489921684 490980530 492077599 493178673 494298630 494876823
1290.4D94876823L86963R82132O96221M66232P03926R34792K99072J0567K49710M8675
$$ 494876823 495263786 496245918 496942139 497408371 498112297 499047089 499346161 499356728 499606438 499655113
1300D99655113J46370Q7891R2544J56288r4261m40521m21791n56221m96674k8190o37207
$$ 499655113 499801483 499889374 499981918 500138206 500043945 499603424 499181633 498625412 498128738 498100548 497463341
1310.6D97463341j001244o54220o28739o25877k79885K0829O1760L23066K75765N72662
$$ 497463341 496462097 495807877 495179138 494553261 494273376 494294205 494355965 494679031 494954796 495527458
1320.3D95527458J167793R16863N29633P44857J001702N40886O01005N33981k8800
$$ 495527458 496695251 497612114 498141747 498886604 499888306 500429192 501030197 501564178 501535378
1328.9E01535378j88523l62015n80482o53343n30434j75667L2807l06778J43318O15539
$$ 501535378 501346855 500984840 500404358 499751015 499220581 499044914 499077721 498770943 498914261 499529800
1338.6D99529800J92986K33955M97971J186218J172867R28116R59320O47468Q78716
$$ 499529800 499722786 499956741 500454712 501640930 502813797 503741913 504701233 505348701 506227417
1347.3E06227417P04002N32189K7351p2365m26826p83310l33519m93774j20812p4387
$$ 506227417 506931419 507463608 507490959 507418594 506991768 506208458 505874939 505381165 505260353 505185966
1356.9E05185966K87629j28327n43365j77689o76308n70106j026497L86620R6397o84128
$$ 505185966 505473595 505345268 504801903 504624214 503947906 503377800 502351303 502737923 502834320 502150192
1366.6E02150192r498q04749l98865k29416j99165M4174k29911p55425j120872K85682
$$ 502150192 502140694 501335945 500937080 500707664 500508499 500552673 500322762 499567337 498446465 498732147
1376.2D98732147K13852J10130k05726m5700J21803r26743j287918j728134j156082
$$ 498732147 498945999 499056129 498850403 498804703 498926506 497999763 496711845 494983711 493827629
1384.9D93827629r57451j243973k205658j472320p83081k094612j344033p76329j508178
$$ 493827629 492870178 491626205 489420547 487948227 487165146 485070534 483726501 482950172 481441994
1393.6D81441994l227539l546448j785660k040100j689072k894249k153282j243820
$$ 481441994 478214455 474668007 472882347 470842247 469153175 466258926 464105644 462861824
1401.3D62861824j825447j395073j766663k536964k043190j469307k152710k292976
$$ 462861824 461036377 459641304 457874641 455337677 453294487 451825180 449672470 447379494
1409D47379494j697388j960983j354103j092491p95136q50983j185722q62808j497650
$$ 447379494 445682106 443721123 442367020 441274529 440479393 439628410 438442688 437579880 436082230
1417.7D36082230j87645j864395n97191J438827L08304J45111j031227J046829J518669
$$ 436082230 435894585 434030190 433432999 434871826 435180130 435325241 434294014 435340843 436859512
1426.3D36859512N28450J349144R63135Q82454L57666J626778J648788J874809K722664
$$ 436859512 437387962 438737106 439700241 440582695 440940361 442567139 444215927 446090736 448813400
1435D48813400J144333J015511K319565L330802J954041J671066J939545J074486J922683
$$ 448813400 449957733 450973244 453292809 456623611 458577652 460248718 462188263 463262749 465185432
1443.7D65185432J253205K336044J692009J374016J609917J461563K492180J081085
$$ 465185432 466438637 468774681 470466690 471840706 473450623 474912186 477404366 478485451
1451.4D78485451J856193J075211J239853J529884M41780K459336J052780M259338
$$ 478485451 480341644 481416855 482656708 484186592 484628372 487087708 488140488 492399826
1459.1D92399826K249870K674141K077294J038627J847649l52364K843056K534523
$$ 492399826 494649696 497323837 499401131 500439758 502287407 501935043 504778099 507312622
1466.8E07312622K342529K231331K368241L155174J297951K247734J752090L669968
$$ 507312622 509655151 511886482 514254723 517409897 518707848 520955582 522707672 526377640
1474.6E26377640L417740J446228K952957K794189K384453K350769K265244J671524
$$ 526377640 529795380 531241608 534194565 536988754 539373207 541723976 543989220 545660744
1482.3E45660744J938781J613427P12318J256485P63741P13234J383705r05419K8725
$$ 545660744 547599525 549212952 549925270 551181755 551945496 552658730 554042435 553137016 553165741
1491E53165741K311478J697273Q4305n22843j156997n147820N12238m01268k167321
$$ 553165741 555477219 557174492 557258797 556735954 555578957 550431137 550943375 550542107 548374786
1499.6E48374786N6916p05567q02002j021881K38457o96831p777786l715363J941948
$$ 548374786 548431702 547726135 546924133 545902252 546140709 545443878 537666092 533950729 535892677
1508.3E35892677K144547J80664Q12225j282692j306991M06570j297760p21092k655258
$$ 535892677 538037224 538217888 539030113 537747421 536440430 536847000 535549240 534828148 532172890
1517E32172890l014603J759796J735268j523934l340835L00789J755256J859436j143798
$$ 532172890 529158287 530918083 532653351 531129417 527788582 528089371 529844627 531704063 530560265
1525.7E30560265L87230O22940k39335R24225Q19321M63791l55148o06537r80034J910400
$$ 530560265 530947495 531570435 531331100 532255325 533074646 533538437 533183289 532576752 531596718 533507118
1535.3E33507118J295967P49665J768875l133316l962899J621590J129608k0370J664429
$$ 533507118 534803085 535552750 537321625 534188309 530225410 531847000 532976608 532956238 534620667
1544E34620667J430130j124802J141281L80821J025772o26716j692848J151084M11377
$$ 534620667 536050797 534925995 536067276 536448097 537473869 536847153 535154305 536305389 536716766
1552.7E36716766J90392l814507J055298K102204P78884k280197j0056495J419601
$$ 536716766 536907158 533092651 534147949 536250153 537029037 534748840 524692345 526111946
1560.4E26111946J012268J436920j374015j691247k885131k591286n05257j974449
$$ 526111946 527124214 528561134 527187119 525495872 522610741 520019455 519514198 517539749
1568.1E17539749j561699q529014j111565j143227l268661k679367l309975k287674
$$ 517539749 515978050 507449036 506337471 505194244 501925583 499246216 495936241 493648567
1575.8D93648567j3102569n05257j829071l213997l234634n445252l389168n530395
$$ 493648567 480545998 480040741 478211670 474997673 471763039 466317787 462928619 457398224
1583.5D57398224l415718n166054m707718m220276n587883l533020n465126k873268
$$ 457398224 453982506 448816452 444108734 439888458 434300575 430767555 425302429 422429161
1591.2D22429161n260658l458977l873558m738235k555695n122528k325287m713211
$$ 422429161 417168503 413709526 409835968 405097733 402542038 397419510 395094223 390381012
1599C90381012k771530l890610l453369j639519l968773j294594l670387j502342l396454
$$ 390381012 387609482 383718872 380265503 378625984 374657211 373362617 369692230 368189888 364793434
1607.6C64793434j465378r67254k760010R0904l141556m08630k078590L55339k34948
$$ 364793434 363328056 362360802 359600792 359691696 356550140 356141510 354062920 354418259 354183311
1616.3C54183311n728111K437821q52776J067390j907424Q73107o3858k150154J776162
$$ 354183311 348455200 350893021 350040245 351107635 349200211 350073318 350009460 347859306 349635468
1625C49635468m49372J994477j663476J356507M65126O88057J474342k07825K611275
$$ 349635468 349186096 351180573 349517097 350873604 351338730 352026787 353501129 353293304 355904579
1633.7C55904579k95791J048889k42234L205147J989937J035538K805748L73459K672653
$$ 355904579 355608788 356657677 356415443 359620590 361610527 362646065 365451813 365825272 368497925
1642.4C68497925P90367K675400K479477P4882K351532j143341M274597J339188L197517
$$ 368497925 369288292 371963692 374443169 374518051 376869583 375726242 380000839 381340027 384537544
1651C84537544L030854m73252j19705R20639M594994R92851K123108J472816J787682
$$ 384537544 387568398 387095146 386975441 387896080 392491074 393483925 395607033 397079849 398867531
1659.7C98867531K105064K127342L259850O69174M128380K362785K960587K963142
$$ 398867531 400972595 403099937 406359787 407028961 411157341 413520126 416480713 419443855
1667.4D19443855K353745L424644K019730N233612K279854M219703M074021K180137
$$ 419443855 421797600 425222244 427241974 432475586 434755440 438975143 443049164 445229301
1675.1D45229301K957154L842811M925003L368111M547081L057861M397774M695168
$$ 445229301 448186455 452029266 456954269 460322380 464869461 467927322 472325096 477020264
1682.9D77020264M9438L150368L550720O698608M668808L884354M178467L985557N253182
$$ 477020264 477069702 480220070 483770790 490469398 495138206 499022560 503201027 507186584 512439766
1691.5E12439766M537697M763145M510613M657020j20086M515113O607514N999069
$$ 512439766 516977463 521740608 526251221 530908241 530788155 535303268 541910782 547909851
1699.3E47909851M347916j734009O815605N286789L873253K670631K495118K344360
$$ 547909851 552257767 550523758 557339363 562626152 566499405 569170036 571665154 574009514
1707E74009514L519630M364205K311668K048225K907715L130570K594681k22054R46312
$$ 574009514 577529144 581893349 584205017 586253242 589160957 592291527 594886208 594664154 595610466
1715.6E95610466L202553J291580k719116L508110L355484J963692J546745P89184
$$ 595610466 598813019 600104599 597385483 600893593 604249077 606212769 607759514 608548698
1723.4F08548698J184349J812592J657715J287193J660576J852264p60803N43289L631478
$$ 608548698 609733047 611545639 613203354 614490547 616151123 618003387 617242584 617785873 621417351
1732F21417351L489990j263351l724251N158615M150505K034607K554550N02358M7454
$$ 621417351 624907341 623643990 619919739 625078354 629228859 631263466 633818016 634320374 634367828
1740.7F34367828M236069K789764Q20466K433776L757096L338852K763672K195587
$$ 634367828 638603897 641393661 642214127 644647903 648404999 651743851 654507523 656703110
1748.4F56703110K007293M993515K053071J528396N182114L150253K854233L305817
$$ 656703110 658710403 663703918 665756989 667285385 672467499 675617752 678471985 681777802
1756.2F81777802J518783K178269K456970K588424L301850o70243M35563L537216K008590
$$ 681777802 683296585 685474854 687931824 690520248 693822098 693151855 693587418 697124634 699133224
1764.8F99133224J899949K286682J854324j230926K151565L597565p98874k448349
$$ 699133224 701033173 703319855 705174179 703943253 706094818 709692383 708893509 706445160
1772.5G06445160J95846N030518K270279m75616K464981J083526J545029N62134n50919
$$ 706445160 706641006 711671524 713941803 713466187 715931168 717014694 718559723 719121857 718570938
1781.2G18570938J335678J786041J382828r18503M58985J988830J235047R30481J542206
$$ 718570938 719906616 721692657 723075485 722156982 722615967 724604797 725839844 726770325 728312531
1789.9G28312531L36380j55106j459808M03900L497619N81360L60718J691666J420059
$$ 728312531 728648911 728493805 727033997 727437897 730935516 731516876 731877594 733569260 734989319
1798.6G34989319K82364m32129K345276j27564O41480J464538L73307J153335K64588
$$ 734989319 735271683 734839554 737184830 737057266 737698746 739163284 739536591 740689926 740954514
1807.3G40954514M47235Q77075R25903m79507J008529J363373K64282R40171K975R84497
$$ 740954514 741401749 742278824 743204727 742725220 743733749 745097122 745361404 746301575 746304550 747289047
1816.9G47289047J21613N57098J255799K1972R93271L2806J179123Q36182k124939
$$ 747289047 747410660 747967758 749223557 749245529 750238800 750271606 751450729 752286911 750161972
1825.6G50161972N13229J769104J287613r65042k554168J586380K655487O72836O45981
$$ 750161972 750675201 752444305 753731918 752766876 750212708 751799088 754454575 755127411 755773392
1834.3G55773392O18438L09678L20587o42014R16977K68631K75421M69361J086578
$$ 755773392 756391830 756701508 757022095 756380081 757297058 757565689 757841110 758310471 759397049
1842.9G59397049L2120m542160K966385K326660k47345P2784Q23136Q33435k65274
$$ 759397049 759429169 754887009 757853394 760180054 759932709 760005493 760828629 761662064 761396790
1851.6G61396790M24041j56326O82068M94079J8769P71942r3536L02124k21405J80892
$$ 761396790 761820831 761664505 762346573 762840652 762859421 763631363 763537827 763839951 763618546 763799438
1861.3G63799438r841K19574M37774J55182J018829n79147l9368j134567o66199K074585
$$ 763799438 763789597 764009171 764446945 764602127 765620956 765041809 765002441 763867874 763201675 765276260
1870.9G65276260J211014N32227k66190L14789K07901K40936N0431J7852M76303p6980
$$ 765276260 766487274 767019501 766753311 767068100 767276001 767516937 767567368 767585220 768061523 767984543
1880.6G67984543J87378k92588M26331N3406m7913L72467k9754J220092o04171j274948
$$ 767984543 768171921 767879333 768305664 768359070 768311157 768683624 768653870 769873962 769269791 767994843
1890.2G67994843P83004O40793J22986J04141k15149p66372O91528L14636K09580L30581
$$ 767994843 768777847 769418640 769541626 769645767 769430618 768664246 769355774 769670410 769879990 770210571
1899.8G70210571M2496J52512K6550P36847j00632K3956Q0338j97296J1368k60697
$$ 770210571 770253067 770405579 770432129 771168976 771068344 771092300 771172638 770975342 770986710 770726013
1909.5G70726013n8594O4621Q35190j06277J27029R613m8065J076965j688385m39834
$$ 770726013 770667419 770732040 771567230 771460953 771587982 771597595 771549530 772626495 770938110 770498276
1919.1G70498276J120071P31888K39868j158447k51541O84662P37762l69568m2801
$$ 770498276 771618347 772350235 772590103 771431656 771180115 771864777 772602539 772232971 772190170
1927.8G72190170K91901j02921J35651J45493J1367o41632Q5984k0981L13873N8289
$$ 772190170 772482071 772379150 772514801 772660294 772671661 772030029 772116013 772095032 772408905 772467194
1937.5G72467194n61219N86167J29928L66898p76215j184539P59658N83115j63803
$$ 772467194 771905975 772492142 772622070 772988968 772212753 771028214 771787872 772370987 772207184
1946.1G72207184o75125L69720J45798q5526l4484l8758j24054l52859L08761j91421
$$ 772207184 771532059 771901779 772047577 771962051 771927567 771888809 771764755 771411896 771720657 771529236
1955.8G71529236K00577l05787l90625K53678j30386K24304l94135J37558J34278n5161
$$ 771529236 771729813 771424026 771033401 771287079 771156693 771380997 770986862 771124420 771258698 771203537
1965.4G71203537q6212p51877O8436J31225J88294j23291P9727p5989l04489K25220
$$ 771203537 771117325 770365448 770433884 770565109 770753403 770630112 770709839 770633850 770329361 770554581
1975.1G70554581L01056M80499m59976p9117M4403k96555j85394l07693K99682l0594
$$ 770554581 770855637 771336136 770876160 770797043 770841446 770544891 770359497 770051804 770351486 770320892
1984.7G70320892Q316j60980P7515m23432n63278O64292m39454p40737l6698N59769
$$ 770320892 770329208 770168228 770245743 769822311 769259033 769923325 769483871 768743134 768706436 769266205
1994.3G69266205K38342k68326j0528j75247J21536l55225J02844k34375n08956J2817
$$ 769266205 769504547 769236221 769225693 769050446 769171982 768816757 768919601 768685226 768176270 768189087
2004G68189087k90833l0441j60370M43115j73873k97776j08413m36554K77710k31476
$$ 768189087 767898254 767867813 767707443 768150558 767976685 767678909 767570496 767133942 767411652 767180176
2013.6G67180176P3852m22287m91714J52588J1596Q5526k83127L32184k81754k68097
$$ 767180176 767254028 766831741 766340027 766492615 766504211 766589737 766306610 766638794 766357040 766088943
2023.3G66088943o1492l66822k03399n69458j08643j43585M14505l4256m75311k14997
$$ 766088943 766027451 765660629 765457230 764887772 764779129 764635544 765050049 765015793 764540482 764325485
2032.9G64325485l15552K72446m63333j06964j95084m53033o8817k83127K50702J27868
$$ 764325485 764009933 764282379 763819046 763712082 763516998 763063965 762995148 762712021 762962723 763090591
2042.6G63090591j13906p24259j26724K56729p477J17493n83191m32663j98746N51834
$$ 763090591 762976685 762252426 762125702 762382431 762374954 762492447 761909256 761476593 761277847 761829681
2052.2G61829681J49460k49328j05973n70755L1815j23673o6680k95029J58233K9145
$$ 761829681 761979141 761729813 761623840 761053085 761084900 760961227 760894547 760599518 760757751 760786896
2061.9G60786896o88629L03192J55411K34527j31683j06964j7548l52631p3700k15683
$$ 760786896 760098267 760401459 760556870 760791397 760659714 760552750 760535202 760182571 760108871 759893188
2071.5G59893188K07062k83508M0665n6458k07138M50668k36282j57471k58712M2495
$$ 759893188 760100250 759816742 759857407 759800949 759593811 760044479 759808197 759650726 759392014 759434509
2081.1G59434509k85492l84979K3575o7978L99475j70593J29089j2588j77460l00522
$$ 759434509 759149017 758764038 758787613 758719635 759119110 758948517 759077606 759065018 758887558 758587036
2090.8G58587036m45251K32010k68250K6550m81796o84585l32795j9684N95704j97907
$$ 758587036 758141785 758373795 758105545 758132095 757650299 756965714 756632919 756613235 757208939 757011032
2100.4G57011032p7591l5019J02921j81809m97741r0180n8517K97088j3885j3962m90646
$$ 757011032 756933441 756898422 757001343 756819534 756321793 756231613 756173096 756470184 756456299 756442337 755951691
2111G55951691p9575K96021l55912k09732m51126Q2398l42179k93884K95029J21841
$$ 755951691 755872116 756168137 755812225 755602493 755151367 755233765 754891586 754597702 754892731 755014572
2120.7G55014572J12991j85852K16065l52707k61078k00729r9640M20151k06681J5030
$$ 755014572 755127563 754941711 755157776 754805069 754543991 754343262 754243622 754663773 754457092 754472122
2130.3G54472122j85470J28860P4616p9804n340l10822K59094j87759J1520O9733q3618
$$ 754472122 754286652 754415512 754490128 754410324 754404984 754094162 754353256 754165497 754177017 754246750 754163132
2140.9G54163132o790l6316L7536k02636M80270j36108k29416J18942J83411J85928
$$ 754163132 754156342 754120026 754157562 753954926 754435196 754299088 754069672 754188614 754372025 754557953
2150.6G54557953m74091J64566j13830J33056K61460o7597J94168L205K38647j40762
$$ 754557953 754083862 754248428 754134598 754267654 754529114 754461517 754655685 754658890 754897537 754756775
2160.2G54756775J98212j09406k56195j70059m69208K29874n5771M24804K98157J26190
$$ 754756775 754954987 754845581 754589386 754419327 753950119 754179993 754124222 754549026 754847183 754973373
2169.9G54973373R6131l69034J80588k61383k5940J85852J58157J27411O409m3030
$$ 754973373 755069504 754700470 754881058 754619675 754593735 754779587 754937744 755065155 755071564 755028534
2179.5G55028534k73972L97339j30310k37503L50723M83933j86539n24139O70471P6752
$$ 755028534 754754562 755151901 755021591 754784088 755134811 755618744 755432205 754908066 755578537 755655289
2189.1G55655289l36838K03171M76837J65787k04544J05361N6687K20184l56674l29819
$$ 755655289 755318451 755521622 755998459 756164246 755959702 756065063 756121750 756341934 755985260 755655441
2198.8G55655441K15531L60336L6316k36817K68631j69296M5319q927p7667J22223
$$ 755655441 755870972 756231308 756267624 756030807 756299438 756130142 756175461 756166534 756088867 756211090
2208.4G56211090l1738K09579m0207L64609P6752J30997Q4991k74506P4692n3329L13949
$$ 756211090 756179352 756388931 756348724 756713333 756790085 756921082 757006073 756731567 756806259 756752930 757066879
2219G57066879k30026O5994R6131p2556L88336m7760K72599m91944k04620J04980k24609
$$ 757066879 756836853 756902847 756998978 756926422 757314758 757266998 757539597 757047653 756843033 756948013 756723404
2229.7G56723404P0724k83813N39169N55420m4632m65851p1869K18201j92795j26495
$$ 756723404 756794128 756510315 757049484 757604904 757560272 757094421 757022552 757240753 757047958 756921463
2239.3G56921463m01840O1340m1122K07290L5172J9073K53983n14298M35028p6446
$$ 756921463 756519623 756580963 756539841 756747131 756782303 756801376 757055359 756541061 756976089 756899643
2248.9G56899643m48380j98745R2086O44913k94342o7673n6304K13546J57471M5776
$$ 756899643 756451263 756252518 756344604 756989517 756695175 756627502 756571198 756784744 756942215 756987991
2258.6G56987991K17514k80075o942k24762J35040j99356q6594k7542k90680L92151
$$ 756987991 757205505 756925430 756918488 756693726 756828766 756629410 756542816 756515274 756224594 756616745
2268.2G56616745j76315L13644L6011k19956l93447n16968J95999l65448M32129M90494
$$ 756616745 756440430 756754074 756790085 756570129 756176682 755659714 755855713 755490265 755922394 756412888
2277.9G56412888L13110O5842k57187l5630m09240Q5983m48837j57318j01471K9220
$$ 756412888 756725998 756791840 756534653 756499023 756089783 756175766 755726929 755569611 755468140 755497360
2287.5G55497360L79257l23562K21176k05460j8081m44870n36576n7907o38351l00446
$$ 755497360 755876617 755553055 755774231 755568771 755550690 755105820 754569244 754511337 753872986 753572540
2297.2G53572540o87790J42517M00238N17884J6098p88422K03400k96784j60904o39038
$$ 753572540 752884750 753027267 753427505 753945389 753961487 753173065 753376465 753079681 752918777 752279739
2306.8G52279739l58123o4698o49261k03095k24456Q13903l73535m06494l15323j066437
$$ 752279739 751921616 751856918 751207657 751004562 750780106 751594009 751220474 750813980 750498657 749432220
2316.4G49432220l50189r22470q5068o63070j64185j49917p67060M94461j50451n4856
$$ 749432220 749082031 748159561 748074493 747411423 747247238 747097321 746330261 746824722 746674271 746619415
2326.1G46619415r40475m68903o27746r78165j58463K40555P43180j241913o8741K43072
$$ 746619415 745678940 745210037 744582291 743604126 743445663 743686218 744429398 743187485 743118744 743361816
2335.7G43361816m77447o91300q37936j52512m78744J136932q2397k5787K05688p49588
$$ 743361816 742884369 742193069 741355133 741202621 740723877 741860809 741778412 741752625 741958313 741208725
2345.4G41208725K12707Q94318K101975R54208p22733k212371j337204K55203j56403
$$ 741208725 741421432 742315750 744417725 745371933 744649200 742436829 741099625 741354828 741198425
2354.1G41198425r68399k790069m98276K87857k60773r81674m25796N58776k328109
$$ 741198425 740230026 737439957 736941681 737229538 736968765 735987091 735561295 736120071 733791962
2362.7G33791962L29132R67407r3613P85599J410751R05075j7547Q14133P4844Q65250
$$ 733791962 734121094 735088501 734994888 735780487 737191238 738096313 738078766 738892899 738967743 739832993
2372.4G39832993R85336Q48694M62188p476P12890N8289L56750M41590N43213J91421
$$ 739832993 740818329 741667023 742129211 742121735 742834625 742892914 743249664 743691254 744234467 744425888
2382G44425888O485L02277k69928L39050j12457j32828L86734P3776j69601n68543
$$ 744425888 744432373 744734650 744464722 744803772 744691315 744558487 744945221 745018997 744849396 744280853
2391.7G44280853M0283l64227m75311l36990o78177k94724K4872K69318k92511m46167
$$ 744280853 744321136 743956909 743481598 743144608 742466431 742171707 742196579 742465897 742173386 741727219
2401.3G41727219l37296l662p3395l92761k81754m89349L0441m7073K2125l79791m91486
$$ 741727219 741389923 741386261 741312866 740920105 740638351 740149002 740179443 740132370 740154495 739774704 739283218
2411.9G39283218K01188k92969l13721p28226m41970j78376k21634j08337k98080M70962
$$ 739283218 739484406 739191437 738877716 738149490 737707520 737529144 737307510 737199173 736901093 737372055
2421.6G37372055o7139k84881n68848q23288j63879m14429k35443l67508k59171j74407
$$ 737372055 737304916 737020035 736451187 735627899 735464020 735049591 734814148 734446640 734187469 734013062
2431.2G34013062j64032j70594k47574J30616m52957m60434m34571n48324j81656N6686
$$ 734013062 733849030 733678436 733430862 733561478 733108521 732648087 732213516 731665192 731483536 731540222
2440.8G31540222j42822m76685j59530j21079L3570n87769o77795k99607m02679P934
$$ 731540222 731397400 730920715 730761185 730640106 730673676 730085907 729408112 729108505 728705826 728713760
2450.5G28713760o04629o10809m77372j99737L14865J7319j79367o00815m41513o65207
$$ 728713760 728109131 727498322 727020950 726821213 727136078 727153397 726974030 726373215 725931702 725266495
2460.1G25266495l88565q164l58200k51465l07617j76544l31421K4262j42136n75714
$$ 725266495 724877930 724869766 724511566 724260101 723952484 723775940 723444519 723468781 723326645 722750931
2469.8G22750931o24771q15583j87301l98636k94953k21939n15594l24936k16064l9444
$$ 722750931 722126160 721310577 721123276 720724640 720429687 720207748 719692154 719367218 719151154 719111710
2479.4G19111710m32206o42318r14078m30527l86581o23551J57929R6435O8741m88128
$$ 719111710 718679504 718037186 717123108 716692581 716306000 715682449 715840378 715936813 716005554 715517426
2489.1G15517426m22135k56195r13162p34787n81665m62265n59693k82821j00937J84708
$$ 715517426 715095291 714839096 713925934 713191147 712609482 712147217 711587524 711304703 711203766 711388474
2498.7G11388474k57874q03146O5918n61371q05664o74591o50406M5471k8687l31115
$$ 711388474 711130600 710327454 710393372 709832001 709026337 708351746 707701340 707746811 707718124 707387009
2508.3G07387009q48694m93317p4158m5852l10135q22907p94525o15844j68610j84097
$$ 707387009 706538315 706044998 705970840 705924988 705614853 704791946 703997421 703381577 703212967 703028870
2518G03028870J02157k8534k31323j19400o48346n83496o95343n11780m18320m91027
$$ 703028870 703131027 703102493 702871170 702751770 702103424 701519928 700824585 700312805 699894485 699403458
2527.6F99403458n80979o32858K8686m8904j3504L2730o7978o68564j094894o49948
$$ 699403458 698822479 698189621 698218307 698169403 698155899 698188629 698120651 697452087 696357193 695707245
2537.3F95707245m97284l9749m87671m96292l0594M9362J05896m09927k58408p11594
$$ 695707245 695209961 695170212 694682541 694186249 694155655 694205017 694310913 693900986 693642578 692930984
2546.9F92930984r49859n92728m93393m67224l02658M1733m73023M7913J49918m14505
$$ 692930984 691981125 691388397 690895004 690427780 690125122 690166855 689693832 689741745 689891663 689477158
2556.6F89477158m72184q58001m75693o13785o90155k84653j24588j06125k34832k16675
$$ 689477158 689004974 688146973 687671280 687057495 686367340 686082687 685958099 685851974 685617142 685400467
2566.2F85400467l50800k20947k58331m97742j005478q14667j22299n3482j42288n71213
$$ 685400467 685049667 684828720 684570389 684072647 683067169 682252502 682130203 682076721 681934433 681363220
2575.9F81363220r5444J84174k89154m97055o19507q20618p22122J8997m79431o19659
$$ 681363220 681267776 681451950 681162796 680665741 680046234 679225616 678503494 678522491 678043060 677423401
2585.5F77423401m5929J62430j0910p42035k42005k66037o62460p49741r64050m59976
$$ 677423401 677377472 677539902 677528992 676786957 676544952 676278915 675616455 674866714 673902664 673442688
2595.1F73442688j78452k48870k49710J44882k45514n78003m30603m01917l17688q56323
$$ 673442688 673264236 673015366 672765656 672910538 672665024 672087021 671656418 671254501 670936813 670080490
2604.8F70080490n43671m51049l53012q8349m47082l76664o46743m84467n59234o26069
$$ 670080490 669536819 669085770 668732758 668644409 668197327 667820663 667173920 666689453 666130219 665504150
2614.4F65504150m68673q03452o49872k73590j2512m05426k77710j81351m63104n86471
$$ 665504150 665035477 664232025 663582153 663308563 663296051 662890625 662612915 662431564 661968460 661381989
2624.1F61381989j097260p82013l30582j39923n25665p43408j34659j45721m06571
$$ 661381989 660284729 659502716 659172134 659032211 658506546 657763138 657628479 657482758 657076187
2632.8F57076187l11661l14483r64432p22427r3842m23126j010132j052094l60870
$$ 657076187 656764526 656450043 655485611 654763184 654669342 654246216 653236084 652183990 651823120
2641.4F51823120q9188N6611l59574n41229l87268o93436n93185o48651m39530n63583
$$ 651823120 651733932 651790543 651430969 650889740 650502472 649809036 649215851 648567200 648127670 647564087
2651.1F47564087m53568k13928k92587k43301o18287k92358o01959n64804l03803p04574
$$ 647564087 647110519 646896591 646604004 646360703 645742416 645450058 644848099 644283295 643979492 643274918
2660.7F43274918k75956n72433p03659k90833J98212k5558m68750k31858o08444l69339
$$ 643274918 642998962 642426529 641722870 641432037 641630249 641604691 641135941 640904083 640295639 639926300
2670.4F39926300k77519n47638l82538k07901m09927o20995j63994k70309l32565k97509
$$ 639926300 639648781 639101143 638718605 638510704 638100777 637479782 637315788 637045479 636712914 636415405
2680F36415405l33137n97611o63032l64342o89011k04162j44882l66135k53410l19291
$$ 636415405 636082268 635484657 634821625 634457283 633768272 633564110 633419228 633053093 632799683 632480392
2689.6F32480392k66838p75604n29060j97449j25122k51617o16684l89939P0343L42636
$$ 632480392 632213554 631437950 630908890 630711441 630586319 630334702 629718018 629328079 629398422 629741058
2699.3F29741058l95126o74820k82860l3455m33502j097107p88078m30985j26190j93710
$$ 629741058 629345932 628671112 628388252 628354797 627921295 626824188 626036110 625605125 625478935 625285225
2708.9F25285225K3346o5308m18167j13067n00641n07203l15628m34265n39818r3040
$$ 625285225 625308571 625243263 624825096 624712029 624211388 623704185 623388557 622954292 622414474 622321434
2718.6F22321434o10m49219r995l10669m26178l12385j10397Q5868l32489k68974n47371
$$ 622321434 622320824 621871605 621861610 621550941 621124763 620812378 620701981 620787849 620455360 620186386 619639015
2729.2F19639015k23312j29852L8681J22032o26717k59018l85361l19404k90260n02015
$$ 619639015 619415703 619285851 619324532 619446564 618819847 618560829 618175468 617856064 617565804 617063789
2738.8F17063789k03323k86674O0806J64490j11542n56107l21007k3346j90086j3237
$$ 617063789 616860466 616573792 616634598 616799088 616687546 616131439 615810432 615787086 615597000 615583763
2748.5F15583763k327j21116q56095o24924K1553K17896j4191j075744p65305j07880
$$ 615583763 615581436 615460320 614604225 613979301 614000854 614218750 614204559 613128815 612363510 612255630
2758.1F12255630K46430J31111l64265j78337j87264l88222l29895j04217k95563k08015
$$ 612255630 612502060 612633171 612268906 612090569 611903305 611515083 611185188 611080971 610785408 610577393
2767.8F10577393m86260n30167J00098l02429l62129l10631k21367l87421o57920m47617
$$ 610577393 610091133 609560966 609661064 609358635 608996506 608685875 608464508 608077087 607419167 606971550
2777.4F06971550n80292k27203l28941m29192l99132l79753m6234l81699k88315j98631
$$ 606971550 606391258 606164055 605835114 605405922 605006790 604627037 604580803 604199104 603910789 603712158
2787F03712158n71976p77931k79083j7967p03163r53331n16587M6769m16260p92923
$$ 603712158 603140182 602362251 602083168 602065201 601362038 600408707 599892120 599938889 599522629 598729706
2796.7E98729706m69170m75502p22084n67894l88794q57734m99230n56488q13446l42979
$$ 598729706 598260536 597785034 597062950 596495056 596106262 595248528 594749298 594192810 593379364 593036385
2806.3E93036385n16549o43959m79927k60849q99429j159477q94737r58443n19600
$$ 593036385 592519836 591875877 591395950 591135101 590235672 589076195 588181458 587223015 586703415
2815E86703415n26543n60531n15480m86641o03485o03180r07708j279563n25589q06618
$$ 586703415 586176872 585616341 585100861 584614220 584010735 583407555 582499847 581220284 580694695 579888077
2824.7E79888077p30171o61164j128845m66232p40433r09920m99840n30319r88312
$$ 579888077 579157906 578496742 577367897 576901665 576161232 575251312 574751472 574221153 573232841
2833.3E73232841j211738j092110j002159p26395j292114j489448j203232j132202
$$ 573232841 572021103 570928993 569926834 569200439 567908325 566418877 565215645 564083443
2841.1E64083443j221924j409493j433715j908646j889916j631889j817551k325973
$$ 564083443 562861519 561452026 560018311 558109665 556219749 554587860 552770309 550444336
2848.8E50444336j767807j102905j683770j216049r07058o61316q2589j25923k99453
$$ 550444336 548676529 547573624 545889854 544673805 543766747 543105431 543022842 542896919 542597466
2857.4E42597466k96784j51100n50270p7439J68458k93618o72111r25370n54542n59998
$$ 542597466 542300682 542149582 541599312 541521873 541690331 541396713 540724602 539799232 539244690 538684692
2867.1E38684692k16369r18160j579933p53364k69890K2735o90536j154556q28209
$$ 538684692 538468323 537550163 535970230 535216866 534946976 534969711 534279175 533124619 532296410
2875.8E32296410l10593j80397m70696m25872j057320j276588q64563l51181n04952
$$ 532296410 531985817 531805420 531334724 530908852 529851532 528574944 527710381 527359200 526854248
2884.4E26854248j011009p10678q12950r56192q11425p31048j157875j180725q70934
$$ 526854248 525843239 525132561 524319611 523363419 522551994 521820946 520663071 519482346 518611412
2893.1E18611412j047859p01409o56967o65321p58362p09114l20587k51427k77977
$$ 518611412 517563553 516862144 516205177 515539856 514781494 514072380 513751793 513500366 513222389
2901.8E13222389r25598q63609p15065q99468o58912p75643p28760o36024o34575j056747
$$ 513222389 512296791 511433182 510718117 509818649 509159737 508384094 507655334 507019310 506384735 505327988
2911.4E05327988j458588j442909j409455j232185j184196j238213j207314q32901
$$ 505327988 503869400 502426491 501017036 499784851 498600655 497362442 496155128 495322227
2919.2D95322227r33876j122016r76601p30515k6703j68304q12912p10220Q1253M27780
$$ 495322227 494388351 493266335 492289734 491559219 491532516 491364212 490551300 489841080 489922333 490350113
2928.8D90350113L77006J76545j60027j5259l37982L4256N32265L06740N59921N57861
$$ 490350113 490727119 490903664 490743637 490728378 490390396 490424652 490956917 491263657 491823578 492381439
2938.5D92381439M95072M31671O16302P46422O89926Q50678P43103L92799J96571O31943
$$ 492381439 492876511 493308182 493924484 494670906 495360832 496211510 496954613 497347412 497543983 498175926
2948.1D98175926O67534O01616L44200K73209P98683J54114K59208O30989K48795M78325
$$ 498175926 498843460 499445076 499789276 500062485 500861168 501015282 501274490 501905479 502154274 502632599
2957.7E02632599N05485L20244J14556M05502J089592Q88328L09945O60934O68869
$$ 502632599 503138084 503458328 503572884 503978386 505067978 505956306 506266251 506927185 507596054
2966.4E07596054J24550L53165P38411R65232O69747P47146J081658Q14056O19126
$$ 507596054 507720604 508073769 508812180 509777412 510447159 511194305 512275963 513090019 513709145
2975.1E13709145M15535L64723K76413M70962M68102K44980K03285l0403K38495K16140
$$ 513709145 514124680 514489403 514765816 515236778 515704880 515949860 516153145 516122742 516361237 516577377
2984.7E16577377O0692K14195K09809K05269K61039J62888k8725j93443o60362m80194
$$ 516577377 516638069 516852264 517062073 517267342 517528381 517691269 517662544 517469101 516808739 516328545
2994.4E16328545l36228k01645j36795l95736L32107N0392n76172o16722o69174q08678
$$ 516328545 515992317 515790672 515653877 515258141 515590248 515640640 515064468 514447746 513778572 512969894
3004E12969894r71450r8648J640l94554p20520o61354j40419k73552l25775p81327
$$ 512969894 511998444 511899796 511901436 511506882 510786362 510125008 509984589 509711037 509385262 508603935
3013.7E08603935q73565q05474n60798n50347r93118l01247k63557n41001o99539p58400
$$ 508603935 507730370 506924896 506364098 505813751 504820633 504519386 504255829 503714828 503015289 502256889
3023.3E02256889o50329p50733m99801p92160p43409n86090o33964j054840j197891
$$ 502256889 501606560 500855827 500356026 499563866 498820457 498234367 497600403 496545563 495347672
3032D95347672l16391m19808n47752o76117r03664j019363r77326o20613j004410r64393
$$ 495347672 495031281 494611473 494063721 493387604 492483940 491464577 490487251 489866638 488862228 487897835
3041.6D87897835p60079n05180l16086n43098p91970j072654p04689q84362r03816
$$ 487897835 487137756 486632576 486316490 485773392 484981422 483908768 483204079 482319717 481415901
3050.3D81415901o97479j061440q56857q11233o77147l09105o32591j103249j090202
$$ 481415901 480718422 479656982 478800125 477988892 477311745 477002640 476370049 475266800 474176598
3059D74176598p86210o12182j016045o74286N1613p16133j131897q55713p27272o96449
$$ 474176598 473390388 472778206 471762161 471087875 471139488 470423355 469291458 468435745 467708473 467012024
3068.6D67012024n34363p51762j192131k91252m26217j131401q74519o33278n68580
$$ 467012024 466477661 465725899 464533768 464242516 463816299 462684898 461810379 461177101 460608521
3077.3D60608521n05410Q3885o18095j056328q02688r17168l16048m60548r05037j196136
$$ 460608521 460103111 460186996 459568901 458512573 457709885 456792717 456476669 456016121 455111084 453914948
3087D53914948p08504l33710p18956o09131n81589k70385r59626j586837j075592n82314
$$ 453914948 453206444 452872734 452153778 451544647 450963058 450692673 449733047 448146210 447070618 446488304
3096.6D46488304j97677n59693n28068m91639o57692o37283o49681o03714j096573
$$ 446488304 446290627 445730934 445202866 444711227 444053535 443416252 442766571 442162857 441066284
3105.3D41066284r93881m70467n89637o43235n48820j061745r79385k84538n00374
$$ 441066284 440072403 439601936 439012299 438369064 437820244 436758499 435779114 435494576 434994202
3114D34994202q04520p20177o17637j145554j081200l84025m03023o14204j184693
$$ 434994202 434189682 433469505 432851868 431706314 430625114 430241089 429838066 429223862 428039169
3122.6D28039169r50432l43856m88549r17663n91278l51143j289253j139298q73451
$$ 428039169 427088737 426744881 426256332 425338669 424747391 424396248 423106995 421967697 421094246
3131.3D21094246q01125n43403n59807n21355j049843p27996m35524o22216r95674
$$ 421094246 420293121 419749718 419189911 418668556 417618713 416890717 416455193 415832977 414837303
3140D14837303j282768q81729q36296n85785o61469m68368k91291m94384q30994j370926
$$ 414837303 413554535 412672806 411836510 411250725 410589256 410120888 409829597 409335213 408504219 407133293
3149.6D07133293n19218l92380o36978p79343j417312j251679p71484o4850n58014
$$ 407133293 406614075 406221695 405584717 404805374 403388062 402136383 401364899 401300049 400742035
3158.3D00742035j213837q95881m68445n34859j122475r12933r58099j011734q06389
$$ 400742035 399528198 398632317 398163872 397629013 396506538 395593605 394635506 393623772 392817383
3167C92817383q69293o92711j16387j4305q43048j049805j314087j205101n09300l64303
$$ 392817383 391948090 391255379 391138992 391124687 390281639 389231834 387917747 386712646 386203346 385839043
3176.6C85839043o16150p08504n28641r36241o11801j049881j500397o87065p98759
$$ 385839043 385222893 384514389 383985748 383049507 382437706 381387825 379887428 379200363 378401604
3185.3C78401604m57688n72242o40946m58031q09593o94847n81589l62701r58786j224251
$$ 378401604 377943916 377371674 376730728 376272697 375463104 374768257 374186668 373823967 372865181 371640930
3195C71640930j156845q67500o16150r80339j39084n27039r46846l24478m12826m09622
$$ 371640930 370484085 369616585 369000435 368020096 367881012 367353973 366407127 366082649 365669823 365260201
3204.6C65260201r28269j264839j026497o29616o52046m19769j02196m95567k68860
$$ 365260201 364331932 363067093 362040596 361410980 360758934 360339165 360236969 359741402 359472542
3213.3C59472542o73332j178093o68106m35257p47414r64317r35593r56879m18090
$$ 359472542 358799210 357621117 356953011 356517754 355770340 354806023 353870430 352913551 352495461
3222C52495461j25618j36109m02984r26514q14629m93316l87230q46253p25326k48719
$$ 352495461 352369843 352233734 351830750 350904236 350089607 349596291 349209061 348362808 347637482 347388763
3231.6C47388763n10253j072159r82209k82173p70302q87031k81754m15039o64291
$$ 347388763 346878510 345806351 344824142 344541969 343771667 342884636 342602882 342187843 341523552
3240.3C41523552j008759o86493j16462q9722k64854n45349n47181m59594o53534p56874
$$ 341523552 340514793 339828300 339711838 339622116 339357262 338811913 338264732 337805138 337151604 336394730
3249.9C36394730p64008n30777J10779j33972p51458o01997k92396n43137q06656l80020
$$ 336394730 335630722 335099945 335210724 335076752 334325294 333723297 333430901 332887764 332081108 331701088
3259.6C31701088m04015l48167l08571o34766p21359n84755Q9302j76506o00128m93240
$$ 331701088 331297073 330948906 330640335 330005569 329284210 328699455 328788757 328612251 328012123 327518883
3269.2C27518883o33812o18859k92625J38207q21801j296615p16324l07465R6283k21214
$$ 327518883 326885071 326266212 325973587 326111794 325289993 323993378 323277054 322969589 323065872 322844658
3278.9C22844658J28403K4528n41878n80063r86366m32091q7699m00982k63710l77217
$$ 322844658 322973061 322997589 322455711 321875648 320889282 320457191 320369492 319968510 319704800 319327583
3288.5C19327583m13360j30177l40862o35910m07353m70028n74550m42429m04453m85306
$$ 319327583 318914223 318784046 318443184 317807274 317399921 316929893 316355343 315912914 315508461 315023155
3298.2C15023155l94821j52512m12101n27115k72427J6155j94015p56702m58127K881
$$ 315023155 314628334 314475822 314063721 313536606 313264179 313280334 313086319 312329617 311871490 311874371
3307.8C11874371k22474j068992j175575l06454j77441j33419k28023j037846j011105
$$ 311874371 311651897 310582905 309407330 309100876 308923435 308790016 308561993 307524147 306513042
3316.5C06513042m29744k48642k66381l42559m55761q34942Tm21372l36761n02892
$$ 306513042 306083298 305834656 305568275 305225716 304769955 303935013 303100071 302678699 302341938 301839046
3326.1C01839046q31317p91989p08809p10430m88567o37436o06938l85818p22923r54705
$$ 301839046 301007729 300215740 299506931 298796501 298307934 297670498 297063560 296677742 295954819 295000114
3335.8B95000114n54523m98467q14495r79404j056328n59215k53659l41434m62208
$$ 295000114 294445591 293947124 293132629 292153225 291096897 290537682 290284023 289942589 289480381
3344.4B89480381o55727n64556n52063o05088o86188l02238j16310p17812q37364n52578
$$ 289480381 288824654 288260098 287708035 287102947 286416759 286114521 285998211 285280399 284443035 283890457
3354.1B83890457l27511n46245m05426J0090l26252n47944m46395l82595n93739n08766
$$ 283890457 283562946 283016701 282611275 282621365 282295113 281747169 281300774 280918179 280324440 279815674
3363.7B79815674l08972l50380l16219m85172k36511Q1977m30603j003932k64740J25427
$$ 279815674 279506702 279156322 278840103 278354931 278118420 278200397 277769794 276765862 276501122 276626549
3373.4B76626549n52902m38138l94306M673J66207n90573m93717m01935l18337M4651
$$ 276626549 276073647 275635509 275241203 275245876 275412083 274821510 274327793 273925858 273607521 273652172
3383B73652172j99127n04627q4343M6768l28961j57089j46332k01206k3021l86372
$$ 273652172 273453045 272948418 272864075 272910843 272581882 272424793 272278461 272077255 272054234 271667862
3392.7B71667862o24847r1973j53827k75097K87876J36299k20165m53492k06470j70403
$$ 271667862 271043015 270951042 270797215 270522118 270809994 270946293 270726128 270272636 270066166 269895763
3402.3B69895763m40521N9757j65042p6752P6866m4613J98441k31572J57795J76087
$$ 269895763 269455242 269514999 269349957 269273205 269350071 269305458 269503899 269272327 269430122 269606209
3412B69606209n27725j164L30525j05877q0147m082j07117L01114M64744N92194K17781
$$ 269606209 269078484 269077320 269407845 269301968 269221821 269217739 269110622 269411736 269876480 270468674 270686455
3422.6B70686455k23732K2735r0808L34339M86164J25274P0420Q7146j28345j37882
$$ 270686455 270462723 270485458 270394650 270728989 271215153 271340427 271410847 271497993 271369648 271231766
3432.2B71231766O65931O48079L76988j5755q8692L53146J98326N46761N88989N47352
$$ 271231766 271897697 272545776 272922764 272907009 272818317 273171463 273369789 273916550 274505539 275052891
3441.8B75052891Q7929J37844O56528J5144L66211L70636N25341O11668K8305N22080
$$ 275052891 275140820 275278664 275935192 275950336 276316547 276687183 277212524 277824192 277852497 278374577
3451.5B78374577O39724P02973K15034K67792Q95176N20820O80066M02488K35558N40180
$$ 278374577 279014301 279717274 279932308 280200100 281095276 281616096 282296162 282698650 282934208 283474388
3461.1B83474388M63562P39403R30443P65190Q65249Q43029K14444L97091J104660
$$ 283474388 283937950 284677353 285607796 286372986 287238235 288081264 288295708 288692799 289797459
3469.8B89797459P17582r4967N63183J017742K28653J31073O67839J549626J140385
$$ 289797459 290515041 290420074 290983257 292000999 292229652 292360725 293028564 294578190 295718575
3478.5B95718575L89995P42092Q63152N17235k25773P85007J299954O11972P00455
$$ 295718575 296108570 296850662 297713814 298231049 298005276 298790283 300090237 300702209 301402664
3487.2C01402664O10905Q18214P02420R57622J169815O82545N45120O68373J012421
$$ 301402664 302013569 302831783 303534203 304491825 305661640 306344185 306889305 307557678 308570099
3495.8C08570099P91988Q10528Q36754Q25195Q50582J014691R12552k30675O76536
$$ 308570099 309362087 310172615 311009369 311834564 312685146 313699837 314612389 314381714 315058250
3504.5C15058250J612206J301422J005154Q71334K33650Q5106J852074J426353J003456
$$ 315058250 316670456 317971878 318977032 319848366 320082016 320167122 322019196 323445549 324449005
3513.2C24449005J050148K43721J000939J202011J099052Q93288N81169R32617J291084
$$ 324449005 325499153 325742874 326743813 327945824 329044876 329938164 330519333 331451950 332743034
3521.9C32743034Q79631J43547J323433J766663Q81081M36897J352501J634598J215896
$$ 332743034 333622665 333766212 335089645 336856308 337737389 338174286 339526787 341161385 342377281
3530.6C42377281Q26988L12081J547432J647415J459236J050720J89209J215019J334000
$$ 342377281 343204269 343516350 345063782 346711197 348170433 349221153 349410362 350625381 351959381
3539.2C51959381J563454J057472J247177J542130P27234J068534J375351J865616
$$ 351959381 353522835 354580307 355827484 357369614 358096848 359165382 360540733 362406349
3547C62406349O96030J713104J917801J161385J796646K60048J645584J442413J346245
$$ 362406349 363102379 364815483 366733284 367894669 369691315 369951363 371596947 373039360 374385605
3555.6C74385605J821823J041489K123375Q72230J252442J463737J721725J821366
$$ 374385605 376207428 377248917 379372292 380244522 381496964 382960701 384682426 386503792
3563.4C86503792J031074L435860J143570O92749R95560J112098L565712J462860J724244
$$ 386503792 387534866 390970726 392114296 392807045 393802605 394914703 398480415 399943275 401667519
3572D01667519K052612J672439J607132J707917J878166Q57963K581025J912269J104508
$$ 401667519 403720131 405392570 406999702 408707619 410585785 411443748 414024773 415937042 417041550
3580.7D17041550J834411J929283J941300J518516L735657K025795o8588J692161N96123
$$ 417041550 418875961 420805244 422746544 424265060 428000717 430026512 429957924 431650085 432246208
3589.4D32246208L129578L057518K540207J651726J931610L334198Q04443K561035
$$ 432246208 435375786 438433304 440973511 442625237 444556847 447891045 448695488 451256523
3597.1D51256523L185616J898079K809333J085472J665268K819481J848069K249069
$$ 451256523 454442139 456340218 459149551 460235023 461900291 464719772 466567841 468816910
3604.8D68816910L305206K409630N30014L758049J330528J073227N643387K75002k26250
$$ 468816910 472122116 474531746 475061760 478819809 480150337 481223564 486866951 487141953 486915703
3613.5D86915703N091972J821671L792152L660545J116639J772537Q35724K775459
$$ 486915703 492007675 493829346 497621498 501282043 502398682 504171219 505006943 507782402
3621.2E07782402L515129L350411L229370L088531K668724L313751N941849q39920
$$ 507782402 511297531 514647942 517877312 520965843 523634567 526948318 532890167 532050247
3628.9E32050247o327438N773392O005706M966126J627693L91960L405380M066544
$$ 532050247 525722809 531496201 537501907 542468033 544095726 544487686 547893066 551959610
3636.6E51959610L060608J143646J960297L392944L504944J781769J696434L659668
$$ 551959610 555020218 556163864 558124161 561517105 565022049 566803818 568500252 572159920
3644.4E72159920L792572M703445l06854j303940N142861J173706L27186J613960N530053
$$ 572159920 575952492 580655937 580349083 579045143 584188004 585361710 585688896 587302856 592832909
3653E92832909M459457L982010M402046m649277L574715N463867K190514J987457Q10623
$$ 592832909 597292366 601274376 605676422 601027145 604601860 610065727 612256241 614243698 615054321
3661.7F15054321K760620J854287K242393K079239J358833M511032J961098M01116
$$ 615054321 617814941 619669228 621911621 623990860 625349693 629860725 631821823 632222939
3669.4F32222939j96572m114685M474602P618904O397781n370483j1693687O704559
$$ 632222939 632026367 627911682 632386284 640005188 646402969 641032486 629338799 636043358
3677.1F36043358Q189659M541092j907425R06830L345489K146073J946335J352005
$$ 636043358 644233017 648774109 646866684 647773514 651119003 653265076 655211411 656563416
3684.9F56563416j3123K960281N656357p163009k175293O546173l867493Q51212M666061
$$ 656563416 656550293 659510574 665166931 658003922 655828629 662374802 658507309 659358521 664024582
3693.5F64024582J081543J898117J102295J21231J272430P14798K442398K591553m667129
$$ 664024582 665106125 667004242 668106537 668227768 669500198 670214996 672657394 675248947 670581818
3702.2F70581818j050721M785843J376953k86331N41230K761840K873154o046143L357239
$$ 670581818 669531097 674316940 675693893 675407562 675948792 678710632 681583786 675537643 678894882
3710.9F78894882K563172j0883179N385742M952774L37906J277161K379379P65304
$$ 678894882 681458054 670574875 675960617 680913391 681251297 682528458 684907837 685673141
3718.6F85673141k654113J334839M913253m037399m004822M714051N21774j026840
$$ 685673141 683019028 684353867 689267120 685229721 681224899 685938950 686460724 685433884
3726.3F85433884j487885J846924L738556N69992M624863l038407n485382P563400
$$ 685433884 683945999 685792923 689531479 690101471 694726334 691687927 686202545 693765945
3734F93765945k080993p701035K524491K691879P5073K821961L224563l351440L133697
$$ 693765945 691684952 683983917 686508408 689200287 689275360 692097321 695321884 691970444 695104141
3742.7F95104141Q991089j5670471j0353470J2399902N747605L921509m201661o836395
$$ 695104141 704095230 688424759 678071289 690471191 696218796 700140305 695938644 689102249
3750.4F89102249R934540o060715m530258O210785M180832K989807m335938K109757
$$ 689102249 699036789 692976074 688445816 694656601 698837433 701827240 697491302 699601059
3758.2F99601059L567657p470855n32074M125824J687774N85328K885742k867279l543930
$$ 699601059 703168716 695697861 695165787 699291611 700979385 701564713 704450455 701583176 698039246
3766.8F98039246L605957M192276p77741p738724K499695K785874N16433J146775l95890
$$ 698039246 701645203 705837479 705059738 697321014 699820709 702606583 703123016 704269791 703873901
3775.5G03873901P47147L4866K043915j081238n748062L438416J977386Q56400J159744
$$ 703873901 704621048 704655914 706699829 705618591 699870529 703308945 705286331 706142731 707302475
3784.2G07302475k930069o41022J493759O95954K93884M81644Q1177j70136P42493
$$ 707302475 704372406 703731384 705225143 705921097 706214981 706696625 706777802 706607666 707350159
3792.9G07350159K5940J160354K110367l961868k586441K604065L644104N064315p226257
$$ 707350159 707376099 708536453 710646820 706684952 704098511 706702576 710346680 715410995 708184738
3801.5G08184738r442215N091248L306885L859252K970353r604264j557083N140305
$$ 708184738 698742523 703833771 707140656 710999908 713970261 704365997 702808914 707949219
3809.3G07949219J649399L63311L73993m93316J479950M404983m297714j0299149O089020
$$ 707949219 709598618 709961929 710335922 709842606 711322556 715727539 711429825 701130676 707219696
3817.9G07219696M283142J637268j460113j3688889M410324N672379J739425K512894
$$ 707219696 711502838 713140106 711679993 697991104 702401428 708073807 709813232 712326126
3825.7G12326126j87683l027039Q41675J288376K119904J1291o833877L406829N503235
$$ 712326126 712138443 709111404 709953079 711241455 713361359 713372650 706538773 709945602 715448837
3834.3G15448837n546951Q36487O245346j0487518k475739P993088m428024M32052
$$ 715448837 709901886 710738373 716983719 706496201 704020462 712013550 707585526 708017578
3842.1G08017578O115189k326737k561111K320175R01871O42242J868057o66046K010041
$$ 708017578 714132767 711806030 709244919 711565094 712466965 713109207 714977264 714311218 716321259
3850.7G16321259L462905o636047j0147j4490891L987809R523697j216660k15607K376557
$$ 716321259 719784164 713148117 713137970 698647079 702634888 712158585 710941925 710726318 713102875
3859.4G13102875J808014Q08868n672989J335144M748383p008438k860413N340576
$$ 713102875 714910889 715719757 710046768 711381912 716130295 709121857 706261444 711602020
3867.1G11602020M654618K520217r793472n153198N579376N900650J409836r655914
$$ 711602020 716256638 718776855 708983383 703830185 709409561 715310211 716720047 707064133
3874.8G07064133K098770M060592l04489K723847L446426o097793n121537N210648
$$ 707064133 709162903 713223495 712919006 715642853 719089279 712991486 707869949 713080597
3882.6G13080597J286392J628494K281800j1530457K374420M059143J218796L116455
$$ 713080597 714366989 715995483 718277283 706746826 709121246 713180389 714399185 717515640
3890.3G17515640j523514n823135J112366K653656r81369J465759O80389Q77152J077270
$$ 717515640 715992126 710168991 711281357 713935013 712953644 714419403 715099792 715976944 717054214
3898.9G17054214p071685M963913Q02612n452423L388061l351974o50635R68781R01336
$$ 717054214 709982529 714946442 715749054 710296631 713684692 710332718 709682083 710650864 711552200
3907.6G11552200K108918O59332O04019m65927K23236J78604o39801M68369J090087
$$ 711552200 713661118 714320450 714924469 714458542 714681778 714860382 714220581 714688950 715779037
3916.3G15779037k732772j834641L553848j113205k147445K221527N47867K24075j992493
$$ 715779037 713046265 711211624 714765472 713652267 711504822 713726349 714274216 714498291 712505798
3925G12505798j673050J716996J201400Q51365j010437j059037N46723j977082M11759
$$ 712505798 710832748 712549744 713751144 714602509 713592072 712533035 713079758 711102676 711514435
3933.7G11514435K299957k96326K0752L04337l38898j76010K33917J873246k35901
$$ 711514435 713814392 713518066 713538818 713843155 713504257 713328247 713562164 715435410 715199509
3942.3G15199509m136200j57776J642608J211091K80380j906815R71909J70212j503525
$$ 715199509 711063309 710905533 712548141 713759232 714039612 712132797 713104706 713274918 711771393
3951G11771393J588669K42233l85971j04599k63062J0758k84271J105804j8387j98898
$$ 711771393 713360062 713602295 713216324 713111725 712848663 712859421 712575150 713680954 713662567 713463669
3960.7G13463669n2796j349792M12750K51389j26114R31091N55802N0659n21775n58090
$$ 713463669 713410873 712061081 712473831 712725220 712599106 713530197 714085999 714136658 713614883 713056793
3970.3G13056793J25275n26276k80304O20194l70255k37350J18103J95923M05044l8376
$$ 713056793 713182068 712655792 712375488 712995682 712625427 712388077 712506180 712702103 713107147 713068771
3980G13068771n8899L60795P31735l64609k80685l6927n22918M5013J59454P53022
$$ 713068771 713009872 713370667 714102402 713737793 713457108 713420181 712897263 712942276 713101730 713854752
3989.6G13854752q7967l55149L8300p76901r0027L48511M82254l4943j90582K62909
$$ 713854752 713766785 713411636 713449936 712673035 712583008 712931519 713413773 713378830 713188248 713451157
3999.2G13451157K48413
$$ 713451157 713699570
4000.2G13699570
$$ 713699570
##END=$$ End of the data block
