##TITLE=$$ Begin of the data block
##JCAMP-DX=5.00 $$ ACD/SpecManager v 10.08
##SPECTROMETER/DATA SYSTEM=Varian
##DATE=14 Jan 2013 10:41:16
##DATA TYPE=INFRARED SPECTRUM
##DATA CLASS=XYDATA
##ORIGIN=
##OWNER=
##NPOINTS=3735
##FIRSTX=399.26403809
##LASTX=4000.35498047
##MAXX=4000.35498047
##MINX=399.26403809
##MAXY=71.29714203
##MINY=30.73409653
##XFACTOR=1.0000000000
##YFACTOR=0.000000100000000
##FIRSTY=52.72465515
##DELTAX=0.96440572
##XUNITS=1/CM
##YUNITS=TRANSMITTANCE
##XYDATA=(X++(Y..Y))
399.3 527246552 511685448 491104546 491403618 493346710 499186859 502557945 499853516 493229904
407 493229904 495673141 495160637 490402565 501505547 503372688 496518097 492410240 487202148 486156540
415.7 486156540 492759438 500666656 495343857 497074203 499124947 493652573 487433853 486497536 493316460
424.3 493316460 496991310 497364731 492158241 488433189 490124054 494243698 496904716 491369972 483860512
433 483860512 479385185 486877747 493695107 490372581 490581207 487549324 485378685 489774399 494268303
441.7 494268303 493357964 492246437 496488647 496771049 492545357 486975784 484604492 486363983 487756424
450.4 487756424 487649879 486168594 485299454 486306801 486388779 485306091 484362450 484153175 485145187
459.1 485145187 486642265 486018372 485066528 489769897 490943604 486205101 485639305 483342171 480973053
467.7 480973053 485270653 486553955 484393311 481394577 481987686 485733490 485327835 483704453 481990433
476.4 481990433 480736008 478867760 477213173 475604858 474620209 476360588 478066101 476806030 475637321
485.1 475637321 478584976 480363617 476665878 473782921 475240326 475812988 473842888 475093231 478101654
493.8 478101654 477718620 475981560 475285110 473737068 474057503 475780640 474532280 472913933 471310349
502.5 471310349 470696907 471422920 471304741 471097107 472104874 473023338 472297363 471205978 470381508
511.1 470381508 469040070 467585716 467556496 468273087 467536812 466917610 466293526 466311340 467203789 464938507
520.8 464938507 461537018 461772194 462990074 461970177 462879829 464396362 463778381 462860832 462428131
529.5 462428131 462963409 462396851 461400108 460561485 459142761 458216896 460179482 462993736 462325249
538.1 462325249 460362854 458899803 459258461 460201721 459940071 459021263 456505890 455997124 456695366
546.8 456695366 456238937 456390114 456134338 455423851 455166550 456724892 457490501 454642982 452638702
555.5 452638702 453009567 451924629 450914307 452144661 451846352 451785202 453571968 453133926 452355728
564.2 452355728 452836685 453486786 455471764 455328751 452477417 451067352 451886215 453579712 452904549
572.9 452904549 452254143 453415604 452807770 452046356 451915398 451808472 451541100 451001663 451298523 452179298
582.5 452179298 453553047 453409653 452399025 451865044 451793976 452602386 452811127 452983322 453677063 454356956
592.1 454356956 454216995 453960991 454477463 455299225 455366783 454021606 453462944 453922157 454554138 453947334
601.8 453947334 452303696 452122803 452482872 453128777 452599678 451355247 450995979 450265579 450443878
610.5 450443878 451438293 451938400 450616150 449187851 449659233 449908142 449210625 448745918 449505501
619.2 449505501 450103645 450618973 451259537 451861229 452909279 452792397 452417564 452710419 453195305 454070282
628.8 454070282 455585442 457475128 458907776 460517235 461364975 462043190 463869019 464747353 464988022
637.5 464988022 465714493 466747055 468042908 469504013 470609474 471213150 472338333 473543739 474668884
646.2 474668884 475243797 474569511 474696465 475463791 476069870 477399559 478836441 479617844 480280380
654.8 480280380 480579262 479740486 479414635 480287971 480565567 478970833 477552376 478060074 478895149
663.5 478895149 478853798 477910652 477654343 478654518 480054626 480523148 480576859 480971260 481430054 481458397
673.2 481458397 482668724 483899155 484348183 485413399 486317558 487030525 487736778 487979546 487996101
681.8 487996101 489019623 491443138 491953163 492092171 494078369 494784889 495216751 495546036 495475693
690.5 495475693 496640244 497464638 497203026 497330093 498321991 499117279 500679741 501665344 501078033
699.2 501078033 501665764 502006683 501580162 501688805 502492104 503509827 504714928 506166916 506832275
707.9 506832275 508041840 508856277 508814468 508880386 508544846 508706398 508752174 508521843 508765755 510681381
717.5 510681381 512894440 513461113 513600540 513200607 513375053 513797951 513740768 514471397 515911217 516366463
727.2 516366463 516472130 518446541 519712753 520240021 521061440 521615028 522252655 521486473 521009407
735.8 521009407 521841393 522978973 523776779 524379997 525464211 525812149 525891838 526404953 526266823 525307541
745.5 525307541 525588493 526264839 526713333 528042984 528350220 528752365 529714012 530854225 532409897
754.2 532409897 532883072 532775726 531729660 530815964 531833534 533707809 535524292 537241669 538378944
762.8 538378944 539193649 540827065 542030792 541469574 540347176 540301628 540161819 539739685 540030251
771.5 540030251 540486641 541161118 541567955 541879768 541916618 542016068 541654892 540739555 540971680 541220627
781.2 541220627 541968689 542528152 542602463 543249092 543855515 544449844 544661064 545176544 544962540 544903603
790.8 544903603 544844475 544166183 544948997 545914459 546683769 545662346 544438210 544444084 544220123 544127884
800.5 544127884 542701645 541669769 540591469 538952866 538447113 538149910 537283745 536153870 535435791
809.1 535435791 533364182 531262207 530164604 529248848 528901405 527768364 526904716 527448769 527457008
817.8 527457008 526120911 526315231 527304497 527135506 527769623 528574524 529549408 531522598 534695435
826.5 534695435 537677994 540104713 543183708 544958687 546248093 547772293 549728394 551532822
834.2 551532822 552898140 555532761 558346786 560529137 561459007 562686272 564280205 565413818 566528587
842.9 566528587 567150993 568017578 568999786 569913139 570338669 572466927 574561501 574991531 576226463
851.6 576226463 576467056 576781006 577082443 577729874 578560181 578892326 580903053 582630157 583607330
860.3 583607330 583973122 584708023 585870590 586225891 585664749 584746552 584777794 584237061 583766594 583148384
869.9 583148384 582715187 582558861 581467056 580578613 579550285 578869209 577829437 577022324 576055870
878.6 576055870 574806137 574856339 574713211 574645805 574247780 573860970 573430443 572589531 571630745 571061287
888.2 571061287 571191940 569973068 569453125 570003700 570682793 570789642 570382538 570777969 569888382 568975143
897.9 568975143 568426666 568367805 568223305 567451897 567405701 567176552 567940712 568704376 570804596 573868484
907.5 573868484 575047302 575932121 576025543 576396790 576597443 576361008 576302757 576150856 575554314 573959427
917.2 573959427 572567139 570134621 567570076 565393600 563845482 562487259 559360771 556941643
924.9 556941643 555078430 552856064 550267448 547403603 545139084 543102112 541181526 538880615
932.6 538880615 537080688 535793915 534829712 534571266 533597870 532317734 531305504 530337601 529401627
941.3 529401627 528666000 528299294 527277946 526112366 526172867 526297684 525980072 526050644 526015053 526055794
950.9 526055794 526310921 526392784 525850296 524828072 524290428 522865601 521110802 520426178 519336662
959.6 519336662 517616806 515466423 513068695 511404381 509660416 507579613 506437111 505518532 504194946
968.3 504194946 502170029 500099678 499019165 497080688 494022560 491397552 489252434 486579208
976 486579208 483345261 480387611 477618866 474838638 471629829 467676849 463443832 459281502 454966354
984.7 454966354 450858917 446787796 442789574 439504128 436824226 434503975 431714439 428475876
992.4 428475876 425249519 423202858 421674767 419431725 417685051 416230202 413864784 410450859
1000.1 410450859 408059807 407167473 406229553 404146004 402169304 400992813 398952904 397869644 396960754
1008.8 396960754 395766487 395055122 393339844 391008530 388378220 387006493 385943947 384307442
1016.5 384307442 382553940 380938072 379863739 377883377 375731239 373770409 372578659 371192131
1024.2 371192131 369406204 368134270 366800270 365823212 364326324 363859940 363303223 362391777 361963425
1032.9 361963425 361322784 361515007 361489563 362284088 362827606 364039993 366125832 367141113 368436737
1041.6 368436737 369798851 371344299 371294365 370828667 370268059 369270592 368766212 367364616 366516380
1050.2 366516380 365547943 364956894 364217873 363678970 363729019 362495193 361580086 360503578 360482216 360610390
1059.9 360610390 361199150 362757034 364718857 367877884 369411049 370691223 371920471 373821678
1067.6 373821678 375412674 375457535 376172333 376520767 377450714 377987709 378296318 378887787 379442368 379824677
1077.2 379824677 379601288 380112267 380263939 380939331 381059418 381433067 382258148 382268715 384113083 385913086
1086.9 385913086 387278214 387746391 388579979 390357132 390926476 391423836 392279739 393974152 395252533
1095.6 395252533 396616783 397240028 397426453 399082375 400258789 401664124 402905388 404140091 405069504
1104.2 405069504 405607796 406348000 406659279 408331909 409503479 409478302 410000191 410855217 411549721
1112.9 411549721 412010422 412698402 413486290 414090614 413847046 414085884 414387550 413918762 413871269 414243164
1122.6 414243164 414346161 413192940 413600922 415281792 415741043 415836945 416188469 417825623 419887123
1131.2 419887123 421754150 423523293 425384254 426996346 428636017 430827637 432024422 433147202
1139 433147202 434920959 436662521 438377686 439946823 441282501 442210274 442257500 441559715 441748238
1147.6 441748238 442508736 442667847 442574425 442834015 443692703 443844528 443494186 443812904 444145889 443590965
1157.3 443590965 442296257 441173363 440717545 440574684 440244980 440284042 440967216 442587395 444549713
1166 444549713 445910187 447293167 448612289 450385628 452693214 454979744 457007828 459331284 462436523
1174.6 462436523 464891052 466909714 469585457 472117958 474059753 475402336 475948753 476787148 478291931
1183.3 478291931 480170937 481766930 483571701 485814362 486925163 488019981 488577805 487886162 487231865
1192 487231865 486953506 487002678 486844711 486680374 486127777 485504456 485372162 485155144 484590149 483481216
1201.6 483481216 482235947 481261215 480484962 479412384 478383331 477735672 477601395 477858810 477451897
1210.3 477451897 476934967 476781425 476581459 475804482 474888496 474815598 474501915 473935585 473510742 473223343
1220 473223343 473362617 473489456 473296509 472484550 471670609 470675430 469748802 469376450 468536377 467864151
1229.6 467864151 467354393 466603737 466010208 465452728 465161285 465110703 465094910 464234390 463215981 463056717
1239.3 463056717 463032074 463153992 463169136 463121109 462948990 462409058 462116013 462297630 462336197 461899681
1248.9 461899681 461494865 460923271 460428581 460254364 460300598 460324364 459883652 459606705 459470139 459610100
1258.5 459610100 459688263 459724388 460097046 460131149 460504990 460955238 461146774 461376228 461917076 462638702
1268.2 462638702 463181000 464103241 464823723 465459976 466339378 467301178 468268967 469070930 469795685 470459785
1277.8 470459785 471604271 472731018 473521843 474286728 475254707 476691322 478290596 479604111 480370941
1286.5 480370941 481380920 482673798 483529778 484026184 484682503 485510979 486213951 487049599 487986717
1295.2 487986717 488802567 489618225 490315971 490491600 490760307 491001625 490868530 490844498 490954514 491174736
1304.8 491174736 490804329 490377388 490510864 490200729 489494820 489527817 489816513 489218559 488401413 487688828
1314.5 487688828 487246094 487140884 487462463 488063049 488202820 488871574 489660606 489974213 490439072 491044312
1324.1 491044312 491740112 492117348 492256546 492194977 491978378 491912003 492080650 491827736 491371269 491021576
1333.8 491021576 490408592 490292358 489984932 489653778 489507065 489117851 489704437 490591507 491606903
1342.4 491606903 492333450 492890930 493468056 493739433 494293709 494718132 495211716 494912338 494395752 494200668
1352.1 494200668 493791122 493600655 493442726 493878174 494220428 494089279 493398094 492762032 491850052 490919151
1361.7 490919151 491344452 490427933 490360146 490811386 490575523 490746574 490377083 490162010 490004768 489781609
1371.4 489781609 489480782 489172401 488766174 487642365 487597771 488231049 489002876 488888588 488929024 489069672
1381 489069672 488199272 487107353 485313110 483917847 483073235 482145691 480464973 479827156 479913979
1389.7 479913979 478672867 477169380 475812263 474674568 472091827 468829842 467349854 465818787
1397.4 465818787 464795990 461970100 460036926 459415474 457561531 456121521 455167465 453003311 450580826
1406.1 450580826 449508629 448227539 446356392 444989090 443693237 442572517 441574287 440988922 440408592
1414.8 440408592 439361725 438356285 437361336 437558746 435885010 434965591 436062202 436879082 437765999
1423.4 437765999 437436333 438064995 438998337 439564552 440693550 441207390 441754456 442094574 443417740
1432.1 443417740 444571533 445602112 447774277 449329338 449608040 450303116 452953529 454649162 455754967
1440.8 455754967 457266579 458297348 460242043 461220703 462158737 463574371 465105476 466116867 466752281
1449.5 466752281 468041039 468721886 469852066 470810356 472354927 473846931 474419174 474127579 474545097
1458.2 474545097 478749924 480592690 482978745 484483223 485206337 487465248 487958641 489593544 491794662
1466.8 491794662 494183960 496189575 498074379 500626793 501982727 503802643 505113411 507692184
1474.6 507692184 510657425 512392693 514752235 517330894 519078102 520417442 521616554 522420082
1482.3 522420082 524046249 525532074 526128006 527274933 527831879 527857132 529906082 531067200 529588814
1491 529588814 529743690 530457954 530058327 529306068 528390617 523763161 524167099 524003029 521976624 522480240
1500.6 522480240 522100296 521174698 520541382 520899277 520667458 515383492 510406723 512169800 514869308
1509.3 514869308 514543571 515227699 515041428 513570404 513788338 512962608 512406960 511268463 508414383
1518 508414383 509717445 511728172 510289001 506880455 507591248 509662323 512082748 511709442 511648407
1526.6 511648407 512321663 511953392 512581749 513748932 514458733 514774742 514940071 513086700 514618416
1535.3 514618416 515751839 516177635 518199158 516106110 511212730 514557228 515998764 514698792
1543 514698792 516196976 517691116 516543236 517610588 517892609 518923073 519102097 517172165 517913742
1551.7 517913742 518428459 518653488 515216713 515668373 518419914 520520096 519414825 514009666 510808830
1560.4 510808830 510683975 512069626 511947098 511844139 509064369 506555634 506438141 504835091 503825226
1569.1 503825226 496506577 494882812 493727417 491019821 489300690 487299805 486352539 475075417
1576.8 475075417 473725395 472098656 469051247 466085434 461513634 458315430 453480186 450618057
1584.5 450618057 446367874 442574539 439266434 435214424 432838593 428298111 425395164 420655174
1592.2 420655174 417806702 414623985 410708389 408490562 404183807 402229004 398214569 396367455
1599.9 396367455 393738632 390870857 388970566 385133286 384071236 381020088 379902115 377292061
1607.6 377292061 375982819 375081291 372693710 373028069 370876312 370861359 368874321 369038582 369769096
1616.3 369769096 363306580 364395218 363556328 364627342 363747330 364862823 364691620 362411346 364346695
1625 364346695 364155579 365906372 364295006 364676285 365810547 366828842 368032074 367855949 369969444
1633.7 369969444 370860710 371134720 369652023 372350502 373447380 374186440 376416473 376919975 379510460
1642.4 379510460 379992905 381823921 383492432 382559280 385088310 384669228 387311783 388128090 390853500
1651 390853500 393972969 392682762 389798698 391999245 396127090 397150841 399118423 400586014 401908455
1659.7 401908455 403266411 405176888 407453003 406914635 410555534 413044128 415476608 417976990
1667.4 417976990 420300331 421392975 421863708 426630898 428449135 431937523 436022491 438568420
1675.1 438568420 439455605 442565002 447308197 449911041 452860985 454663353 458583069 464089699
1682.9 464089699 467579842 468413849 469152374 475320091 479897232 483158493 486844635 489871979 493829880
1691.5 493829880 497178001 500504494 504764290 509393959 508937340 513399887 519398956 525522690
1699.3 525522690 531014442 526196175 531851044 536442757 539502449 541682014 544299736 546454315
1707 546454315 549186630 553328934 555723038 557336807 559522781 561610336 564060593 563831215 563160858
1715.6 563160858 567256165 571335030 566910019 568851738 572193222 574114075 575722847 576159706
1723.4 576159706 576373405 577868156 579204597 579804916 580854301 583056259 583244820 583030014 586027565
1732 586027565 589027176 588220062 583983116 587289124 590731392 592207489 595034981 595890579 594715576
1740.7 594715576 598838043 601884270 602526169 603872871 606636314 609120903 610901031 612979698
1748.4 612979698 614335480 618588562 620896492 621370201 626114082 629594040 632453651 635274315
1756.2 635274315 635064964 636670532 639201889 641351318 644810410 644858246 645198898 648540268 650332336
1764.8 650332336 651824875 653558044 654890213 652946625 654814606 658719025 658535995 656866684
1772.5 656866684 655790787 659887543 662762070 662486038 664620895 665417862 666504593 666810303 665867615
1781.2 665867615 667231674 668843307 670054550 669954529 670758667 672231293 673131332 673731918 674637756
1789.9 674637756 675030823 675578613 674039307 673244019 676861801 678309784 678223190 680035553 681859665
1798.6 681859665 681691818 680328445 682055435 681674347 681715698 683503723 684027786 684964447 685803604
1807.3 685803604 686501083 687718658 688711700 687274170 687396011 688825455 689260406 689962158 689987259
1815.9 689987259 690525208 690612335 691740570 693292160 693378906 694006271 693547211 694410553 695341949 692283936
1825.6 692283936 691949844 694082870 696155548 696484451 694289246 695266037 697504578 697954941 698238449
1834.3 698238449 698021011 697721481 697819977 697756195 699113998 699563370 700511856 701030121 701980133 703059921
1843.9 703059921 697299728 698827438 701253128 700772476 700585098 701420059 702550049 702687378 703576050
1852.6 703576050 704080887 704125900 703833389 703603973 703970718 703847733 704384460 704541397 704820251 704885330
1862.2 704885330 705242157 705808868 705815582 706193695 705922318 706598206 705487061 704069138 705303345
1870.9 705303345 706347427 707049942 707186432 707786942 707900467 708308792 708337860 707681122 707732162 707617493
1880.6 707617493 708059082 708115311 708575058 708640060 708573151 709301147 709091492 709712143 709527893 707748413
1890.2 707748413 707873154 708926010 709283600 709793320 710291595 709648437 710153809 710294952 710406799
1898.9 710406799 710633774 710367813 710324936 709962616 710149994 709868164 710152664 710863113 710966034 711037750
1908.5 711037750 711003036 710984573 710703201 711139221 710818481 710964584 711255798 711340332 712971420 711675720
1918.2 711675720 710646362 711512070 711925812 712314911 711099014 710304565 710634460 711142960 711601486
1926.8 711601486 711887283 711693726 711754379 712003326 711997070 712128220 711546936 711798172 711711044 711119537
1936.5 711119537 710955200 710831604 711456680 711629410 712713394 712341156 710314102 711308060 711784439
1945.2 711784439 711205215 710854187 710976410 711026230 711090622 711283646 711585770 711936569 711562881 711420135
1954.8 711420135 711157227 711152649 711187439 710640945 710301208 710052795 710397873 710832596 710956955 710607758
1964.5 710607758 710655594 711242599 710874557 710187988 710147018 710328064 709940720 710049210 710181656 710068436
1974.1 710068436 710671539 711026764 710961533 710483780 710299454 710256805 710075226 709564590 709099197 709524155
1983.7 709524155 709578705 709703293 709919281 709979630 709522095 708958435 709724731 710031586 708969193 708373260
1993.4 708373260 708869400 708829575 708631439 708904953 708769073 709080353 709297638 709231110 708905106 708779144
2003 708779144 708592758 707900620 707746658 707495575 707409668 707470703 707607651 707484589 707577667 708157196
2012.7 708157196 707827301 707729111 707442398 706790161 706269226 706156464 706245422 705894318 706338501 706520309
2022.3 706520309 706466980 706485367 706124649 705617523 705123596 705261154 705185318 705306854 705144348 704825439
2032 704825439 705029449 705004730 705164490 705157394 704877396 704414444 704017029 703442917 703173599 703239670 703455963
2042.6 703455963 704021759 703506088 703541336 703837585 703702164 703717651 703177490 702967606 702635498 702481918
2052.2 702481918 702262192 702369308 702834015 702754898 702742310 702432327 702572098 702220306 701778030 701830368
2061.9 701830368 701695862 701899567 701675110 701469345 701273575 701770172 702141800 701925278 701994247 701631088
2071.5 701631088 701532211 700971451 700878143 701148758 701024780 701109009 700905380 701182480 701171494 701112900
2081.1 701112900 700910950 700582352 700385666 699946518 699966736 699789276 700136032 700280991 700174789 700343094
2090.8 700343094 699952927 699807129 699633713 699164886 698401489 698560715 699092178 699124146 698947144 698360748
2100.4 698360748 698555832 698687057 698674774 698368378 697975464 697979431 697436142 697230835 697363663 697884140
2110.1 697884140 698197784 698208847 697826462 697139359 697186813 696941147 696837158 696589127 696347122 696367035
2119.7 696367035 696299744 696653366 696429138 696119232 696202621 696430664 696105042 695798950 696013870 695921631
2129.4 695921631 696024551 695966644 696108475 696033783 696043930 696409988 696242371 696214981 695811234 695522308
2139 695522308 695555725 695472641 695435181 695992584 696335220 695817413 695934677 695658035 695732117 695876617 695322571
2149.6 695322571 695430756 695312729 695426636 695674286 696036530 696276245 696309509 696596756 696228943 695745926
2159.3 695745926 695379410 695249100 694973068 695024872 695434570 695450592 695669479 695741196 695934219 695804520
2168.9 695804520 695538406 695441818 695336533 695223083 694862061 695292435 695856400 696330719 696478348 696520004
2178.5 696520004 696597748 695966721 695837784 695738831 695580826 695414734 695651093 696167374 695957565 696142197
2188.2 696142197 696255264 696380844 696659012 696651840 696322327 695886536 695751114 695529785 695788345 696083832
2197.8 696083832 696347809 696475143 696373215 696410599 696169662 695985336 695774231 695951614 695864182 695575333
2207.5 695575333 695579147 695789490 696690598 697067108 697210083 697141800 696782608 696425858 695976715 695836945
2217.1 695836945 695874634 696304474 696199646 696412354 696975250 696943130 696975861 696633224 696235886 695816498
2226.8 695816498 695823517 695928345 695929718 696153259 696388855 696977997 697012863 697008820 696730728 696140671 696073303
2237.4 696073303 695997238 695738907 695544739 696144180 696444778 696565781 696639175 696425095 696550980 696468277
2247 696468277 696512451 696051788 695584030 695462494 695475464 695822830 696062469 696171341 695843735 696198349
2256.7 696198349 696045151 695487747 695778198 695864258 696004028 695787354 695687485 695636978 695805511 695719833
2266.3 695719833 695344009 695711136 695540237 695660782 695608978 695307083 695145416 695058517 695472717 695350342
2275.9 695350342 695662155 695486603 695011826 695019073 694759750 694437790 694096832 694476700 694576874 694809494
2285.6 694809494 694945145 694873428 694968109 694447327 694734192 694431458 693927994 694074631 694137726 694292297
2295.2 694292297 694025574 694290009 694260712 694155731 694370575 694316864 693982620 693627777 694000626 693663712
2304.9 693663712 693585892 694040680 694235001 694468994 694291992 694441147 694340897 694115372 693520737 692915955
2314.5 692915955 693311920 693689651 693945618 693975677 693681259 692894058 693322449 694779129 694850693 694750366
2324.2 694750366 694818802 694366150 693994370 693948441 693959427 694088745 693973541 694252090 694308167 693058701
2333.8 693058701 692644196 693130798 693226089 692724609 693086700 694176636 694419174 694123535 693619385 693421555
2343.4 693421555 693352356 693217239 692558060 690930481 689412308 690120087 691724548 692070694 693126984
2352.1 693126984 693380356 693345795 693437729 692824554 693627548 693095322 693778381 693282394 692245636 693042755
2361.8 693042755 693293610 693141174 691693649 692218170 691622238 689727936 688101654 687935486 689249191
2370.4 689249191 688764801 688689346 687807999 687271042 687523880 686877823 686215515 685415039 685025253 684368286
2380.1 684368286 684193344 684115829 683932571 684331512 684264908 684269562 683939056 683439484 683160095 682894669
2389.7 682894669 682591248 682154617 681979980 681516342 681493759 681795273 681934662 682042618 682041473 681927567
2399.4 681927567 681027451 680055161 679450607 679614487 680081940 680204239 680127029 679746933 679646912 679233093
2409 679233093 678800964 678614807 678445969 677929077 677046432 676970825 677268372 677664413 677478256 677314682
2418.7 677314682 677430038 676721573 676260757 675884399 675326920 675141525 675221939 675008545 675057220 675023956
2428.3 675023956 674409637 674611816 674600983 674292221 673832703 673007812 672464447 672080994 672130432 671831970
2438 671831970 671532745 671331711 671254883 671301575 670772247 670509720 670430527 670470276 670109787 669668198 669673080
2448.6 669673080 669594193 669462128 668995590 668761520 668529892 668297119 667964325 667416992 666915588 666209869
2458.2 666209869 665958023 665760498 665915070 666248016 666172562 665923843 665427322 664772186 664109039 664349365
2467.8 664349365 664067001 663207550 662844925 662634964 662834625 662523117 662083969 661640396 661455612 661528397
2477.5 661528397 661122589 660679855 660022507 659772873 659682007 659533386 659148178 658650360 658490982 658020935
2487.1 658020935 657691116 657179718 656886902 656663055 656273422 656331177 656047440 655523453 654798508 654397736
2496.8 654397736 654246674 654146271 653852463 653067169 652939835 652946014 652709885 652165298 651569443 651271744
2506.4 651271744 650949173 650592346 650043488 649886932 649732208 649398727 649144135 649042969 648842239 648123703
2516.1 648123703 647726288 647353363 646989670 646988907 647044907 646670685 646202469 646151886 645866928 645670319
2525.7 645670319 645317459 645006104 644616699 643914795 643615112 643082886 642679749 642474594 642265854 642065353
2535.4 642065353 641941910 641978607 641690750 641292114 640904388 640907669 640531235 639972954 639717674 639207993
2545 639207993 639097862 638979378 638722839 638235130 637919846 637789497 637235069 636540718 635620613 635370369
2554.6 635370369 635185165 634963188 635135994 635139313 635193596 634779930 634286194 633770638 633245659 632991562
2564.3 632991562 632750893 632445412 632036095 631787453 631443672 631469345 631585121 631257820 630720673 630305519
2573.9 630305519 630151596 629636421 629114456 628715248 628586655 628357773 628160057 627949753 627208290 627317696
2583.6 627317696 627362328 626891670 626309128 625824242 625797920 625316963 625008392 624808922 624627533 624252472
2593.2 624252472 623695374 623517647 623148117 622889061 622695274 622550354 622048149 621505585 621224747 620902443
2602.9 620902443 620714340 620004044 619519691 619133377 618972740 619088326 618666077 618371696 618015137 617774239
2612.5 617774239 617240944 616552925 616181908 615904388 615907631 615596581 615135307 614859200 614871330 614238358
2622.1 614238358 613496895 613602753 613472710 613160934 612324562 611646805 611524124 611173935 610765419 610444260
2631.8 610444260 609943199 609145966 609058685 609050026 608777504 608335876 607686996 607487602 607152710 607031403
2641.4 607031403 606777954 606217194 605640755 605055733 604906540 604639168 604422989 604209518 604068604 603727188
2651.1 603727188 603214188 602960968 602238388 601628609 601309166 601110649 600994301 600783882 600327492 599816475
2660.7 599816475 599715118 599115028 598456612 598301125 598216515 598113403 598101845 598188896 597777557 597225456
2670.4 597225456 596721649 596298676 596255760 596361656 596148949 595733910 595351791 594866867 594650002 594261017
2680 594261017 594147339 594246597 593717804 593277054 593043442 592919006 592538185 592257385 591862907 591219864
2689.6 591219864 591081314 590629158 590114861 590063210 590334778 590289078 589942665 589544182 588805962 588554878
2699.3 588554878 588389015 588230553 587932396 587462120 587403755 587194748 587157860 587112579 586842995 586620369
2708.9 586620369 586608925 586463776 585883484 585349884 584798965 584511299 584046631 583755188 583964577 583554916
2718.6 583554916 583079758 583274803 583458900 583025169 582786026 582801933 582632408 582253113 581840172 581663399
2728.2 581663399 581237411 581152840 581315231 581291809 581161842 580906258 580444260 579876442 579972839 579645576
2737.9 579645576 579333763 579270210 578639107 578449059 578506470 578960915 579089432 578767281 578622284 578086281
2747.5 578086281 577605095 577303810 577221069 576951866 576646271 576572266 576565170 576900291 576986084 576492043
2757.2 576492043 575916290 575785484 575310059 574790192 574730492 574342346 574067535 573994331 573858871 573701172
2766.8 573701172 573767700 573514061 573085899 572730370 572323570 572779579 572491379 571736374 571614838 571224861
2776.4 571224861 570920105 570588150 570400047 570103951 569797401 569320755 568486633 568180275 568152504 568137207
2786.1 568137207 567670822 567513008 567472420 566776161 566415634 566180878 565922470 565631752 565478363 564988632
2795.7 564988632 563985481 563451309 563089066 562670288 562143745 561934013 561816368 561088295 560413017
2804.4 560413017 559962044 559457588 558894615 558571167 558406601 557855911 557119751 556643066 556139908 555595970
2814 555595970 555063896 554324074 553962555 553658066 552692070 551677055 551145973 550852776 550677452 550151558
2823.7 550151558 549184799 548636894 548082581 547630424 547156067 546313934 546005745 545574379 544672356 543655472
2833.3 543655472 542912292 542273254 541358986 540632706 539802704 538941879 537778702 536299400 534990768
2842 534990768 533964729 532940941 531101303 529290924 528128471 526874619 525177040 523921738 522745285
2850.7 522745285 520984802 520029526 519574127 519244537 518687782 518366776 519032402 518895493 518260765
2859.4 518260765 518098221 518225555 517934532 517145805 517047501 517207947 516887321 516092339 515196533 514679718
2869 514679718 514489136 514040985 513435440 512833824 512104568 511951561 511811562 511066551 510293694 509968262
2878.7 509968262 509700623 509020119 508184624 507471085 507048264 506464500 506052246 505178490 503856697
2887.3 503856697 503284912 502704086 502467766 502141953 501621056 500832939 499463730 499022102 498308563
2896 498308563 497058029 496313858 496135902 495939255 495144234 494652939 494083138 493253975 492416115 492063522
2905.7 492063522 491820145 491200218 490992470 490146408 489051056 488163719 487226143 486264076 484790764
2914.3 484790764 484183693 483628693 481755943 480238380 479486809 478534660 477435875 476436539 475875740
2923 475875740 475922737 475875511 475457954 474744911 474579353 474893913 474993973 475335312 475794678 476042671
2932.7 476042671 475917168 476182823 476954994 477798042 478552322 478746300 479062233 479401703 479723663 480136833
2942.3 480136833 480582085 481397057 481804466 481888199 482173424 482583847 483131104 483959160 484546127 484684334
2952 484684334 484985085 485198097 485519600 485762253 485548477 485541191 486289558 486968079 487044640 487647018
2961.6 487647018 488040161 488240318 489198303 489617157 489663010 490498734 491200333 491315384 491894455 492663803
2971.2 492663803 493454094 494248047 494491997 494476624 494756165 495453987 495630035 495560951 495698700 495728645
2980.9 495728645 495988007 496364822 496856003 497366676 497902489 497994614 497501831 497273521 497533875 497698975
2990.5 497698975 497335854 497380257 497528152 497214050 496969681 497227135 497531319 496819687 496355247 496061096
3000.2 496061096 495154190 494643707 494654274 494886780 494670143 494011497 493330688 492944069 493010750 492933006
3009.8 492933006 492248306 491620865 491450462 490964088 490528374 489861679 489032364 488886604 488581085 487826004
3019.5 487826004 487185211 486907349 486275826 485760269 485725746 485330887 484868813 484145432 483223038 482530022
3029.1 482530022 482273445 481768913 480710258 480275536 480069542 479612846 479077530 478528748 478015137
3037.8 478015137 477681160 477204933 476415253 475804100 475031433 474219856 473472099 473050346 472623940 471818390
3047.4 471818390 471434746 470934944 470191689 469336433 468675766 468261261 467719803 467217751 466307678 465568695
3057.1 465568695 465200043 464931870 464418945 463689957 463185272 462660065 462434425 461823540 461277428 460933952
3066.7 460933952 460063400 459477234 459038048 458619270 458056145 457708778 457270203 456317215 455591507 455121841
3076.4 455121841 454754715 453972054 453817749 454121742 453708572 453178062 452282219 451353302 450866776 450515404
3086 450515404 449712181 449079781 448999710 448384476 447575722 447172928 446899376 446176643 445707245 445449295
3095.6 445449295 444697609 444132042 443560486 443264084 442935524 442158890 441516609 440956573 440478821 439887505
3105.3 439887505 439286156 438756142 438446045 438323059 437854424 437073898 436582146 436206207 435508194 435130043
3114.9 435130043 434474487 433625946 433463402 432907181 431637650 430958366 431060371 430552444 429533310
3123.6 429533310 428624077 428067093 427718582 426682053 425750084 425320702 424973297 424630623 424398193
3132.3 424398193 423975258 423167534 422533951 421996536 421845818 421552582 420734634 419857445 419166145 418761673
3141.9 418761673 417911720 417170715 416844063 416463661 415960808 415346107 414497070 413579102 413512001 413251801
3151.6 413251801 412395706 411701927 411169624 410564384 409792862 409422035 408721924 408129044 407759056 406927414
3161.2 406927414 406462326 405907326 405001984 403981400 403314972 402953110 402681808 402692986 402097969 401117325
3170.9 401117325 400198746 399342003 398661423 398253670 397893982 397062798 396151924 395541382 395473747 395343323
3180.5 395343323 394401703 393478241 393443794 393189430 391793137 390592422 390504913 390772552 390261345 389581642
3190.1 389581642 389043694 388414726 387757187 386665840 386253357 385924721 385087204 384398766 383960419
3198.8 383960419 383895073 383178902 382792130 382656517 381980400 381506729 380773048 379980049 379229431 378963852
3208.5 378963852 378730164 378064690 377636185 377023201 376541634 375854950 375176086 375233841 374962540 374114761
3218.1 374114761 373463478 372975693 372589302 372304230 371528893 371012535 370868835 370596352 370351677 369697914
3227.8 369697914 369289017 369020386 368183365 367514648 367568970 367411461 366445084 365729218 365220108 364395447
3237.4 364395447 363826027 363810768 363622322 363337021 363124046 362568817 362300377 361770973 361105080 360684929
3247 360684929 359934692 359752083 359638176 358963089 358570099 358422432 358213959 358049507 357553101 356826019
3256.7 356826019 356426086 356047134 355609932 355060234 354759521 354788895 354362297 353724709 353186607 352573738
3266.3 352573738 352322693 352604675 352449722 352247200 352064362 351421127 351143074 350678596 350276871 349745064
3276 349745064 348837280 348630066 348655586 348709831 347902565 347024231 347371140 347428780 346962280 346762848
3285.6 346762848 346828232 346519241 346004486 345572510 345193443 345287361 345322304 345120239 344872208 344365349
3295.3 344365349 343875084 343516006 342942314 342617950 342422295 341908531 341912498 341922951 341585693 341173210
3304.9 341173210 340644150 340360451 339943314 339720535 339469986 338650551 338210335 338309822 338351784 337966881
3314.6 337966881 337161636 336570168 336489525 336108665 335566750 335154762 334412384 333995743 334099236 334063416
3324.2 334063416 333458748 332483597 331854973 331809349 331689072 330835114 329675369 328837852 328691368 328570290
3333.8 328570290 327827873 327309303 327169991 327140007 327096977 326295395 324955521 324317856 324092522 323502274
3343.5 323502274 322825851 322398949 322285614 322149353 321791344 321236420 320851135 320642128 320251541 319869251
3353.1 319869251 319530048 319293728 318687687 318230324 318515739 318337212 317863865 317635250 317055569 316040287
3362.8 316040287 315518780 315467625 315256119 315385876 315457687 314676704 313991680 314322453 314250813 313293419
3372.4 313293419 312663784 312688370 313116856 312824879 312116737 311618900 311388245 311739864 311738663 311444302
3382.1 311444302 311181068 311003895 310922871 310652351 310354958 310245476 310562553 310525551 310380058 310202751
3391.7 310202751 309263897 308688679 308593063 308645439 308999176 308967190 308726196 309044800 309358883 309232635
3401.3 309232635 308619347 307772655 307664871 307729053 307897453 308152695 307795792 307447872 307407913 307871876
3411 307871876 308322468 308265152 307757664 307340965 307485809 307430878 307745533 308395023 308804569 308845100
3420.6 308845100 308211269 307841454 307969246 308514595 308774090 308933144 309843826 310174294 309887238 309761448
3430.3 309761448 309992771 310628319 310749626 310619545 310605907 310544624 311109772 311676369 311673737 311924877
3439.9 311924877 312745476 313390274 313071213 312884445 313280830 314459419 315692139 314925385 314692554
3448.6 314692554 315396957 315872498 316800022 317224140 317209435 317293568 317737885 318362885 318844337 319488773
3458.2 319488773 320002022 320594673 320894585 321061897 321722794 322166862 322845840 324074097 324491272
3466.9 324491272 324585381 325409775 325732346 326080856 326835060 326947212 327300644 328368683 329440269
3475.6 329440269 330086441 330904465 331935310 332354164 332216682 332351723 332689056 332982330 334383850
3484.3 334383850 335838890 336325607 336721001 337014732 337691383 338788414 339704933 340210800 340963821
3493 340963821 342109070 342888222 343145065 343145638 343883018 344596443 344938965 345933418 347068291 347765617
3502.6 347765617 347808609 348218460 349677467 350882187 351541710 352689247 353475189 353884125 355198593
3511.3 355198593 356226425 356920090 357207413 357529793 358653336 359380455 359756470 360360718 361332359
3520 361332359 362392502 363733559 364607391 364527473 365721588 367507629 368482132 368960915 369499741
3528.6 369499741 369653778 370661812 372554665 373599777 374602013 375682526 377247047 377809563 377818527
3537.3 377818527 379478798 380518036 381608963 382753448 383928833 385237808 386048164 386824646 387339134
3546 387339134 388747139 388935585 389719124 391418228 393109245 395145264 394719696 395969048 397612152
3554.7 397612152 398952065 401084518 401386833 402739830 404420815 405866661 407155800 408327751
3562.4 408327751 408761330 408931656 412942963 414699974 414528847 415232430 414535446 417239838 419572220
3571.1 419572220 421472969 422997398 424162178 425358200 426872635 429410553 429920273 431243439
3578.8 431243439 432697144 433615227 435742340 437688293 439350319 440243950 444285851 446940918 445408936
3587.5 445408936 446922226 445779953 447866974 450941200 453573723 455264397 455925751 459580231
3595.2 459580231 459241829 460636406 464231567 464954224 467503510 468661652 469544983 471363678 472792397
3603.9 472792397 474731750 477368546 480396652 480431328 483716621 484316711 483092575 489955711 492555237
3612.5 492555237 490481796 494029503 494114227 497037697 501206436 501986809 504270515 504418831 505656929
3621.2 505656929 509195824 511402206 513128586 515284729 517138672 519925804 527248917 529340324
3628.9 529340324 518559418 521677055 526582260 532010689 534333992 533279533 535920410 539578819
3636.6 539578819 542374916 542940865 544548187 547817230 550712471 551979103 552223854 554690704 558336449
3645.3 558336449 563627434 562920494 560829124 569446411 571060371 565801353 563385162 568457832
3653 568457832 573855286 578281136 584229698 577876549 577932701 582786102 584440765 586775627 587982979
3661.7 587982979 589779549 591110649 593006744 594502602 594333191 598609962 602077370 601785583 602112923
3670.4 602112923 595977936 597709541 605796700 614564781 615426178 599371758 599929657 607432327
3678.1 607432327 613123894 611928101 611329803 613127441 614735756 616940689 617828941 617637787 621366463
3686.8 621366463 628068008 620570641 616429558 624653168 620580978 619217339 624180107 625180626
3694.5 625180626 626639023 626948280 626513405 627435989 627318802 629611359 633189049 629189529 626862221
3703.2 626862221 631381111 632559128 631756477 631692581 634649658 640121307 633075867 635334015 641242447
3711.9 641242447 627518349 629967995 635263405 636300850 636651955 638399162 639375839 636093559
3719.6 636093559 637182579 643056717 640546875 635947990 640696640 642146530 641499863 638348465
3727.3 638348465 637502747 640953598 641896820 648096161 646327744 637467346 646277466 648044739 639252243
3736 639252243 638948212 640910034 641343460 643079376 646020203 642296066 644260712 656440277 650105438
3744.7 650105438 630598106 639403877 645021210 651360016 650144348 639297447 651354294 648587036
3752.4 648587036 637717972 642450256 646626663 649974976 645307617 647320862 653222656 645037155
3760.1 645037155 642499924 647076111 649104080 649718018 652801437 649790192 645275116 648957596
3767.8 648957596 654495926 656192856 646549225 646351776 649570618 649877090 650677872 650466537 651222992
3776.5 651222992 651402206 654241333 655464859 647815170 649350967 651112976 651763535 654174957 651580276
3785.2 651580276 650607681 651675568 652532349 653398056 652753983 652909241 653366165 653706741 653013916
3793.8 653013916 653957214 657362289 653471603 648370132 650618210 655854492 662271042 656879730
3801.5 656879730 645285339 647547913 650373840 655068054 661891632 653158340 647035522 651812210
3809.3 651812210 654153748 654662933 654794083 654242325 655146484 661125565 661483612 646520462 649957199
3817.9 649957199 655390930 660044250 663554077 647114029 646288223 651258926 653935318 656946869
3825.7 656946869 656914291 652070847 651982193 654287186 657388535 658947525 650676956 652845612 660441742
3834.3 660441742 655265274 653853455 662008286 654978638 648637848 655864868 652161942 651690521
3842.1 651690521 658759918 656723099 651939774 654144287 655775146 655250397 656230469 655391617 657796860
3850.7 657796860 664164734 658804626 661952744 648196030 645175934 655638962 655478287 653207397
3858.4 653207397 655406799 657298889 659188919 654213181 654530869 662265015 657626572 650092468
3866.2 650092468 652704544 657431946 664558487 659516449 649457397 651796341 656873550 661113434
3873.9 661113434 652332382 651433487 655279846 655630035 658184280 662839966 657163010 648604813 654332352
3882.6 654332352 656199417 657567978 663675995 651351318 650650940 655028305 656078339 660518112
3890.3 660518112 660516281 652199783 652607040 655572662 654083328 655116959 655965347 657964859 660428162
3898.9 660428162 650548248 654274826 657297897 652700958 657054596 654137192 652404251 652763672
3906.7 652763672 653180923 655733490 655810471 655492020 655051193 655211716 655475006 655236206 656488113
3915.3 656488113 658541946 655317535 650954056 654891891 655249710 650688019 652356567 655143509
3923.1 655143509 657569580 656071625 652414932 653305206 654691162 655502701 654888077 654832001 656571808
3931.7 656571808 654385834 652520981 653738708 653786392 654157867 655053482 654994431 654869232 654175873
3940.4 654175873 655313873 656456757 652458344 651661148 653160019 654492874 656100235 654183884
3948.1 654183884 654257126 654018860 651411896 653049240 654302902 653827667 653814392 653772507 653237839 652849731
3957.8 652849731 653745575 653716888 654070511 654602585 653339844 652966690 652737961 652289734 652972717 653621216
3967.4 653621216 654143829 654062729 653252182 653366470 653230209 653285370 653390350 652939072 653526077 653128128
3977.1 653128128 652999649 653494644 653215942 654083786 654593582 653556595 652881622 653992004 654372253
3985.7 654372253 653296814 652872696 653228149 654479904 654436951 653744965 653436737 652968979 653371964
3994.4 653371964 653574677 653506622 653238449 653400421 653668137 653395233
4000.2 653395233
##END=$$ End of the data block
