##TITLE=$$ Begin of the data block
##JCAMP-DX=5.00 $$ ACD/SpecManager v 10.08
##SPECTROMETER/DATA SYSTEM=Varian
##DATE=14 Jan 2013 10:41:06
##DATA TYPE=INFRARED SPECTRUM
##DATA CLASS=XYDATA
##ORIGIN=
##OWNER=
##NPOINTS=3735
##FIRSTX=399.26403809
##LASTX=4000.35498047
##MAXX=4000.35498047
##MINX=399.26403809
##MAXY=71.50891113
##MINY=30.80075455
##XFACTOR=1.0000000000
##YFACTOR=0.000000100000000
##FIRSTY=53.17117691
##DELTAX=0.96440572
##XUNITS=1/CM
##YUNITS=TRANSMITTANCE
##XYDATA=(X++(Y..Y))
399.3E31711769n800476j7361183l469391k092896n328826m922753l233413j472130
$$ 531711769 525911293 508550110 505080719 502987823 497658997 492736244 489502831 488030701
407D88030701J749229O236534K806015r58328l557663j989555K520713j560249k796135
$$ 488030701 489779930 496016464 498822479 497864151 494306488 492316933 494837646 493277397 490481262
415.7D90481262K72904o3744O378555N671463j0753936n260125j000099J022644M401703
$$ 490481262 490754166 490690422 497068977 502740440 491986504 486726379 485726280 486748924 491150627
424.3D91150627O909676Q86917k594795j049309k956124j25885K201310K31285j549072
$$ 491150627 498060303 498947220 496352425 495303116 492346992 492221107 494422417 494653702 493104630
433D93104630k697602R63097j72348k60315R89151k791596K92359K983970J662751
$$ 493104630 490407028 491370125 491197777 490937462 491926613 489135017 489427376 492411346 494074097
441.7D94074097Q0948l72277K188645J834716m501113n744896K294578P39899q50716
$$ 494074097 494155045 493782768 495971413 497806129 493305016 487560120 489854698 490594597 489743881
450.4D89743881K802468K477455j841965n052185k123909q94699K042503P008286K52113
$$ 489743881 492546349 495023804 493181839 488129654 486005745 485111046 487153549 494161835 494413948
459.1D94413948j872978l323288K437019N499459k055016m909134k972031m89349J371498
$$ 494413948 492540970 489217682 491654701 497154160 495099144 490190010 487217979 486728630 488100128
467.7D88100128J043663J697731q37402p404137j953316O732865k22588m090080l205605
$$ 488100128 489143791 490841522 490004120 482599983 480646667 487379532 487156944 483066864 479861259
476.4D79861259J140976k920837k564774L945160j180839M24995K058182k805405J018181
$$ 479861259 481002235 478081398 475516624 479461784 478280945 478705940 480764122 477958717 478976898
485.1D78976898L04680m54712q15315j409569J647034p62253q11157J684494k65770
$$ 478976898 479281578 478826866 478011551 476601982 478249016 477486763 476675606 478360100 478094330
493.8D78094330l282776j484413L547821k70424j944275O72073P27234J432228q26454
$$ 478094330 474811554 473327141 476874962 476604538 474660263 475332336 476059570 477491798 476665344
502.5D76665344J112519M23927k571640L11317q12187j242676l1128r08241j081695
$$ 476665344 477777863 478201790 475630150 475941467 475129280 473886604 473855476 472947235 471865540
511.1D71865540k75116R81826j605072k398796J8769j268235l007087p9155K504196
$$ 471865540 471590424 472572250 470967178 468568382 468587151 467318916 464311829 464232674 466736870
519.8D66736870K79350l253250k632599K573586K860832k46315m15764j936569j285095
$$ 466736870 467016220 463762970 461130371 463703957 466564789 466318474 465902710 463966141 462681046
528.5D62681046K59590p07970r0675K69699k9297j518097k089081J992722K605934
$$ 462681046 462940636 462232666 462141991 462411690 462382393 460864296 458775215 460767937 463373871
537.2D63373871p61337j136513L21808j097603k281952Q49152L98445k233925j060333
$$ 463373871 462612534 461476021 461797829 460700226 458418274 459267426 459665871 457431946 456371613
545.9D56371613j73607p72400q65288k21672n27306M20761O00739j010780r28078j075020
$$ 456371613 456198006 455425606 454560318 454338646 453811340 454232101 454832840 453822060 452893982 451818962
555.5D51818962J502724K951889m69628k003097q67462M99725J42288q39081k8686
$$ 451818962 453321686 456273575 455803947 453800850 452933388 453433113 453575401 452736320 452707634
564.2D52707634J240883N9547j474800n61943K68669P53517Q20923L78304p90787j772766
$$ 452707634 453948517 454008064 452533264 451971321 452239990 452993507 453814430 454192734 453401947 451629181
573.8D51629181k30217J426315k34031j071854J240845J056556n63278o17981L23143
$$ 451629181 451398964 452825279 452591248 451519394 452760239 453816795 453253517 452635536 452958679
582.5D52958679R13925l00064r0217M43229M616l97796p5722J189918P8736m61464
$$ 452958679 453872604 453572540 453482323 453925552 453930168 453532372 453456650 454646568 454725304 454263840
592.1D54263840Q8157o74896P51381J756897k09160j127090o8856Q88749N45959o18896
$$ 454263840 454351997 453677101 454428482 456185379 455976219 454849129 454780273 455669022 456214981 455596085
601.8D55596085m08135l03345p40165M09546L25241j282273j335449l85475m997p1869
$$ 455596085 455187950 454884605 454144440 454553986 454879227 453596954 452261505 451876030 451871033 451799164
611.4D51799164l80440p83729n17502J8043J00556k73781r3537q37097j058731J590271
$$ 451799164 451418724 450634995 450117493 450135536 450236092 449962311 449868774 449031677 447972946 449563217
621.1D49563217K446022J132240j67236n46264N49392J691246J410408K98996J081047
$$ 449563217 452009239 453141479 452974243 452427979 452977371 454668617 456079025 456378021 457459068
629.8D57459068J935807J413154Q54836P53898J060067J532707J480751P56073P82089
$$ 457459068 459394875 460808029 461662865 462416763 463476830 465009537 466490288 467246361 468028450
638.4D68028450O01845O06041R71908J107445J610184J216316Q89397O87751o51321
$$ 468028450 468630295 469236336 470208244 471315689 472925873 474142189 475031586 475719337 475068016
647.1D75068016m6272J892471J09444j87760K090531Q74061Q355Q14323Q430j246948
$$ 475068016 475021744 476914215 477023659 476835899 478926430 479800491 479808846 480623169 480631599 479384651
656.8D79384651K26669J337777n45540j087570l58696M01230j2284q75511M56886J144791
$$ 479384651 479611320 480949097 480403557 479315987 478957291 479358521 479346237 478470726 478927612 480072403
666.4D80072403O59409K313118O1874j761780m28886J007843J83220Q85048J302948
$$ 480072403 480731812 483044930 483106804 481345024 480916138 481923981 482107201 482992249 484295197
675.1D84295197N32569J140137J444283J064148J086158P97882O40488Q66356M57993
$$ 484295197 484827766 485967903 487412186 488476334 489562492 490360374 491000862 491867218 492325211
683.8D92325211M22897J203232J793060R84383L72009K79617l45917N38369J111259
$$ 492325211 492748108 493951340 495744400 496728783 497100792 497380409 497034492 497572861 498684120
692.4D98684120R38111J196136N44548l8261R41314O08826q57201Q68721Q43659p89108
$$ 498684120 499622231 500818367 501362915 501324654 502265968 502874794 502017593 502886314 503729973 502940865
702.1E02940865N21965J198730P43561J092186J769409N75790j63307L48511O40755
$$ 502940865 503462830 504661560 505405121 506497307 508266716 508842506 508679199 509027710 509668465
710.8E09668465J128120M4365n24559r2621R10111J149940N19104P75719L05710J149673
$$ 509668465 510796585 510840950 510316391 510223770 511133881 512283821 512802925 513578644 513884354 515034027
720.4E15034027P27539n76744o44760l59230J663170J166191M35142J068421J307297
$$ 515034027 515761566 515184822 514540062 514180832 515844002 517010193 517445335 518513756 519821053
729.1E19821053K164840N56641n33409L70903K28958k13318J96114J038589J348457
$$ 519821053 521985893 522542534 522009125 522380028 522608986 522395668 522591782 523630371 524978828
737.8E24978828R36127j5945k5177K60276K26822P65458O10199j19744j063118p83844
$$ 524978828 525914955 525899010 525873833 526134109 526360931 527126389 527736588 527616844 526553726 525769882
747.4E25769882J371613J922493J355743R53179N97763J091690P62291m2572k35520
$$ 525769882 527141495 529063988 530419731 531372910 531970673 533062363 533824654 533782082 533546562
756.1E33546562l01056m63066K28996J889649K269211J906395J261787J199417O58303
$$ 533546562 533245506 532782440 533011436 534901085 537170296 539076691 540338478 541537895 542196198
764.8E42196198l61901N94406j11427p50160m24614m72527K57111M57382J191254J248855
$$ 542196198 541834297 542428703 542317276 541567116 541142502 540669975 540927086 541384468 542575722 543824577
774.4E43824577P98149n4817j545868j415481j80664J39198q2054J241608P14378J86500
$$ 543824577 544622726 544567909 543022041 541606560 541425896 541565094 541483040 542724648 543439026 543625526
784.1E43625526J224823O19278J04485n63011j16539P65304M96750o18782m24194J071205
$$ 543625526 544850349 545469627 545574112 545011101 544894562 545659866 546156616 545537834 545113640 546184845
793.7E46184845L74756k31896n59425L24631M28314j598282j403084m27780q48274
$$ 546184845 546559601 546327705 545768280 546092911 546521225 544922943 543519859 543092079 542243805
802.4E42243805j845474m52919Q1215l88489j67046j509208j786347j986236j795464
$$ 542243805 540398331 539945412 540026627 539638138 539471092 537961884 536175537 534189301 532393837
811.1E32393837j069222o83441q59070j362495k85950K36855J82838l38707l33862
$$ 532393837 531324615 530641174 529782104 528419609 528133659 528370514 528553352 528214645 527880783
819.7E27880783K42615M19731Q65135M27284Q70057J680526K948189L119698K010765
$$ 527880783 528123398 528543129 529408264 529835548 530705605 532386131 535334320 538454018 540464783
828.4E40464783K643814K227440J912117J821632K006569J902542J390991K116661
$$ 540464783 543108597 545336037 547248154 549069786 551076355 552978897 554369888 556486549
836.1E56486549K354165K517509J629219J351433J047363J054497J375046N65109J248588
$$ 556486549 558840714 561358223 562987442 564338875 565386238 566440735 567815781 568380890 569629478
844.8E69629478J091958J026992P75566O79741R72481R86405J308670O02378J430207
$$ 569629478 570721436 571748428 572523994 573203735 574176216 575162621 576471291 577073669 578503876
853.5E78503876K54593r14460M82521J884003K543564J327820J582832J062431N56412
$$ 578503876 578758469 577844009 578326530 580210533 582754097 584081917 585664749 586727180 587283592
862.2E87283592L33252j68762j04790j227035o88057j33896p2785o10847n04036j221
$$ 587283592 587616844 587448082 587343292 586116257 585428200 585294304 585221519 584610672 584106636 584105415
871.8E84105415r22928j021881j364135r93538p48558q23822j270752j149330K56576
$$ 584105415 583182487 582160606 580796471 579802933 579054375 578230553 576959801 575810471 576067047
880.5E76067047r1781k48681K97585K76451j471214j784363m71878n31197l48320p89566
$$ 576067047 575975266 575726585 576024170 576300621 574829407 573045044 572573166 572041969 571693649 570904083
890.2E70904083j93748N61371M62074j90010j86615R68857k79198j173859j240196
$$ 570904083 570710335 571271706 571733780 571543770 571357155 572326012 572046814 570872955 569632759
898.8E69632759q26073m53949n59120J13335N55839N74761K46315J973762K329293
$$ 569632759 568806686 568352737 567793617 567906952 568462791 569037552 569283867 571257629 573586922
907.5E73586922J359253J303024Q81424J548538J63574o88247m98810n91469p81784
$$ 573586922 574946175 576249199 577130623 578679161 578842735 578154488 577655678 577064209 576282425
916.2E76282425j568337j630249k657051k319755k008019j569671j292000k677994
$$ 576282425 574714088 573083839 570426788 568107033 566099014 564529343 563237343 560559349
923.9E60559349k507095k213364j867828k487412l225822k613106k206383k102279
$$ 560559349 558052254 555838890 553971062 551483650 548257828 545644722 543438339 541336060
931.6E41336060j853676j507263j685601o46667q44803j755409j127053j291236q67730
$$ 541336060 539482384 537975121 536289520 535642853 534798050 533042641 531915588 530624352 529756622
940.3E29756622m57649o1188k11143j175575j190644q34846M57344Q35953q2703l91884
$$ 529756622 529298973 529237785 529026642 527851067 526660423 525825577 526282921 527118874 527036171 526644287
949.9E26644287R5406J69182l62587o02952q11653l98140j027488j590424j428223
$$ 526644287 526739693 526908875 526546288 525943336 525131683 524733543 523706055 522115631 520687408
958.6E20687408j903724j717720j932030k051697j523971j571389k095871j787033
$$ 520687408 518783684 517065964 515133934 513082237 511558266 509986877 507891006 506103973
966.3E06103973p85713j085586j876641k045631j384506j704331l038139k235870j810723
$$ 506103973 505318260 504232674 502356033 500310402 498925896 497221565 494183426 491947556 490136833
975D90136833l141517l990632l372192k319374l377495l592720l181457m283104m205323
$$ 490136833 486995316 483004684 479632492 477313118 473935623 470342903 467161446 462878342 458673019
983.7D58673019l848495l492966l551063l753510m078712l675766j758118k391090
$$ 458673019 454824524 451331558 447780495 444026985 439948273 436272507 434514389 432123299
991.4D32123299l406906k909699j550064j458893k818489k361984k023812k160797
$$ 432123299 428716393 425806694 424256630 422797737 419979248 417617264 415593452 413432655
999.1D13432655k197647j732712j639900j510010j637878k208900j428528k004090
$$ 413432655 411235008 409502296 407862396 406352386 404714508 402505608 401077080 399072990
1006.8C99072990j570701p03278j515922j845246j422729j054764j554947j411934
$$ 399072990 397502289 396799011 395283089 393437843 392015114 390960350 389405403 387993469
1014.6C87993469j883507j462669j540680k353134j414185j624603j712837k024307
$$ 387993469 386109962 384647293 383106613 380753479 379339294 377714691 376001854 373977547
1022.3C73977547j487160j208382j807289j694069j557502m54369m75578l33176p31125
$$ 373977547 372490387 371282005 369474716 367780647 366223145 365768776 365293198 364960022 364228897
1031C64228897j012459j355819j057892O49643R2544Q32672R94149J386680J958924
$$ 364228897 363216438 361860619 360802727 361452370 361544914 362377586 363371735 364758415 366717339
1039.6C66717339J636695J379967O1531Q45185L89556j79748o31218p42683m30756
$$ 366717339 368354034 369734001 369795532 370640717 371030273 370850525 370219307 369476624 369045868
1048.3C69045868j488113p09343j399842p05070l09448j295929m02108k53715p04270
$$ 369045868 367557755 366848412 365448570 364743500 364434052 363138123 362736015 362482300 361778030
1057C61778030j044616R42230O86302K51961J006660J794205K626724J206856J769409
$$ 361778030 360733414 361675644 362361946 362613907 363620567 365414772 368041496 369248352 371017761
1065.7C71017761J580849J894493J418343R04007J242637l01208K86941k97012O96945
$$ 371017761 372598610 374493103 375911446 376815453 378058090 377756882 378043823 377746811 378443756
1074.4C78443756P13005q7929J257515K91825K76794K5139O56967M9668k74621J239281
$$ 378443756 379156761 379068832 380326347 380618172 380894966 380920105 381577072 381626740 381352119 382591400
1084C82591400J174469J379357R93042J862030P83424N24750J825332R60121L26157
$$ 382591400 383765869 385145226 386138268 388000298 388783722 389308472 391133804 392093925 392420082
1092.7C92420082R2354J678085J504555J613960Q72803m79851J946182J936188P43370
$$ 392420082 392512436 394190521 395695076 397309036 398181839 397701988 399648170 401584358 402327728
1101.4D02327728M38919R16024J230239O38123P50198J176644J779937Q21801N3749
$$ 402327728 402766647 403682671 404912910 405551033 406301231 407477875 409257812 410079613 410133362
1110D10133362O73599J379433P61299j15814N9890L73421Q42362M12788L47862J02654
$$ 410133362 410806961 412186394 412947693 412831879 412891769 413265190 414107552 414520340 414868202 414970856
1119.7D14970856q7319k56424k42157K47193j034050k23084Q33817O92978J028862
$$ 414970856 414883537 414627113 414384956 414632149 413598099 413375015 414208832 414901810 415930672
1128.4D15930672J509056J926689J026230J990242K306862J604232J111222J232757
$$ 415930672 417439728 419366417 420392647 422382889 424689751 426293983 427405205 428637962
1136.1D28637962K264595R59168J075134J767883J815148K280235J427956J313133
$$ 428637962 430902557 431861725 432936859 434704742 436519890 438800125 440228081 441541214
1143.8D41541214J082420m2114o46858k33231N42145O92749N11398n5999L6277M79241
$$ 441541214 442623634 442581520 441934662 441701431 442243576 442936325 443447723 443391724 443428001 443907242
1153.4D43907242M85802L72123k83012r94911r27925r95217r81178k04125j29699J94587
$$ 443907242 444393044 444765167 444482155 443487244 442559319 441564102 440582924 440378799 440249100 440443687
1163.1D40443687J051980J594009J845856J329689J185875J845703J850700J642838
$$ 440443687 441495667 443089676 444935532 446265221 447451096 449296799 451147499 452790337
1170.8D52790337K334671J731681K141228L453751K237587K019462L096924K715111
$$ 452790337 455125008 456856689 458997917 462451668 464689255 466708717 469805641 472520752
1178.5D72520752J339989Q38470R55963J529160K000580J563644J457367J761436J748696
$$ 472520752 473860741 474699211 475655174 477184334 479184914 480748558 482205925 483967361 485716057
1187.2D85716057J167793Q93517N66291j5296n19181l84979l2234l66020k18926k28004
$$ 485716057 486883850 487777367 488343658 488328362 487809181 487424202 487391968 487025948 486807022 486579018
1196.8D86579018l75328l07503l14369o29616j382065j249504r28650q37135o91948
$$ 486579018 486203690 485896187 485581818 484952202 483570137 482320633 481391983 480554848 479862900
1205.5D79862900o08292m24538m12902k37542l37486l24745K06909k29492r81979q56247
$$ 479862900 479254608 478830070 478417168 478179626 477842140 477517395 477724304 477494812 476512833 475656586
1215.1D75656586p32231m95491J35688j20735l77159J27602l7995o91757q47473p67670
$$ 475656586 474924355 474428864 474564552 474443817 474066658 474194260 474156265 473464508 472617035 471849365
1224.8D71849365j228866q59833j80321o75735o34194n93757o73943l37944k58293
$$ 471849365 470620499 469760666 469580345 468904610 468270416 467676659 467002716 466664772 466406479
1233.5D66406479k29225q42095o19468l7194k59857k89574o27784n08118r9831M6311
$$ 466406479 466177254 465335159 464715691 464678497 464418640 464129066 463501282 462993164 462893333 462939644
1243.1D62939644q78j73149j69143j65787R7542K4528m36744o91529k16675j8844l04032
$$ 462939644 462938766 462765617 462596474 462430687 462528229 462552757 462116013 461424484 461207809 461188965 460884933
1253.7D60884933j65329o67572m95567L89176M74700K06986K09389K48222K67L83225
$$ 460884933 460719604 460052032 459556465 459945641 460420341 460627327 460836716 461084938 461085205 461468430
1263.4D61468430N03997L29209K82173J62201K70881L89443P65610P49511P81250R35364
$$ 461468430 461972427 462301636 462583809 462746010 463016891 463406334 464171944 464921455 465702705 466638069
1273D66638069Q13408Q98781R80606R79423Q80242Q10203P39937R83620J188545J039162
$$ 466638069 467451477 468350258 469330864 470310287 471190529 472000732 472740669 473724289 474912834 475951996
1282.7D75951996J145286J430703J612625J562500J063499O14052N03807M81834R78356
$$ 475951996 477097282 478527985 480140610 481703110 482766609 483380661 483884468 484366302 485344658
1291.3D85344658Q31337N07355P30171J015549R77783L42788N97611O53610K00386
$$ 485344658 486175995 486683350 487413521 488429070 489406853 489749641 490347252 491000862 491201248
1300D91201248O9504K43568K80533k6207J37482k65694j81198K28157l78151j061363
$$ 491201248 491270752 491514320 491794853 491768646 491906128 491640434 491459236 491687393 491309242 490247879
1309.7D90247879o40144J90n94635n54657l31001k02827k976J38855O89697J25885
$$ 490247879 489607735 489607925 489013290 488458633 488127632 487924805 487921829 488060684 488750381 488876266
1319.3D88876266K29722P83920P32765P49245L84521L14026M07753K84538r1133j05514
$$ 488876266 489105988 489889908 490622673 491371918 491756439 492070465 492478218 492762756 492671623 492566109
1328.9D92566109j43433J35155P7400m71802j65329k72026k74620n23796m35295j10626
$$ 492566109 492422676 492557831 492635231 492163429 491998100 491726074 491451454 490927658 490492363 490381737
1338.6D90381737o42510J2551Q88557J117172P42646Q59909Q34503L26767O56700J69525
$$ 490381737 489739227 489751778 490640335 491757507 492500153 493360062 494194565 494521332 495178032 495347557
1348.2D95347557J1101j52283k4643k46811p96432j24398J42670J68076p7515K27318
$$ 495347557 495358658 495206375 495181732 494934921 494138489 494014091 494156761 494324837 494247322 494474640
1357.9D94474640l43933p66831o38656r86634J19820n96504j5907M86717l58200k04201
$$ 494474640 494130707 493363876 492725220 491738586 491858406 491261902 491245995 491732712 491374512 491170311
1367.5D91170311m86679j88446j56784l40538l06206o4964j19286n65491J23902j9837
$$ 491170311 490683632 490495186 490338402 489997864 489691658 489626694 489507408 488941917 489065819 489045982
1377.2D89045982J75286K63977L08227k97584j015244j060562j504097j104774r86786
$$ 489045982 489221268 489485245 489793472 489495888 488480644 487420082 485915985 484811211 483824425
1385.8D83824425q25577k147141r92736J07154j162109r47456j362915j319123k883644
$$ 483824425 482998848 480851707 479858971 479966125 478804016 477856560 476493645 475174522 472290878
1394.5D72290878l810882q32520j094475q58306k758561k305412n95360j528816j346664
$$ 472290878 468479996 467647476 466553001 465694695 462936134 460630722 460035362 458506546 457159882
1403.2D57159882j326333k463722k238311r97658j298256j815796j442261j292877
$$ 457159882 455833549 453369827 451131516 450133858 448835602 447019806 445577545 444284668
1410.9D44284668j059723j258049n50041k73934o21986q59375j436577L76549j912117
$$ 444284668 443224945 441966896 441416855 441142921 440520935 439661560 438224983 438601532 436689415
1419.6D36689415j067581J440239P25136O05468q53386Q57087J430244K52495Q10356
$$ 436689415 435621834 437062073 437787209 438392677 437539291 438396378 439826622 440079117 440889473
1428.3D40889473M73061O50253Q45337J570205J129876Q67157J962700J308898K27356
$$ 440889473 441362534 442012787 442858124 444428329 445558205 446425362 448388062 449696960 449924316
1437D49924316J246300K539635J535721J351967J525497Q95767J568527R30672J478539
$$ 449924316 451170616 453710251 455245972 456597939 458123436 459019203 460587730 461518402 462996941
1445.6D62996941J492080J055222M89693J051292J679344O19087J006699Q92906K076759
$$ 462996941 464489021 465544243 466033936 467085228 468764572 469383659 470390358 471283264 473360023
1454.3D73360023J786423M98162Q02993p67631L543281J949730K330895J397514Q01163
$$ 473360023 475146446 475644608 476447601 475679970 479223251 481172981 483503876 484901390 485702553
1463D85702553K583084J59836J474800K694168K409592J923027K190780K769661J051293
$$ 485702553 488285637 488445473 489920273 492614441 495024033 496947060 499137840 501907501 502958794
1471.7E02958794J227760J834526L017616L056755J411209J872559K345924J775208
$$ 502958794 504186554 506021080 509038696 512095451 513506660 515379219 517725143 519500351
1479.4E19500351J801491J488762O50558J524048J285782L60756R74998M62151O5269
$$ 519500351 521301842 522790604 523441162 524965210 526250992 526611748 527586746 528048897 528114166
1488.1E28114166J977730J141930j113434L32718O62079l69759n57747q91685n215187
$$ 528114166 530091896 531233826 530120392 530453110 531115189 530745430 530187683 529295998 524080811
1496.7E24080811N67855N65796k484398L1128K6703o42013p74727M03175k14996n922699
$$ 524080811 524648666 525214462 522730064 522761192 522787895 522145882 521371155 521774330 521559334 515636635
1506.4E15636635l856087J292992K362175K12555O82335n03312j482429L16925q19473
$$ 515636635 511780548 513073540 515435715 515648270 516330605 515827293 514344864 514661789 513842316
1515.1E13842316r46884k473870k590484K554321K773819p13082k893295j793J226578
$$ 513842316 512895432 510421562 507831078 510385399 513159218 512446136 509552841 509551048 510777626
1523.7E10777626J530418p16514P66868J043396k65083O71311J140823Q13103K77977
$$ 510777626 512308044 511591530 512358398 513401794 513136711 513808022 514948845 515761948 516039925
1532.4E16039925r0294j585350J693611J119728L23181J846733j971550m529037K770920
$$ 516039925 515949631 514364281 516057892 517177620 517500801 519347534 517375984 512846947 515617867
1541.1E15617867J330108m79584J811333R19304j748505J388245M19769L60527r21669
$$ 515617867 516947975 516468391 518279724 519199028 517450523 518838768 519258537 519619064 518697395
1549.8E18697395j116714J675033O88744J056671k856560q37211K339783K164306j960068
$$ 518697395 517580681 519255714 519944458 521001129 518144569 517307358 519647141 521811447 519851379
1558.5E19851379q258247J53847Q65135J467552m81491j035309k474365k010765l33481
$$ 519851379 511593132 511746979 512612114 514079666 513598175 512562866 510088501 508077736 507744255
1567.1E07744255j438408j114464p378196j233254j228332l070450k155495k056084
$$ 507744255 506305847 505191383 497813187 496579933 495351601 492281151 490125656 488069572
1574.9D88069572n27038j0987625j370964j476479l073501l256150m526634k906036
$$ 488069572 487542534 476554909 475183945 473707466 470633965 467377815 462851181 459945145
1582.6D59945145n023003l198700m191246l532867l295136m121513k440529m827309
$$ 459945145 454922142 451723442 447532196 443999329 440704193 436582680 434142151 429314842
1590.3D29314842k746849m594993l174286l627167m367790k119561m154243j658859
$$ 429314842 426567993 421973000 418798714 415171547 410803757 408684196 404529953 402871094
1598D02871094l608322j937256k815438k850074j607819m023857j384964k812462j047821
$$ 402871094 399262772 397325516 394510078 391660004 390052185 386028328 384643364 381830902 380783081
1606.7C80783081k922096j506577p52144k661247J05286j890068O0348j950569n6801
$$ 380783081 377860985 376354408 375602264 372941017 373046303 371156235 371216583 369266014 369209213
1615.4C69209213L65525n745659J330795q59757R75838r25827R86290o4468k189102
$$ 369209213 369574738 363829079 365159874 364300117 365275955 364350128 365336418 365271950 363082848
1624C63082848J659278o07719J290855r05609J125870R86404O99196P07245k16598
$$ 363082848 364742126 364134407 365425262 364519653 365645523 366631927 367331123 368038368 367821770
1632.7C67821770K057037J18065k39334p32651L122330J699638Q62160K217865N35393
$$ 367821770 369878807 369996872 369757538 369024887 372147217 373846855 374709015 376926880 377462273
1641.4C77462273K401771M96369K049827K125511j45263J973571j341095K393532J258698
$$ 377462273 379864044 380360413 382410240 384535751 384390488 386364059 385022964 387416496 388675194
1650.1C88675194L057823K994194j21765l105393J627007L813133R23920J847877J099587
$$ 388675194 391733017 394727211 394605446 391500053 393127060 396940193 397864113 399711990 400811577
1658.8D00811577J715393J764870J665992K527123m04091L349342K410012K453575
$$ 400811577 402526970 404291840 405957832 408484955 408080864 411430206 413840218 416293793
1666.5D16293793K523994K561493K223168Q38546M248162R08851L111649M056930K297821
$$ 416293793 418817787 421379280 423602448 424440994 428689156 429598007 432709656 436766586 439064407
1675.1D39064407J135254L186112M613800K968025L471069J688080L583183M769669
$$ 439064407 440199661 443385773 447999573 450967598 454438667 456126747 459709930 464479599
1682.9D64479599J669922J978378K191048O234321M278183L251725L985252K971153
$$ 464479599 466149521 468127899 470318947 476553268 480831451 484083176 488068428 491039581
1690.6D91039581L835411L297425L426590M303817M643135K82326M186630N389290
$$ 491039581 494874992 498172417 501599007 505902824 510545959 510828285 515014915 520404205
1698.3E20404205N260201M669914l248253N939942N018272L087273J718673K783928
$$ 520404205 525664406 530334320 527086067 533026009 538044281 541131554 542850227 545634155
1706E45634155K770195K847595L852158K023277J293793K264938K186509K115745m60090
$$ 545634155 548404350 551251945 555104103 557127380 558421173 560686111 562872620 564988365 564528275
1714.7E64528275l67699L846321L349647l840293K129440L615112K264366J405793
$$ 564528275 564160576 568006897 571356544 567516251 569645691 573260803 575525169 576930962
1722.4E76930962P11364N21736J100808J080513Q22906J402474K053642M5128L4332
$$ 576930962 577642326 578164062 579264870 580345383 581168289 582570763 584624405 584669533 584703865
1731.1E84703865K998352K824898j189385l806648L179131L291511J708832K744637
$$ 584703865 587702217 590527115 589337730 585531082 588710213 592001724 593710556 596455193
1738.8E96455193O14395j002007L951912L100090J009712J243019K505761K546196
$$ 596455193 597069588 596067581 600019493 603119583 604129295 605372314 607878075 610424271
1746.5F10424271K337875K043228J073761M473572K324371O64559M518432K905083
$$ 610424271 612762146 614805374 615879135 620352707 622677078 623341637 627860069 630765152
1754.2F30765152K658501L020439K04582J456871K468109K515717L864517l27148l66059
$$ 630765152 633423653 636444092 636648674 638105545 640573654 643089371 646953888 646626740 646260681
1762.9F46260681L758621K046051J353608J915664J548081k003174J418228L888092
$$ 646260681 650019302 652065353 653418961 655334625 656882706 654879532 656297760 660185852
1770.6F60185852J51749j995697p65992M092942K813644k56500K045593J032257J294098
$$ 660185852 660337601 658341904 657575912 661668854 664482498 664225998 666271591 667303848 668597946
1779.3F68597946M24118j385803R00269K100982J892090m49142K34527J848297Q51593
$$ 668597946 669022064 667636261 668536530 670637512 672529602 672080460 672314987 674163284 675014877
1788F75014877K52610J221923M49830N47637j305236j109696L416062J522293r2087
$$ 675014877 675267487 676489410 676939240 677486877 676181641 675071945 678488007 680010300 679918213
1796.7F79918213J645584K015839J71890j250000J346969l24478P31049J675186M34799
$$ 679918213 681563797 683579636 683751526 682501526 683848495 683524017 684255066 685930252 686365051
1805.3F86365051J007614O10505M59365R68934J206512j014481j48315O54068K00500
$$ 686365051 687372665 687983170 688442535 689411469 690617981 689603500 689455185 690109253 690309753
1814F90309753J113129J82419R55429N03006R10568J368637j754O00204n75638N82962
$$ 690309753 691422882 691605301 692560730 693063736 693974304 695342941 695341187 695941391 695365753 695948715
1823.7F95948715R78089k641678k06375K221756K106170K32315k531128Q39539K481384
$$ 695948715 696926804 694285126 694078751 696300507 698406677 698638992 696107864 696947403 699428787
1832.3F99428787K43378j79749J81961J92643j80664j76087J727295K61154L97797
$$ 699428787 699672165 699492416 699674377 699867020 699686356 699510269 701237564 701498718 701896515
1841G01896515O54220J323777J087646n504226J400222K251892m8980K975O06766J135940
$$ 701896515 702550735 703874512 704962158 699457932 700858154 703110046 703061066 703064041 703670807 704806747
1850.7G04806747K02027O11191K51541K91748J6479j92871J60217m62417J33819j297
$$ 704806747 705008774 705619965 705871506 706163254 706179733 705986862 706147079 705684662 705818481 705817184
1860.3G05817184O91834O07300O52694N67704j64337J50680m19311P64541j118469
$$ 705817184 706509018 707116318 707769012 708336716 708172379 708323059 707903748 708668289 707549820
1869G07549820j488419J331253J211396M74395k37350J020126O56967P1717l91464
$$ 707549820 706061401 707392654 708604050 709078445 708841095 709861221 710518188 710589905 710198441
1877.7G10198441m12369J21231l29743N50538K78472M93317j35803q5831R22241l7613
$$ 710198441 709786072 709907303 709577560 710128098 710406570 710899887 710764084 710678253 711600494 711562881
1887.3G11562881N31235n91888j565171M56620P57141K8686M57917L13339n68161R75952
$$ 711562881 712094116 711502228 709937057 710393677 711150818 711179504 711637421 711950760 711382599 712358551
1896.9G12358551L22418R5291Q7891n83115j96762j87301M13665j56555L66059M10080
$$ 712358551 712680969 712776260 712864151 712281036 712084274 711896973 712310638 712154083 712520142 712930222
1906.6G12930222j69220J88598P7667j30844m38766P03735k51159r7199K50244k6932
$$ 712930222 712761002 712949600 713027267 712896423 712457657 713161392 712910233 712813034 713063278 713036346
1916.2G13036346J482544j514358q27561J455918O23016K05231j084061n44128K61993
$$ 713036346 714518890 713004532 712176971 713632889 714255905 714461136 713377075 712832947 713094940
1924.9G13094940K12631k0523K22321K60620M66232L10593l73917l280l52249J6555
$$ 713094940 713307571 713287048 713509369 713769989 714236221 714546814 714172897 714169617 713817368 713833923
1934.6G13833923n00564l92990J10626j50604Q15582K67105J071548L4485k009964
$$ 713833923 713333359 712940369 713050995 712900391 713715973 713983078 715054626 715089111 713079147
1943.2G13079147N19638L50571m88129m15268K6780K1972J44654L31573J4877O0959
$$ 713079147 713598785 713949356 713461227 713045959 713072739 713094711 713239365 713570938 713585815 713646774
1952.9G13646774k0446J16195k23770r6130l25699m28009P8430m7073K34985K35062
$$ 713646774 713626328 713742523 713518753 713422623 713096924 712668915 712747345 712700272 712935257 713170319
1962.5G13170319L33404k28271k51160Q0414p47528o19736M1351K95868j42059L8452
$$ 713170319 713503723 713275452 713024292 713104706 712357178 711737442 711778793 712074661 711932602 711971054
1972.2G11971054J14822K52457M82102R5748J03913k90222K0141k17819k25601j28403
$$ 711971054 712085876 712338333 712820435 712916183 713020096 712729874 712750015 712532196 712306595 712178192
1981.8G12178192m77600L84674K65427R1858j80130Q6746R3078m73785K92816k45971
$$ 712178192 711700592 712085266 712350693 712442551 712262421 712349167 712442245 711968460 712261276 712015305
1991.5G12015305j200867o09512N05752K87018K3727L10746j2436L22342j04142k69470
$$ 712015305 710814438 710204926 710710678 710997696 711021423 711332169 711319733 711642075 711537933 711268463
2001.1G11268463m52652l04184Q8043m43496l82309k89078K34146J27564Q1558O3782
$$ 711268463 710815811 710511627 710599670 710156174 709773865 709484787 709718933 709846497 709928055 709991837
2010.7G09991837J2435J46790n24750K0218J7243l73993p79877l25546M60891j25732
$$ 709991837 710004272 710151062 709626312 709646530 709663773 709289780 708509903 708184357 708645248 708519516
2020.4G08519516J87302j6556M3259k3728k02103Q240n76401n34896l85209L32947
$$ 708519516 708706818 708690262 708733521 708709793 708507690 708515930 707939529 707404633 707019424 707352371
2030G07352371K5788k11640J68762J02234L04489m21676k82974k41395l53775k52838
$$ 707352371 707378159 707166519 707335281 707437515 707742004 707320328 707037354 706795959 706442184 706189346
2039.7G06189346j79443j40839j40533M63867l73154M7150M24347j27792j96686n43518
$$ 706189346 706009903 705869064 705728531 706192398 705819244 705866394 706290741 706162949 705966263 705422745
2049.3G05422745Q8272k69776k36053m04663m74701K74811J42975K54669N4626L30811
$$ 705422745 705511017 705241241 705005188 704600525 704125824 704400635 704543610 704798279 704852905 705183716
2059G05183716l97721m39224J15662m54712R4452j5335j06964p5531J46026J92948
$$ 705183716 704785995 704346771 704462433 704007721 704102173 704086838 703979874 703904343 704050369 704243317
2068.6G04243317K4566n264n77774l58658m26102K04392J64795j38626K70538j09558
$$ 704243317 704267883 704262619 703684845 703326187 702900085 703104477 703269272 703130646 703401184 703291626
2078.2G03291626L14255L5476j80435k33307l59268m17709k85874K61841q0642L78112
$$ 703291626 703605881 703641357 703460922 703227615 702868347 702450638 702164764 702426605 702345963 702724075
2087.9G02724075K69852O3019k69165n71442j9379l10211k46582n66559J05515L36838
$$ 702724075 702993927 703056946 702787781 702216339 702196960 701886749 701640167 701073608 701179123 701515961
2097.5G01515961n8594J95618m22669m0436r9792m7150j34506l05862k86713o22330
$$ 701515961 701457367 701652985 701230316 701189880 701090088 701042938 700908432 700602570 700315857 699693527
2107.2F99693527K70233J77994J66474P4005p7362M9362k93656j75705n49469l57589
$$ 699693527 699963760 700141754 700308228 700382233 700304871 700354233 700060577 699884872 699335403 698977814
2116.8F98977814m35944M578L30047O2485M11301k24228j37634j3504k31095m63791
$$ 698977814 698541870 698546448 698876495 698938980 699350281 699126053 698988419 698974915 698743820 698280029
2126.5F98280029l9291M79278k57797l03497j99432K54287O6529J59835N10407k5177
$$ 698280029 698240738 698720016 698462219 698158722 697959290 698213577 698280106 698439941 698950348 698925171
2136.1F98925171K6016n44662m49143j20086J03530K28348J99585K55051k74201r536
$$ 698925171 698951187 698406525 697957382 697837296 697940826 698169174 698368759 698623810 698349609 698340073
2145.8F98340073j25962K08435j8234m25262J0223l19672K15149J61133L22952L44773
$$ 698340073 698214111 698422546 698404312 697979050 697989273 697669601 697884750 698045883 698368835 698713608
2155.4F98713608L0975J755n60227l509j03455k12783k97776k32925L43399K01034
$$ 698713608 698744583 698746338 698186111 698182602 698079147 697866364 697568588 697335663 697679062 697880096
2165F97880096L01362J56631J39999k87780j91193J1368j83563P9574j72729K93426
$$ 697880096 698181458 698338089 698478088 698190308 697999115 698010483 697826920 697906494 697733765 698027191
2174.7F98027191N14527M53186Q0566J4725J87149n10025k31934k81906k67792j17721
$$ 698027191 698541718 698994904 699075470 699090195 699277344 698767319 698535385 698253479 697985687 697867966
2184.3F97867966K3575K94189K43530N26810J45416Q4000j71814j95770K0599l24097
$$ 697867966 697891541 698185730 698429260 698956070 699101486 699185486 699013672 698817902 698838501 698514404
2194F98514404j50985k5788J53427M8676K81982K54288J20392Q6365k86332n5999j07117
$$ 698514404 698363419 698337631 698491058 698539734 698821716 699076004 699196396 699282761 698996429 698940430 698833313
2204.6F98833313J1978k98233n3787J42364n4626P07703K76107q2702j62659J00632
$$ 698833313 698845291 698547058 698493271 698635635 698581009 699288712 699564819 699482117 699319458 699420090
2214.2F99420090j4191m00085k30179n42603K69242L43017J85394J77079R5672N39246
$$ 699420090 699405899 699005814 698775635 698233032 698502274 698845291 699030685 699207764 699303436 699842682
2223.9F99842682j28098l37219l49502j95771k76413k65426Q7509L30963P12128j16425
$$ 699842682 699714584 699377365 699027863 698832092 698555679 698290253 698377762 698708725 699420853 699304428
2233.5F99304428j57928k19880l52859L4790j25275j15509M6006M84008j13678J36338
$$ 699304428 699146500 698926620 698573761 698608551 698483276 698367767 698413773 698897781 698784103 698920441
2243.2F98920441L47213j43203J21460j94855j52283m49142j67542k0065j22681J96991
$$ 698920441 699267654 699124451 699245911 699051056 698898773 698449631 698282089 698262024 698139343 698336334
2252.8F98336334J26572K77939k18735R1782k18125m39224l8147p3776L01742l23333
$$ 698336334 698462906 698740845 698522110 698613892 698395767 697956543 697918396 697844620 698146362 697823029
2262.4F97823029j84937J4420M27246J24740l71246M96826N3177m4403l16925n4703
$$ 697823029 697638092 697652512 698079758 698204498 697833252 698330078 698383255 698338852 698021927 697967224
2272.1F97967224j80740j36643N61600k90680R6970j56555K19116Q3084o85501j07117
$$ 697967224 697786484 697649841 698211441 697920761 698017731 697861176 698080292 698163376 697477875 697370758
2281.7F97370758m86298K51542J79138L24249K47650k58636O1493m12064L13950m31214
$$ 697370758 696884460 697136002 697315140 697639389 697887039 697628403 697689896 697277832 697591782 697160568
2291.4F97160568m89807K33841m4174J66321k64664J81961j8005j19858k4872p4463
$$ 697160568 696670761 696904602 696860428 697026749 696762085 696944046 696926041 696806183 696781311 696706848
2301F96706848j67923k88009N55877r2239m3640n5542j60294J20316l50342O1264k32620
$$ 696706848 696538925 696250916 696806793 696714554 696670914 696615372 696455078 696575394 696225052 696286316 696053696
2311.6F96053696L89557L68423l08075k77634M044R35287L94898m883j040420j118088
$$ 696053696 696443253 696811676 696503601 696225967 696230011 697165298 697560196 697555313 696514893 695396805
2321.3F95396805K04773N13382R7198l52020O82907p4310k54212M9134k41089q0033
$$ 695396805 695601578 696114960 696212158 695860138 696543045 696468735 696214523 696263657 696022568 695942535
2330.9F95942535n80062M41436M6234k00805N6534o2867L67661J76926N60531K5788
$$ 695942535 695362473 695803909 695850143 695649338 695705872 695643005 696010666 696187592 696748123 696773911
2340.6F96773911p57142j078872l47367R90067j44043j476517j530609r88006Q43276
$$ 696773911 696016769 694937897 694590530 695580597 695436554 693960037 692429428 691441422 692284698
2349.2F92284698J686249Q25882R05228l61939l29895K84653o63452Q87756j21231
$$ 692284698 693970947 694796829 695702057 695340118 695010223 695294876 694631424 695519180 695397949
2357.9F95397949N5619L33404n95016j318360j43814J673660q28628n53208n21698
$$ 695397949 695453568 695786972 695191956 693873596 693729782 695403442 694574814 694021606 693499908
2366.6F93499908l75671j742554j552353J355744p17240o49719l74069m57840N94330
$$ 693499908 693124237 691381683 689829330 691185074 690467834 689818115 689444046 688986206 689580536
2375.3F89580536l5095n42069p38678n09796n30929k33689l32413j32675J3123l94821
$$ 689580536 689545441 689003372 688264694 687754898 687223969 686990280 686657867 686525192 686538315 686143494
2384.9F86143494K22397j63880m34341n09949l46222j53m43039m3182k67486j58692
$$ 686143494 686365891 686202011 685767670 685257721 684911499 684911346 684468307 684425125 684157639 683998947
2394.6F83998947L36990L35007L8681n50613n09110p54165m23279j59607j69525J84784
$$ 683998947 684335937 684670944 684709625 684159012 683649902 682895737 682472458 682312851 682143326 682328110
2404.2F82328110L61862J69525l52631k38113m66461m76608j62354j4191k83355p45697
$$ 682328110 682689972 682859497 682506866 682268753 681802292 681325684 681163330 681149139 680865784 680120087
2413.8F80120087l16239j28097O8207k1210J70822p1182o85654j17035l88183n06974
$$ 680120087 679803848 679675751 679743958 679722748 679893570 679822388 679136734 679019699 678631516 678124542
2423.5F78124542k40249q8120k97470m40445J6480R0179K37961n00031m65622l33633
$$ 678124542 677884293 677796173 677498703 677058258 677074738 677164917 677402878 676902847 676437225 676103592
2433.1F76103592p58362k69928l38287k42081k55051j2970j76315o04935o0882R7504
$$ 676103592 675345230 675075302 674737015 674494934 674239883 674226913 674050598 673445663 673384781 673482285
2442.8F73482285N6304m17633n32150m12216k58942j40762o5765J44348m56772l63846
$$ 673482285 673538589 673120956 672588806 672176590 671917648 671776886 671711121 671855469 671398697 671034851
2452.4F71034851k43454r5215m2953n94406n97153n03311o9657k20260q0185r842p30743
$$ 671034851 670791397 670696182 670653229 670058823 669461670 668958359 668888702 668668442 668588257 668578415 667847672
2463F67847672n16511p4920l510l08456k17362k65579n08652m19082J0605J81198p34558
$$ 667847672 667331161 667256241 667252731 666944275 666726913 666461334 665952682 665533600 665544205 665725403 664990845
2473.6F64990845o19355r5520n5770l37143n38941m10538n69686j70975k83890j84097
$$ 664990845 664371490 664275970 664220200 663883057 663344116 662933578 662363892 662192917 661909027 661724930
2483.3F61724930j40686n82123l14865l21274l78799l95050k89383m68521r2774p4005
$$ 661724930 661584244 661002121 660687256 660365982 659987183 659592133 659302750 658834229 658741455 658667450
2492.9F58667450p32269k86179m48913j71662n6152n44510l52554m39072m24194l26386
$$ 658667450 657935181 657649002 657200089 657028427 656972275 656427765 656075211 655636139 655211945 654885559
2502.6F54885559j2741k71988m63333k38266m10004o96487o74286p2174l12042k07672
$$ 654885559 654872818 654600830 654137497 653899231 653489227 652792740 652118454 652046280 651734238 651526566
2512.2F51526566j6709j85547N6153m48456p60956n94406k03018k48871k94571k62528
$$ 651526566 651509857 651324310 651380463 650932007 650171051 649576645 649373627 649124756 648830185 648567657
2521.9F48567657m59594r0561j3275n7373l58124j83869j42822p48825o20346l27911
$$ 648567657 648108063 648017502 648004227 647946854 647588730 647404861 647262039 646513214 645892868 645564957
2531.5F45564957l01209o37359k5864M6387n46418k42767k05688L3798q4534l91540
$$ 645564957 645263748 644626389 644600525 644646912 644100494 643857727 643652039 643685837 643601303 643209763
2541.1F43209763q33359o21185k3270n18952m55246p5912p706l66058j78375l6316
$$ 643209763 642376404 641755219 641731949 641212997 640757751 640681839 640674133 640308075 640129700 640093384
2550.8F40093384m55513l96805o31790m09050l53813k99607l86543m06189K37312k06184
$$ 640093384 639637871 639241066 638609276 638200226 637846413 637546806 637160263 636754074 636991386 636785202
2560.4F36785202l78075k33917l13225n05905l75328q6250n37033m51470k03666n1346
$$ 636785202 636407127 636173210 635859985 635354080 634978752 634892502 634355469 633903999 633700333 633648987
2570.1F33648987l11394j91193J46752l50990o13251p01218k09617o9390l56331o07414
$$ 633648987 633337593 633146400 633293152 632942162 632328911 631627693 631418076 631348686 630992355 630384941
2579.7F30384941j75552K41661o37322m46205j87721j53160k88162n52826l4790j46981
$$ 630384941 630209389 630451050 629813728 629367523 629179802 629026642 628738480 628185654 628150864 628003883
2589.4F28003883n69839j006165m69818l1395J28708J02730o56548k78511l61900l53279
$$ 628003883 627434044 626427879 625958061 625926666 626055374 626158104 625501556 625223045 624861145 624507866
2599F24507866j85165m11721m51698m89769O1188l60909n19905l63159k27890n0621
$$ 624507866 624322701 623910980 623459282 622969513 623030701 622669792 622149887 621786728 621558838 621508217
2608.6F21508217n92308k51160k09617m25873m98543m12254m8561l85476o98890m11682
$$ 621508217 620915909 620664749 620455132 620029259 619530716 619118462 619069901 618684425 617985535 617573853
2618.3F17573853n3978m46320k22321j91307o18820k40135m27322m67797m04968m91104
$$ 617573853 617519875 617073555 616851234 616659927 616041107 615800972 615373650 614905853 614500885 614009781
2627.9F14009781m02260l32260k62261k36854l62320o63490j78757j4496k80990o89583
$$ 614009781 613607521 613275261 613013000 612776146 612413826 611750336 611571579 611557083 611276093 610586510
2637.6F10586510r36318l33519j23291O8321j91764n75981n30777n77431l92266j00517
$$ 610586510 609650192 609316673 609193382 609261703 609069939 608493958 607963181 607385750 606993484 606892967
2647.2F06892967J20735m78363o58798k86445l59803n07469n25055m9743n6115m55780
$$ 606892967 607013702 606535339 605876541 605590096 605230293 604722824 604197769 604148026 604091911 603636131
2656.9F03636131m86679k76222k89574l11355l96080o99883k44713j18179l87688l31268
$$ 603636131 603149452 602873230 602583656 602272301 601876221 601176338 600931625 600813446 600425758 600094490
2666.5F00094490j39313k5329l00141k94113O943n455n57098n06211o6833Q2588k64168
$$ 600094490 599955177 599929848 599629707 599335594 599342537 599337082 598779984 598273773 598206940 598289528 598025360
2677.1E98025360p16743l02849m46816l99589k55051j75361J02729m79774l74146m39872
$$ 598025360 597308617 597005768 596558952 596159363 595904312 595728951 595831680 595351906 594977760 594537888
2686.8E94537888m71650r6893j03226j46064o12488o08978l40500P0686Q7242j41563
$$ 594537888 594066238 593969345 593866119 593720055 593107567 592498589 592158089 592228775 592316017 592174454
2696.4E92174454l78571o46248k76565m33235j44730k8954l94783j47934q6212k01530
$$ 592174454 591795883 591149635 590873070 590439835 590295105 590266151 589871368 589723434 589637222 589435692
2706E89435692n89562m05616P9193P8926n69878n63850J716k36435k40478n48935k66724
$$ 589435692 588846130 588440514 588519707 588598633 588028755 587464905 587466621 587230186 586989708 586440773 586174049
2716.6E86174049P7286k16446m04587m54750K78588q2131k71187j01852m66270l44696
$$ 586174049 586251335 586034889 585630302 585175552 585454140 585372009 585100822 584998970 584532700 584188004
2726.3E84188004l39127r9220k93999r6664J54533j46217j16768j19858l8605m68254
$$ 584188004 583848877 583749657 583455658 583358994 583513527 583367310 583250542 583130684 583092079 582623825
2735.9E82623825n83000j95160L4904k87933l95775j74713l91998K81677K29302l31231
$$ 582623825 582040825 581845665 581880569 581592636 581196861 581022148 580630150 580911827 581141129 580809898
2745.6E80809898k29644k71035m00123l98598M1046j34964q8692q3236j48926Q7662
$$ 580809898 580580254 580309219 579909096 579510498 579551544 579416580 579327888 579244652 579095726 579183388
2755.2E79183388k76718m05426n33600k64511l22457l85856j64109k88086k632j33972
$$ 579183388 578906670 578501244 577967644 577703133 577380676 576994820 576830711 576542625 576539993 576406021
2764.9E76406021Q6479p972l82157k88811k76565k71301m22707P2212k17933n43480
$$ 576406021 576492500 576484528 576102371 575813560 575536995 575265694 574842987 574915199 574697266 574153786
2774.5E74153786l51715k38343J03455m96368p21550n56527j00479j76315p69997l47824
$$ 574153786 573802071 573563728 573667183 573170815 572449265 571892738 571792259 571615944 570845947 570498123
2784.2E70498123j36947l1510j45302J374k47307p10564k46391l04833l59001m89349
$$ 570498123 570361176 570329666 570184364 570185738 569938431 569227867 568981476 568676643 568317642 567828293
2793.8E67828293n54352n01442k80495M3602n61447q42552o43425l95431l43438m35638
$$ 567828293 567273941 566772499 566492004 566535606 565974159 565131607 564488182 564092751 563749313 563313675
2803.4E63313675m75121m52156l54881n16129l76319n33791p79686o89163m21944j84135
$$ 563313675 562838554 562386398 562031517 561515388 561139069 560605278 559825592 559136429 558714485 558530350
2813.1E58530350m22707o47049r27620o49109l38058l40233n86700j106377o98509
$$ 558530350 558107643 557460594 556532974 555883865 555545807 555205574 554618874 553512497 552813988
2821.8E52813988l48435k85530l62358o36673p45849p22886l75557n30929p91435p39441
$$ 552813988 552465553 552180023 551817665 551180992 550435143 549712257 549336700 548805771 548014336 547274895
2831.4E47274895o40908p30552r04122p50503p24144p23648p77245p37190q17871j442642
$$ 547274895 546633987 545903435 544999313 544248810 543524666 542801018 542023773 541286583 540468712 539026070
2841.1E39026070j980248j613464j066971j359253j419258j385307j541367j643715
$$ 539026070 537045822 535432358 534365387 533006134 531586876 530201569 528660202 527016487
2848.8E27016487j531181r47533r25407j062737o77261k09999k93846l46871L4905
$$ 527016487 525485306 524537773 523612366 522549629 521872368 521662369 521368523 521021652 521056557
2857.4E21056557j31684n23986m04511K23885K23808M5700j93863q86307n73616m45251
$$ 521056557 520924873 520400887 519996376 520220261 520444069 520489769 520295906 519409599 518835983 518390732
2867.1E18390732p33681o02493n36003n69077p53784m61159l39393o80085m25605j36834
$$ 518390732 517657051 517054558 516518555 515949478 515195694 514734535 514395142 513715057 513289452 513152618
2876.7E13152618k21786j70364n03045j153640j186982n83686l34320n76745l08723
$$ 513152618 512930832 512760468 512257423 511103783 509916801 509333115 508998795 508422050 508113327
2885.4E08113327p06596j204453q59756p48711l17039j91346k59475q01888j404571
$$ 508113327 507406731 506202278 505342522 504593811 504276772 504085426 503825951 503024063 501619492
2894.1E01619492q00667o06003n68657o47774p27691n03807n52330m44336l43171m39186
$$ 501619492 500818825 500212822 499644165 498996391 498268700 497764893 497212563 496768227 496425056 495985870
2903.7D95985870p77664p41882q76465o54488k02827q79021r43756j007385r23538
$$ 495985870 495208206 494466324 493589859 492935371 492732544 491853523 490909767 489902382 488978844
2912.4D88978844n66483j165047j185226j024857j244621j064644p75337j196442j563377
$$ 488978844 488412361 487247314 486062088 485037231 483792610 482727966 481952629 480756187 479192810
2921.1D79192810q12530o6948l47062o42433k0866K62604Q697m46701l61099N01785
$$ 479192810 478380280 478313332 477966270 477323837 477302971 477565575 477574272 477127571 476766472 477268257
2930.7D77268257M61121q8501J1406P72094Q43201K96936J34049K22664O01615Q24738
$$ 477268257 477729378 477640877 477652283 478424377 479267578 479564514 479698563 479921227 480522842 481347580
2940.4D81347580O94275N2109L17993R83314O61736N76362J79100l318O71692J009750
$$ 481347580 482041855 482093964 482411957 483395271 484057007 484633369 484812469 484809151 485480843 486490593
2950D86490593K69203j36947M22630L14598J81618J14708L9062k6398L27759J095314
$$ 486490593 486759796 486622849 487045479 487360077 487541695 487656403 487695465 487669067 487996826 489092140
2959.7D89092140O78368R2621P1792Q20580R65614J63193K24342K88735M73938P21702
$$ 489092140 489770508 489863129 489934921 490755501 491721115 491884308 492108650 492397385 492871323 493593025
2969.3D93593025O21453O27021Q41217R20792L61519j55563K5367N90439L54271p3738
$$ 493593025 494214478 494841499 495682716 496603508 496965027 496809464 496834831 497425270 497779541 497705803
2979D97705803m8027J78833O49109N69229K89421K03323L10479J18179o3248K09007
$$ 497705803 497657776 497836609 498485718 499054947 499344368 499547691 499858170 499976349 499913101 500122108
2988.6E00122108J3504l16314k95983O9237k9259L2044M65355M3030l23563m55437
$$ 500122108 500135612 499819298 499523315 499592552 499563293 499595337 500060692 500103722 499780159 499324722
2998.2D99324722m53376n75867p39021m99497j35612J55639k38647m91944n15251n80864
$$ 499324722 498871346 498295479 497556458 497056961 496921349 497076988 496838341 496346397 495831146 495250282
3007.9D95250282j67312j26572n03349n83573o56624n15823k67105p20291l48854L65410
$$ 495250282 495082970 494956398 494453049 493869476 493212852 492697029 492429924 491709633 491360779 491726189
3017.5D91726189j09024o40107j016426q85963m25797K2202j10283p60651p27081o87294
$$ 491726189 491617165 490977058 489960632 489074669 488648872 488671074 488560791 487800140 487073059 486385765
3027.2D86385765o15311o84852q03681n61523m86679k26593j89819n64080p84225n83382
$$ 486385765 485770454 485085602 484281921 483720398 483233719 483007126 482817307 482253227 481469002 480885620
3036.8D80885620n07164p56645o90651l45383l28407n77049m49181o24084r23043r69810
$$ 480885620 480378456 479621811 478931160 478585777 478257370 477680321 477231140 476607056 475684013 474714203
3046.5D74714203p86247k15683l29666o44188q53806j067314n58014j68114m87709
$$ 474714203 473927956 473712273 473382607 472738419 471884613 470817299 470259285 470091171 469603462
3055.1D69603462n60875n62057q40454n19066l55835l80287l39394m52881n55343r60885
$$ 469603462 469042587 468480530 467640076 467121010 466765175 466384888 466045494 465592613 465037270 464076385
3064.8D64076385n84678l68157o04438m38462m66118n80368r55963p10830m06342n00679
$$ 464076385 463491707 463123550 462519112 462080650 461614532 461034164 460078201 459367371 458961029 458460350
3074.4D58460350k43645k24189m65737p55730n58776l72429k07291j26839n76362p67517
$$ 458460350 458216705 457992516 457526779 456771049 456212273 455839844 455632553 455505714 454929352 454161835
3084.1D54161835p59011l63502l85933r86176r54132m70237n38369q13369k22550j17454
$$ 454161835 453402824 453039322 452653389 451667213 450713081 450242844 449704475 448891106 448668556 448551102
3093.7D48551102m79317n97839n34058k13776l92837m50936n92498r57375p65610j97754
$$ 448551102 448071785 447473946 446939888 446726112 446333275 445882339 445289841 444332466 443566856 443369102
3103.4D43369102j335p49321j109466m96330j97640l76358l42712n88227p07130n35812
$$ 443369102 443367767 442618446 441508980 441012650 440815010 440438652 440095940 439507713 438800583 438264771
3113D38264771p48330n61485n46989m77410j43814m43992o82831q02117n85518p39250
$$ 438264771 437516441 436954956 436407967 435930557 435786743 435342751 434659920 433857803 433272285 432533035
3122.6D32533035j184501m41513k12365p66792p86133p50885n12619l25279m45976
$$ 432533035 431348534 430907021 430694656 429927864 429141731 428390846 427878227 427552948 427106972
3131.3D27106972k15225l00713p13539n70679l47595n83077n40924o47354j515693
$$ 427106972 426891747 426591034 425877495 425306816 424959221 424376144 423835220 423187866 421672173
3140D21672173j014214l8490m20227q86917n55153L8299n61218q91571k15988j57051
$$ 421672173 420657959 420619469 420199242 419312325 418757172 418795471 418234253 417342682 417126694 416969643
3149.6D16969643p35169j065788o42967q75054r71069l39737k26631l40958q25386
$$ 416969643 416234474 415168686 414525719 413650665 412679596 412339859 412113228 411772270 410946884
3158.3D10946884q85162n04532n18723p52029q48770o44455m46434l05824o45791r54589
$$ 410946884 410061722 409557190 409038467 408286438 407437668 406793213 406346779 406040955 405395164 404440575
3168D04440575n21546r1667m60548q93364p88079o97822m42352l67012n85480q26607
$$ 404440575 403919029 403827362 403366814 402473450 401685371 400987549 400545197 400178185 399592705 398766098
3177.6C98766098o87790n25551p09991k46086k60353p65267r27810q04940n18417o71349
$$ 398766098 398078308 397552757 396842766 396596680 396336327 395571060 394643250 393838310 393319893 392648544
3187.3C92648544l12996J52016l45535j083641o45142j60827r63860j068306l59497
$$ 392648544 392335548 392487564 392142029 391058388 390413246 390252419 389288559 388220253 387860756
3195.9C87860756l80325j133728n95284J25389l79333j76125l14789q69026r79042
$$ 387860756 387480431 386346703 385751419 385876808 385497475 385321350 385006561 384137535 383158493
3204.6C83158493o54793k63939m10308k84958n02892q61931p88040k03819j30158j049652
$$ 383158493 382503700 382239761 381829453 381544495 381041603 380179672 379391632 379187813 379057655 378008003
3214.3C78008003o84547j56212n19066o19926o02723p86895m25530J4611n16320o44798
$$ 378008003 377323456 377167244 376648178 376028252 375425529 374638634 374213104 374227715 373711395 373066597
3223.9C73066597l30200j94893m39835p56340l91197l11851p20978r38149k54631J92147
$$ 373066597 372736397 372541504 372101669 371345329 370954132 370642281 369921303 368983154 368728523 368920670
3233.5C68920670m15421o68220o39077n45883k98843m01841p69004n59388k63443k73056
$$ 368920670 368505249 367837029 367197952 366652069 366353226 365951385 365182381 364622993 364359550 364086494
3243.2C64086494j00631k11830n54276n56869n92690q91685l47977k63481p79877l97644
$$ 364086494 363985863 363774033 363219757 362662888 362070198 361178513 360830536 360567055 359787178 359389534
3252.8C59389534l61557j3886j01203l14560K66723k85034j002769q56667j58348j28822
$$ 359389534 359027977 359014091 358912888 358598328 358865051 358580017 357577248 356720581 356562233 356433411
3262.5C56433411k24266m63448r09500j23329j23253m25530l18298k69699m78973n69420
$$ 356433411 356209145 355745697 354836197 354712868 354589615 354164085 353845787 353576088 353097115 352527695
3272.1C52527695Q9874n15976m51317j49765p93419n11551n8975O10352n1232r41696
$$ 352527695 352617569 352101593 351650276 351500511 350707092 350195541 350136566 350746918 350695686 349753990
3281.8C49753990k37274J90620l03840q82569m87518L8567k13509p23076j81732K75650
$$ 349753990 349516716 349707336 349403496 348520927 348033409 348071976 347858467 347135391 346953659 347229309
3291.4C47229309k42309k73552j95275k34527p28798o85082m51164o48651P6256J16386
$$ 347229309 346987000 346713448 346518173 346283646 345554848 344869766 344418602 343769951 343846207 343962593
3301C43962593k0981P553o64749o79054j82800j19553l64914o99501j074562m80690
$$ 343962593 343941612 343949165 343284416 342605362 342422562 342303009 341938095 341238594 340164032 339683342
3310.7C39683342K38228J68075k48985n62019m84810r21974p71065j67046j69334l25661
$$ 339683342 339921570 340089645 339840660 339278641 338793831 337871857 337100792 336933746 336764412 336438751
3320.3C36438751m25339l79028n92499k10876j71623o20270o35643o10046m05198p60765
$$ 336438751 336013412 335634384 335041885 334831009 334659386 334039116 333403473 332793427 332388229 331627464
3330C31627464l58467K3842l81660l54729o08673l28980l03039p79877p68204q07762
$$ 331627464 331268997 331292839 330911179 330556450 329947777 329618797 329315758 328535881 327767677 326959915
3339.6C26959915q55179k47764K03590r09843j141930n48973l34930j99585m39949
$$ 326959915 326104736 325856972 326060562 325150719 324008789 323459816 323124886 322925301 322485352
3348.3C22485352J17797j56517p82241m51851n52941o01425k02007J65462n72529o61773
$$ 322485352 322603149 322446632 321664391 321212540 320659599 320058174 319856167 320021629 319449100 318787327
3357.9C18787327J51424l31116n94711k38838l60584l25928J0891l82118n02148q2054
$$ 318787327 318938751 318607635 318012924 317774086 317413502 317087574 317098465 316716347 316214199 316132145
3367.6C16132145m41780p10373n53188l6908j16634m92249o8874k17056m50115j82839
$$ 316132145 315690365 314979992 314426804 314389896 314273262 313781013 313712139 313495083 313044968 312862129
3377.2C12862129j23367l85513k98653J21632K9983m56810n86452L58524K35577n87044
$$ 312862129 312738762 312353249 312054596 312176228 312206211 311749401 311162949 311521473 311757050 311170006
3386.9C11170006k92835l31612k39925k62890l42617m5662j2875p3471l0498M89692
$$ 311170006 310877171 310545559 310305634 310042744 309700127 309654465 309641590 309568119 309537621 310027313
3396.5C10027313J2112l69167J68953k5330j65730m93049n36080m80022j31455M17843
$$ 310027313 310039425 309670258 309839211 309813881 309648151 309155102 308619022 308139000 308007545 308425388
3406.2C08425388M0436M66290J42173n90210O6853J98002M8351k80495m08916o0158
$$ 308425388 308465824 308932114 309074287 308484077 308550930 308748932 308797283 308516788 308107872 308047714
3415.8C08047714K54612K97566n0927R022J88465N25132L59516j78795J10836P3719
$$ 308047714 308302326 308599892 308548965 308557987 308746452 309271584 309631100 309452305 309563141 309636860
3425.5C09636860M2839K68917M0798K11964L50113K23770M12617J30520L6659M05884
$$ 309636860 309679699 309948616 309989414 310201378 310551491 310775261 311187878 311318398 311355057 311760941
3435.1C11760941K51922n6095k44923K55986L87287L04775N16529q1100L91082N92251
$$ 311760941 312012863 311956768 311711845 311967831 312355118 312659893 313176422 313095322 313486404 314078655
3444.7C14078655M84600N63526n45749L62758R01204O81820R70058J88446K36816P19510
$$ 314078655 314563255 315126781 314581032 314943790 315844994 316526814 317496872 317685318 317922134 318641644
3454.4C18641644O19335L62453K83203M72203N70106M41589k8305N68619Q87184K59018
$$ 318641644 319260979 319623432 319906635 320378838 320948944 321390533 321362228 321930847 322818031 323077049
3464C23077049O07186J146087O33240j28632O2523L80860J078834J049462K86903O71082
$$ 323077049 323684235 324830322 325463562 325334930 325397453 325778313 326857147 327906609 328193512 328864594
3473.7C28864594P16896L97491M17328R71794J022873K19841M24347P21512L31497
$$ 328864594 329581490 329978981 330396309 331368103 332390976 332610817 333035164 333756676 334088173
3482.3C34088173L68996J284523J193428P00454Q26683J81275N47180R31129P50275
$$ 334088173 334457169 335741692 336935120 337635574 338462257 338643532 339190712 340121841 340872116
3491C40872116O60057L83606J114693R87053M03442O83136P62444N42411L91388J077423
$$ 340872116 341532173 341915779 343030472 344017525 344420967 345104103 345866547 346408958 346800346 347877769
3500.7C47877769J387253P82738L44505J13259K75764J069222J455688R66835J08071
$$ 347877769 349265022 350047760 350392265 350505524 350781288 351850510 353306198 354273033 354381104
3509.4C54381104J20849J567078J293564K26593Q48426Q52166L61137Q00705J288109
$$ 354381104 354501953 356069031 357362595 357589188 358437614 359289780 359650917 360451622 361739731
3518C61739731J342506R76334P96547J324119R03817l11013M14276J373902J377525
$$ 361739731 363082237 364058571 364855118 366179237 367083054 366772041 367186317 368560219 369937744
3526.7C69937744J163750O51283M14772R94682N93720Q99315J778908O30188J100654
$$ 369937744 371101494 371752777 372167549 373162231 373755951 374655266 376434174 377064362 378165016
3535.4C78165016J302910M27437J304207R89990J036797J262016J255073J169320J000442
$$ 378165016 379467926 379895363 381199570 382189560 383226357 384488373 385743446 386912766 387913208
3544.1C87913208R38873O76880J297951J83296J037903J979408K051354K117576m94690
$$ 387913208 388852081 389528961 390826912 391010208 392048111 394027519 396078873 398196449 397701759
3552.7C97701759L97377Q86002J604118K488289P16973J426963J295204P78237J029549
$$ 397701759 398099136 398985138 400589256 403077545 403794518 405221481 406516685 407294922 408324471
3561.4D08324471K047195J489677O80275L811493J511765l1510L95317n21621K757759
$$ 408324471 410371666 411861343 412541618 416353111 417864876 417833366 418228683 417707062 420464821
3570.1D20464821J537628J349030K070770J874504J368446J424790J931915J99738
$$ 420464821 422002449 423351479 425422249 427296753 428665199 430089989 432021904 432221642
3577.8D32221642J713180K125549J539650J805306J288833J460228J166916M036293
$$ 432221642 433934822 436060371 437600021 439405327 440694160 442154388 443321304 447357597
3585.5D47357597K311173j546517J489220k77595K069168K481842K881126K058525
$$ 447357597 449668770 448122253 449611473 449333878 451403046 453884888 456766014 458824539
3593.2D58824539N68657K778587k69966K459183L754349Q79326K690048R92165R04197
$$ 458824539 459393196 462171783 461901817 464361000 468115349 468994675 471684723 472676888 473581085
3601.9D73581085K197914J829796K141113K764550K741928m88320K649651J32217q47663
$$ 473581085 475778999 477608795 479749908 482514458 485256386 484768066 487417717 487549934 486702271
3610.6D86702271O839637K268486j732368L733215m74777L026733N233574J365242
$$ 486702271 493541908 495810394 494078026 497811241 497336464 500363197 505596771 506962013
3618.3E06962013J550865j31912J669197L495369K047539J900978K336197J483269
$$ 506962013 508512878 508380966 510050163 513545532 515593071 517494049 519830246 521313515
3626E21313515K470092P904397L231430j1232071K235145N519905O278420J480827
$$ 521313515 523783607 531688004 534919434 523687363 525922508 531442413 537720833 539201660
3633.8E39201660j696396K975426L417473K500038J054459J986961K865982K504730
$$ 539201660 537505264 540480690 543898163 546398201 547452660 549439621 552305603 554810333
3641.5E54810333J182823M89502K580185L595620O198539J94969m630775N987854K384682
$$ 554810333 555993156 556482658 559062843 562658463 568857002 569051971 564421196 570409050 572793732
3650.1E72793732k309990j735115N210266N205879L505783N656700o330719O8741N262413
$$ 572793732 570483742 568748627 573958893 579164772 582670555 588327255 581996536 582065277 587327690
3658.8E87327690J636353K556724J517067K083168J688576J151733J166382M63028
$$ 587327690 588964043 591520767 593037834 595121002 596809578 597961311 599127693 599590721
3666.5E99590721M499855L507538k30446m30374o978378J969299P924690R008103K665443
$$ 599590721 604090576 607598114 607367668 606937294 599958916 601928215 609852905 618861008 621526451
3675.2F21526451j7441940j69335P922974N829086j350670l56330K526016K199249
$$ 621526451 604084511 603915176 611838150 617667236 616316566 615960236 618486252 620685501
3682.9F20685501J567764j68991N6572M269982P177391p706147n385818Q175964l792190
$$ 620685501 622253265 622084274 622140846 626410828 633588219 625882072 620496254 628672218 624880028
3691.6F24880028j444512M646683Q80852J847725Q85620K8114R98612q2093K415505
$$ 624880028 623435516 628082199 628963051 630810776 631696396 631724510 632723122 632641029 635056534
3700.3F35056534L661194m482231l666382M033508J792793j85013J46103K722054M821663
$$ 635056534 638717728 634235497 630569115 634602623 636395416 636210403 636356506 639078560 643900223
3709F43900223p017136K571716O430588j2628364K133712M424782N29785N71213J903076
$$ 643900223 636883087 639454803 645885391 633257027 635390739 639815521 640345306 640916519 642819595
3717.7F42819595J091462k953263J405792O101685l143845n822067M369736K004089
$$ 642819595 643911057 640957794 642363586 648465271 645321426 639499359 643869095 645873184
3725.4F45873184J67237k222367l20587L307114O21948N922470j028748q446197P807617
$$ 645873184 646040421 643818054 643497467 646804581 647426529 653348999 652320251 643874054 651681671
3734F51681671K10724r387665j24588J649857K79007K135772M183121k411651J855163
$$ 651681671 651892395 642504730 642380142 644029999 644309006 646444778 650627899 648216248 650071411
3742.7F50071411J1885834n867615j9640045Q293762N374680N253143l151169r542007
$$ 650071411 661957245 656089630 636449585 644743347 650118027 655371170 652220001 642677994
3750.4F42677994J2196426k666626r967422M594269M383544L586731m844970J573257
$$ 642677994 654874420 652207794 642240372 646834641 651218185 654804916 649959946 651533203
3758.2F51533203N592880p675628k019882M463729J892701P97653L274994l079148
$$ 651533203 657126083 649450455 647430573 651894302 653787003 654584656 657859650 654780502
3765.9F54780502n335617L532334N875320J484757q935700M29611L059082o1035M74014
$$ 654780502 649444885 652977219 658852539 660337296 651401596 651831207 654890289 654829254 655303268
3774.5F55303268r9334J278381K41928J774445P01446o816101J753159K393188Q74710
$$ 655303268 655203934 656482315 656724243 658498688 659200134 652384033 654137192 656530380 657405090
3783.2F57405090J540451l287658o17295J758881O73141Q32673k4720k03170m39377
$$ 657405090 658945541 655657883 655040588 656799469 657472610 658305283 658280563 658077393 657638016
3791.9F57638016j24970l62243J432495K981262m244919m462051K206115M783020O854477
$$ 657638016 657513046 657150803 658583298 661564560 657319641 652857590 655063705 659846725 666701202
3800.6F66701202n159607j2623901L426361L797836M258118N941849q900986o002197
$$ 666701202 661541595 648917694 652344055 656141891 660400009 666341858 657440872 651438675
3808.3F51438675N189896K761459J58996R3842m55551N95779N498734m51355j3963776
$$ 651438675 656628571 659390030 659549026 659642868 659187317 659783096 665281830 664830475 650866699
3817F50866699M358444N836564M614868L004455j6451568r51233M572906K229615L036575
$$ 650866699 655225143 661061707 665676575 668681030 652229462 651278229 655851135 658080750 661117325
3825.7F61117325M41360m660721l92150K271576L601837J527023q792267K055435P349778
$$ 661117325 661558685 656897964 656505814 658777390 662379227 663906250 655113983 657169418 664519196
3834.3F64519196m915390j055985P690048q168716n842133P678452l948593n6153P277832
$$ 664519196 659603806 658547821 666237869 658069153 652227020 659905472 655956879 655900726 663178558
3843F63178558j929855m420624K050934J826782r079J225281j173553J417465O603470
$$ 663178558 661248703 656828079 658879013 660705795 660696716 661921997 660748444 662165909 668769379
3851.7F68769379m463730m70581j6011505r0866J1654205M92935k360001K217713L091430
$$ 668769379 664305649 663835068 647823563 647732697 659386902 659879837 657519836 659737549 662828979
3860.4F62828979K720185o160507m93622P791290m286652p780914K540436M865494
$$ 662828979 665549164 659388657 658895035 666686325 662399673 654618759 657159195 662024689
3868.1F62024689P028198n118561j1701355K862320P017822M311600r606399l86506
$$ 662024689 669052887 663934326 652232971 655095291 662113113 666424713 656818314 656431808
3875.8F56431808M041138l0517J889114M684677n163803q678207N548400K088395J891632
$$ 656431808 660472946 660442429 662331543 667016220 661852417 653174210 658722610 660811005 662702637
3884.5F62702637N893783j2440643j031647L534699R03549M260101K41089p304382
$$ 662702637 668596420 656155777 655124130 658658829 659562378 663822479 664063568 656759186
3892.2F56759186N73578L311386j361618J224518R19570J834641K675400j0028916
$$ 656759186 657332764 660644150 659282532 660507050 661426620 663261261 665936661 655907745
3899.9F55907745M314728L763046n483322L167343l854751j493073N68772J14288K355118
$$ 655907745 660222473 663985519 658502197 661669540 657814789 656321716 656890488 657004776 659359894
3908.6F59359894N47867K95410L24096L44925q30536n15136J313858J849747k353821
$$ 659359894 659907761 660203171 660527267 660872192 660041656 659526520 660840378 662690125 660336304
3917.3F60336304l700714L936691k518m074783K096863J449432J168442j428528k876358
$$ 660336304 656635590 660572281 660569763 656494980 658591843 660041275 661209717 659781189 656904831
3926F56904831J615906J415939O67114n59921j58844J344757k615967j857528J552505
$$ 656904831 658520737 659936676 660603790 660043869 659885025 661229782 658613815 656756287 658308792
3934.6F58308792O55289M33426M90722k88696k93350p33872J057587J318741l857880
$$ 658308792 658964081 659397507 659888229 659599533 659306183 658572311 659629898 660948639 657090759
3943.3F57090759n75714J848068Q24433J426162j764526N6534K55890k153473J499939
$$ 657090759 656515045 658363113 659187546 660613708 658849182 658905716 659161606 657008133 658508072
3952F58508072O15311m31519n5237j29471J73035l32947P42111J98060M05120j55029
$$ 658508072 659123383 658691864 658636627 658507156 658680191 658347244 659089355 659287415 659692535 659537506
3961.6F59537506j836014j52588M26484M45938L64685j0910L4790l41797k60010N82581
$$ 659537506 657701492 657548904 657975388 658421326 658786011 658775101 658809891 658468094 658208084 658790665
3971.3F58790665K72369l60870n3788l25317r8038k65197J16806N23452j78909M18167
$$ 658790665 659063034 658702164 658648376 658323059 658225021 657959824 658076630 658600082 658421173 658839340
3980.9F58839340L29361l44696l88107J95618l82538r12781M46625O24084M41589m01916
$$ 658839340 659168701 658824005 658435898 658631516 658248978 657336197 657782822 658406906 658848495 658446579
3990.6F58446579n90897N3101K54211N34363j10092K69470J49384k68326k66037l27301
$$ 658446579 657855682 657908783 658162994 658697357 658587265 658856735 659006119 658737793 658471756 658144455
4000.2F58144455
$$ 658144455
##END=$$ End of the data block
