##TITLE=$$ Begin of the data block
##JCAMP-DX=5.00 $$ ACD/SpecManager v 10.08
##SPECTROMETER/DATA SYSTEM=Varian
##DATE=14 Jan 2013 10:41:02
##DATA TYPE=INFRARED SPECTRUM
##DATA CLASS=XYDATA
##ORIGIN=
##OWNER=
##NPOINTS=3735
##FIRSTX=399.26403809
##LASTX=4000.35498047
##MAXX=4000.35498047
##MINX=399.26403809
##MAXY=71.62677765
##MINY=30.80755615
##XFACTOR=1.0000000000
##YFACTOR=0.000000100000000
##FIRSTY=51.54888535
##DELTAX=0.96440572
##XUNITS=1/CM
##YUNITS=TRANSMITTANCE
##XYDATA=(X++(Y..Y))
$$ plain form
399.3 515488853 503582191 495946808 501012154 500197487 495139046 490965500 495050278 502511978
407 502511978 502013512 497046967 494346695 500322723 503962479 498892097 493456917 493161316 494340172
415.7 494340172 494884262 498131790 489676552 474722557 482144623 489913788 496296387 495095825
423.4 495095825 492862129 494092216 494549866 493967628 492477264 494542618 493810844 490455360 492450180
432.1 492450180 493418312 493168755 493116722 493166389 490662346 489765968 494130096 492364044 489996262
440.7 489996262 494504433 499066582 500267410 496284294 493159218 491303787 489263687 488494949 488324394
449.4 488324394 488938255 488609390 488293419 484152336 483908958 489121819 490202217 488684502 485347137
458.1 485347137 487920380 490086365 486806908 488249397 494343834 493120193 486278954 485550003 487775841
$$ packed form
399.3E15488853j1906662p635383N065346q14667n058441m173546M084778P461700
407E02511978m98466m966545k700272N976028L639756n070382n435180k95601J178856
415.7D94340172N44090L247528q455238j4953995P422066P769165O382599j200562
423.4D95095825k233696J230087M57650n82238j490364K065354p31774l355484J994820
432.1D92450180R68132k49557n2033M9667k504043q96378M364128j766052k367782
440.7D89996262M508171M562149J200828l983116l125076j855431k040100p68738j70555
449.4D88324394O13861l28865l15971m141083k43378N212861J080398j517715l337365
458.1D85347137K573243K165985l279457J442489O094437j223641o841239p28951K225838
$$ plain form
466.8 487775841 487401962 486896591 486195717 485438423 485234795 488461418 488863335 485210114 481441002
475.5 481441002 479371681 479992523 478518372 477802925 480758247 481317139 478616371 475629501 473686943
484.1 473686943 474985504 478341751 481117401 478641815 475300255 476875877 477959747 478712349 478834534
492.8 478834534 478427238 477849541 476096878 478171730 478952522 477010269 474321823 471710663 471333885
501.5 471333885 472172508 476974106 476095047 473452454 475534134 474795799 475014229 475424042 475143318
510.2 475143318 474986801 473835754 470833626 466475067 467259369 467879677 463891716 460655365 462551270
518.9 462551270 466484756 464545555 461136360 462162056 465119858 466809692 468427887 467493324 465247650
527.5 465247650 464577026 463814583 463075066 461655655 461827660 462518921 461189232 459887199 460143051
$$ packed form
466.8D87775841l73879n05371p00874p57294k03628L226623M01917l653221l769112
475.5D81441002k069321O20842j474151p15447K955322N58892k700768k986870j942558
484.1D73686943J298561L356247K775650k475586l341560J575622J083870P52602J22185
492.8D78834534m07296n77697j752663K074852P80792j942253k688446k611160l76778
501.5D71333885Q38623M801598q79059k642593K081680p38335K18430M09813k80724
510.2D75143318j56517j151047l002128m358559P84302O20308l987961l236351J895905
518.9D62551270L933486j939201l409195J025696K957802J689834J618195r34563k245674
527.5D65247650o70624p62443p39517j419411J72005O91261j329689j302033K55852
$$ plain form
536.2 460143051 460907784 458416214 457781181 461373177 462403412 460897713 460799217 461281662 459827919
544.9 459827919 458572197 457997665 456865997 455970840 455431671 455545692 456216354 457429543 457310371
553.6 457310371 455782471 455161934 455372314 454996910 454650269 455018311 453571587 452183189 453398247
562.3 453398247 454382858 453649445 453569107 454302368 453930740 453657837 454453011 455378075 454805527 454624252
571.9 454624252 455429077 454642448 454638939 454021606 452118340 453023643 454296722 453404427 451503563 452015076
581.5 452015076 453018265 452768402 454191055 454790611 453962898 454320068 453928719 453619080 454630775
590.2 454630775 454677162 453784523 454093437 455272751 455314064 454855728 455185928 455937157 457206306 457677956
599.9 457677956 456919441 456310883 456111298 456135902 455983467 454859314 453854027 453554802 451859398
$$ packed form
536.2D60143051P64733k491570o35033L591996J030235j505699r8496M82445j453743
544.9D59827919j255722n74532j131668q95157n39169J14021O70662J213189j19172
553.6D57310371j527900o20537K10380l75404l46641L68042j446724j388398J215058
562.3D53398247R84611p33413q0338P33261l71628k72903P95174R25064n72548j81275
571.9D54624252Q04825p86629l509o17333j903266R05303J273079q92295j900864N11513
581.5D52015076J003189k49863J422653N99556q27713L57170l91349l09639J011695
590.2D54630775M6387q92639L08914J179314M1313m58336L30200P51229J269149M71650
599.9D57677956p58515o08558j99585K4604j52435j124153j005287k99225j695404
$$ plain form
608.5 451859398 451359406 452496223 451398048 450264626 450374107 450297432 449834175 450432434 451218910
617.2 451218910 450330620 449989853 449934959 450605011 451857529 452316933 453601875 454889526 455278664
625.9 455278664 455118065 454568253 455742340 457865753 458745537 460436707 462978249 464183807 464925652
634.6 464925652 466049728 466775093 467043800 468018723 469779778 471109314 470860596 470408401 471524467
643.3 471524467 473304482 474998360 475949249 476417732 476787415 477279243 478384895 479388275 480062103
651.9 480062103 479728203 479970932 481626091 481952782 481896133 482027512 481327820 480824051 480125313 479746361
661.6 479746361 480178032 479984283 479362984 479534073 480460739 481702156 482382469 481572151 480978737 480754471
671.2 480754471 481916733 483386192 484611206 486257629 487121887 487527618 488168144 488626862 489468422
$$ packed form
608.5D51859398m99992J136817j098175j133422J09481p6675m63257N98259P86476
617.2D51218910q88290l40767n4894O70052J252518M59404J284942J287651L89138
625.9D55278664j60599n49812J174087K123413Q79784J691170K541542J205558P41845
634.6D64925652J124076P25365K68707R74923J761055J329536k48718m52195J116066
643.3D71524467J780015J693878R50889M68483L69683M91828J105652J003380O73828
651.9D80062103l33900K42729J655159L26691n6649J31379o99692n03769o98738l78952
661.6D79746361M31671j93749o21299J71089R26666J241417O80313q10318n93414k24266
671.2D80754471J162262J469459J225014J646423Q64258M05731O40526M58718Q41560
$$ plain form
679.9 489468422 490628357 491572113 492654533 493765335 493729172 494158821 495735245 496594887 497652931
688.6 497652931 498614693 499087029 498987198 498197060 498949394 500639687 501745605 502688065 504033775
697.3 504033775 504273987 503325577 503841820 504214325 503873825 504585190 505519905 506229439 507290344 508346519
706.9 508346519 509637909 511059875 511114273 511447906 511912498 511519547 511371803 510978508 511254234 511682129
716.6 511682129 512746201 514338875 515144272 516289864 516191711 515927353 516096764 515775375 516463318
725.2 516463318 518196716 519529648 519431419 520609055 523058701 523587036 523031197 523411484 524232483
733.9 524232483 523996658 523887787 524394150 524543571 524712982 526023903 527752571 528139992 527880898
742.6 527880898 527744446 527570000 526818314 526514893 527278938 528061371 529332542 531010475 532743568
$$ packed form
679.9D89468422J159935R43756J082420J110802l6163M29649J576424Q59642J058044
688.6D97652931R61762M72336r9831p90138P52334J690293J105918R42460J345710
697.3E04033775K40212r48410N16243L72505l40500P11365R34715P09534J060905J056175
706.9E08346519J291390J421966N4398L33633M64592l92951j47744l93295K75726M27895
716.6E11682129J064072J592674Q05397J145592r8153k64358J69411l21389O87943
725.2E16463318J733398J332932r8229J177636K449646N28335n55839L80287Q20999
733.9E24232483k35825j08871N06363J49421J69411J310921J728668L87421k59094
742.6E27880898j36452j74446p51686l03421P64045P82433J271171J677933J733093
$$ plain form
751.3 532743568 534250526 535054321 535301628 535133247 534582100 533850327 533857994 535172539 536805725 537975998
760.9 537975998 539886894 541594620 542274094 542388573 541883163 542322655 542459373 542410622 542680054 542152290
770.6 542152290 542518196 543139343 543174553 543915939 544923553 544800911 544626465 544068794 543074303 543685455
780.2 543685455 543741112 543440361 544048119 544773598 545422783 545350342 545266724 545236511 545639534 546409912
789.9 546409912 546325226 545773354 546224556 547095909 547315559 547466316 547358322 547385483 546404266 544947014
799.5 544947014 544204636 543242073 542662392 542031136 541667976 541579285 540991135 539017258 537428207 537362747
809.1 537362747 535520592 533353615 532626038 532060585 530668831 529711838 529730530 529382973 528869171
817.8 528869171 527731705 527845345 528463783 528795700 530186577 530814629 531366768 532736702 535368767
$$ packed form
751.3E32743568J506958Q03795K47307j68381n51147p31773P667J314545J633186J170273
760.9E37975998J910896J707726O79474J14479n05410M39492J36718m8751K69432n27764
770.6E42152290L65906O21147L5210P41386J007614j22642j74446n57671r94491O11152
780.2E43685455N5657l00751O07758P25479O49185p2441q3618l0213M03023P70378
789.9E46409912q4686n51872M51202Q71353K19650J50757j07994K7161r81217j457252
799.5E44947014p42378r62563n79681o31256l63160q8691n88150j973877j589051o5460
809.1E37362747j842155k166977p27577n65453j391754r56993J8692l47557n13802
817.8E28869171j137466J13640O18438L31917J390877O28052N52139J369934K632065
$$ plain form
826.5 535368767 538137321 540954323 544201241 546028900 547843895 549565735 551677589 553791351
834.2 553791351 555831375 558061409 559441261 561562881 562879868 564198151 566152267 567858925
841.9 567858925 568697205 568654861 569530678 570062866 571483192 573085289 574879684 576705933 576736908
850.6 576736908 577204475 577951851 578512344 577897682 577937584 578875122 580080376 582854309 584642906
859.3 584642906 585748863 586055870 586363754 587042656 587647400 587795029 586051559 585224419 585325508
868 585325508 585317574 585271149 585568657 585173378 583622208 582700005 581226196 579856453 579193573 578623009
877.6 578623009 577012100 575974312 576530876 576602135 577162361 576784897 575896568 575375252 574491768 573677826
887.3 573677826 572721939 572278519 571240883 570368881 571015167 572410507 572479782 571742287 572031517 571883736
$$ packed form
826.5E35368767K768554K817002L246918J827659J814995J721840K111854K113762
834.2E53791351K040024K230034J379852K121620J316987J318283J954116J706658
841.9E67858925Q38280m2344Q75817N32188J420326J602097J794395J826249L0975
850.6E76736908M67567P47376N60493o14662L9902R37538J205254K773933J788597
859.3E84642906J105957L07007L07884O78902O04744J47629j743470q27140J01089
868E85325508p934m6425K97508l95279j551170r22203j473809j369743o62880n70564
877.6E78623009j610909j037788N56564P1259N60226l77464q88329n21316q83484q13942
887.3E73677826r55887m43420j037636q72002O46286J395340O9275p37495K89230j47781
$$ plain form
896.9 571883736 571195374 569992256 569634361 569143448 568097649 568038788 567657890 568619995 570610809
905.6 570610809 572481804 574282684 575832977 576790276 576889267 577512741 577681198 577917938 577922478 577281799
915.2 577281799 576093903 574493370 573144226 570774803 569117470 567146606 564659653 562860603
922.9 562860603 560367737 557610397 555216179 553736382 551264229 548356628 545847511 542899208
930.7 542899208 541202774 540033340 538131561 535972939 534701195 533961754 533207092 532786179 532126312
939.3 532126312 530899353 529159317 528649483 529096298 528667526 527656250 526845474 526617775 526465569
948 526465569 526355362 526343536 526646004 526984100 526912041 526176453 524944267 524394989 523558159 522487526
957.7 522487526 521338501 519494133 517500076 515058022 513155823 511962051 510129356 508165512
$$ packed form
896.9E71883736o88362j203118l57895m90913j045799n8861l80898R62105J990814
905.6E70610809J870995J800880J550293R57299R8991O23474J68457K36740M540o40679
915.2E77281799j187896j600533j349144k369423j657333j970864k486953j799050
922.9E62860603k492866k757340k394218j479797k472153k907601k509117k948303
930.7E42899208j696434j169434j901779k158622j271744p39441p54662m20913o59867
939.3E32126312j226959j740036n09834M46815m28772j011276q10776k27699j52206
948E26465569j10207j1826L02468L38096p2059p35588j232186n49278q36830j070633
957.7E22487526j149025j844368j994057k442054j902199j193772j832695j963844
$$ plain form
965.4 508165512 506924973 505719643 504105148 502646790 501541138 500014839 497040710 493758926
973.1 493758926 491482239 489562492 487044029 483724899 480430298 477354507 473848686 470136108
980.8 470136108 466449203 462919617 459411316 455233383 451127281 447436028 443832970 439769096
988.5 439769096 436507797 434753761 431907845 428288765 424985352 423301010 422326279 420008736 417390404
997.2 417390404 415081100 413396568 411380234 409494743 407463799 405414963 404048576 402298088
1004.9 402298088 400661697 398600159 397191010 396288109 395480423 394292336 392487717 391225166 388891068
1013.6 388891068 387318993 386070671 384677124 383332062 381090660 379721756 377966576 376499214
1021.3 376499214 374562988 372138443 370376549 369140587 368702621 367041092 365782394 365026512 364772835
$$ packed form
965.4E08165512j240539j205330j614495j458358j105652j526299k974129l281784
973.1D93758926k276687j919747k518463l319130l294601l075791l505821l712578
980.8D70136108l686905l529586l508301m177933m106102l691253l603058m063874
988.5D39769096l261299j754036k845916l619080l303413j684342r74731k317543k618332
997.2D17390404k309304j684532k016334j885491k030944k048836j366387j750488
1004.9D02298088j636391k061538j409149r02901q07686j188087j804619j262551k334098
1013.6C88891068j572075j248322j393547j345062k241402j368904j755180j467362
1021.3C76499214j936226k424545j761894j235962m37966j661529j258698p55882k53677
$$ plain form
1030 364772835 364659462 363626633 362758064 361798477 361371689 361621475 363137283 364041710 364733696 366364250
1039.6 366364250 367958412 369388771 369647827 370521851 371046448 370984116 370697250 369822159 368958740
1048.3 368958740 367525673 367229538 366566277 365298653 363841362 363160553 363290215 362268333 362273750
1057 362273750 362020264 361850777 361753235 362289734 364251976 365451317 367031059 368884811 370654907
1065.7 370654907 371844711 373902626 375403900 375786095 376935005 377098503 377574425 377936172 379003601
1074.4 379003601 379752197 379411087 380451431 381138039 381482735 380696945 380529022 381516075 381703148
1083 381703148 382302132 383630333 385202751 385911598 387367134 389063759 390058670 391013641 391609993
1091.7 391609993 391903191 392209244 393853264 395155106 396049576 397461548 398693542 399423141 399979706
$$ packed form
1030C64772835j13373j032829q68569r59587m26788K49786J515808R04427O91986J630554
1039.6C66364250J594162J430359K59056Q74024N24597o2332k86866q75091q63419
1048.3C68958740j433067k96135o63261j267624j457291o80809J29662j021882N417
1057C62273750k53486j69487r7542N36499J962242J199341J579742J853752J770096
1065.7C70654907J189804K057915J501274L82195J148910J63498M75922L61747J067429
1074.4C79003601P48596l41110J040344O86608L44696p85790j67923R87053J87073
1083C81703148N98984J328201J572418P08847J455536J696625R94911R54971N96352
1091.7C91609993K93198L06053J644020J301842Q94470J411972J231994P29599N56565
$$ plain form
1100.4 399979706 401533318 402832909 403799210 404926376 406204872 407010803 407965508 409635162 410217743
1109.1 410217743 410713692 411276512 412186012 412839432 412371674 412480431 413627701 415166855 414764519
1117.7 414764519 414017029 414381676 414727364 414865646 414351006 414563599 414568253 414208641 414451103 415011787
1127.4 415011787 415706139 416789703 419155884 421018066 422497787 424635735 426617661 427961311
1135.1 427961311 429075775 430400848 432122536 434067421 435269547 436848564 439028854 440797081
1142.8 440797081 441489716 441519241 442078438 442081833 442294579 443055458 442928581 443036423 443676720 443726158
1152.5 443726158 443789253 444603157 444545441 443667526 443101959 442479935 441577301 440806847 441039734 441153717
1162.1 441153717 441046410 441696739 443120422 444606018 445476761 447294044 449351768 450502396 451910934
$$ packed form
1100.4C99979706J553612J299591R66301J127166J278496Q05931R54705J669654N82581
1109.1D10217743M95949N62820R09500O53420m67758J08757J147270J539154m02336
1117.7D14764519p47490L64647L45688J38282n14640K12593M654l59612K42462N60684
1127.4D15011787O94352J083564K366181J862182J479721K137948J981926J343650
1135.1D27961311J114464J325073J721688J944885J202126J579017K180290J768227
1142.8D40797081O92635K9525N59197L395K12746P60879j26877J07842O40297M9438
1152.5D43726158O3095Q13904n7716q77915n65567o22024r02634p70454K32887J13983
1162.1D41153717j07307O50329J423683J485596Q70743J817283K057724J150628J408538
$$ plain form
1170.8 451910934 454382401 457268982 459567871 461767120 464309692 467154388 469992828 472274742
1178.5 472274742 473922005 474861908 475782204 477726021 479346237 480482254 482536659 484952927 486550255
1187.2 486550255 487564011 488550453 488500214 487999420 487325478 486851425 487105713 486517296 485743256 485742874
1196.8 485742874 485836716 485754318 485869675 485391960 483809357 482589760 481588745 480558510 480152283
1205.5 480152283 479631882 478517418 478177948 478619843 478454208 478009682 477723427 477441559 476825447
1214.2 476825447 475994225 475284920 474615211 474394493 474396286 474403076 474439735 474111404 473571777 473009148
1223.8 473009148 472140808 470977821 470467987 469989243 468603706 467720070 467510986 467203674 466769562
1232.5 466769562 466068954 465701027 465430870 465001335 464652901 464191437 464158173 464117012 463832588 463940659
$$ packed form
1170.8D51910934K471467K886581K298889K199249K542572K844696K838440K281914
1178.5D72274742J647263R39903R20296J943817J620216J136017K054405K416268J597328
1187.2D86550255J013756R86442n0239n00794o73942m74053K54288n88417p74040l82
1196.8D85742874R3842q2398J15357m77715j582603j219597j001015j030235m06227
1205.5D80152283n20401j114464l39470M41895j65635m44526k86255k81868o16112
1214.2D76825447q31222p09305o69709k20718J793O790L6659l28331n39627n62629
1223.8D73009148q68340j162987n09834m78744j385537q83636k09084l07312m34112
1232.5D66769562p00608l67927k70157m29535l48434m61464l3264m1161k84424J08071
$$ plain form
1242.2 463940659 463806419 463374710 463028336 462561150 462503128 462452774 461654282 461081657 460999107 461000595
1251.8 461000595 461046448 461210937 461175346 460457916 460007820 460205002 460721550 460996513 460787201 461088333
1261.4 461088333 461610527 461636658 461490211 461797562 462275620 462680664 463213844 463694763 464441147 465283089
1271.1 465283089 465897217 466660843 467859802 468979950 469696770 470288773 470948257 471819611 472762604
1279.8 472762604 473820877 474985962 476195183 477360840 478840637 480589066 481691856 482477341
1287.5 482477341 483538551 484363174 484677238 485220413 485941315 486863861 487973366 488903885 489715271
1296.2 489715271 490181618 490954132 491634521 491739311 491742706 491581993 491383781 491489944 491928368 492152252
1305.8 492152252 491983299 491689301 491043930 489467583 489130287 490189400 490005455 489297371 488754463
$$ packed form
1242.2D63940659j34240m31709l46374m67186n8022n0354p98492n72625q2550J488
1251.8D61000595M5853J64489l5591p17430m50096J97182N16548K74963k09312L01132
1261.4D61088333N22194K6131j46447L07351M78058M05044N33180M80919P46384Q41942
1271.1D65283089O14128P63626J198959J120148P16820N92003O59484Q71354R42993
1279.8D72762604J058273J165085J209221J165657J479797J748429J102790P85485
1287.5D82477341J061210Q24623L14064N43175P20902R22546J109505R30519Q11386
1296.2D89715271M66347P72514O80389J04790L395j60713j98212J06163M38424K23884
1305.8D92152252j68953k93998o45371j576347l37296J059113j83945p08084n42908
$$ plain form
1314.5 488754463 488815079 488599091 487948189 488309135 488714409 489598770 490488930 491102448 491731453 492011147
1324.1 492011147 492316246 492474861 492792892 492756767 492796326 493037033 493053627 492862167 492320328 492076721
1333.8 492076721 491550751 491290245 491009331 490498085 490655365 490305786 489869194 490560417 491967506
1342.4 491967506 492845535 493410988 494061203 494540825 495202827 495387192 495761490 495660057 495539093 495540924
1352.1 495540924 494838371 494440804 493996696 494058037 494280167 494377708 494099083 493824921 493656273 492579384
1361.7 492579384 491984825 491040001 491107101 491449966 491231308 491432953 490826454 490433083 490568008 490692253
1371.4 490692253 490591965 490107574 489635696 489153481 489281235 489445419 489887161 490060387 490081825 489782028
1381 489782028 488829918 487857361 486175652 484739075 483875313 483275833 481564560 480286751 480144730
$$ packed form
1314.5D88754463O0616k15988o50902L60946M05274Q84361Q90160O13518O29005K79694
1324.1D92011147L05099J58615L18031l6125L9559K40707J6594j91460n41839k43607
1333.8D92076721n25970k60506k80914n11246J57280l49579m36592O91223J407089
1342.4D91967506Q78029N65453O50215M79622O62002J84365L74298j01433j20964J831
1352.1D95540924p02553l97567m44108O1341K22130R7541k78625k74162j68648j076889
1361.7D92579384n94559r44824O7100L42865k18658K01645o06499l93371J34925J24245
1371.4D90692253j00288m84391m71878m82215J27754J64184M41742J73226K1438k99797
1381D89782028r52110r72557j681709j436577q63762n99480j711273j277809j42021
$$ plain form
1389.7 480144730 479114418 477856789 476727867 475734711 473277740 469843941 468414345 467151337
1397.4 467151337 465586205 462587776 461167183 460519104 458936806 457602158 456376305 453941612
1405.1 453941612 451303558 450139465 448895416 447323151 446005478 444798584 443889046 442680473
1412.8 442680473 442144737 441691284 440557823 439539604 438691902 438816185 436384048 436286278 437837944
1421.5 437837944 438166504 438570175 438080292 439186058 440560951 440732536 441334152 441387024 441917305
1430.2 441917305 442847633 444327736 445787048 447049065 448999367 450596313 450968742 451839294 454606743
1438.9 454606743 455948334 456934395 458676376 459403839 460751610 462028961 463778763 465095291 465973053
1447.6 465973053 466779137 467639084 469274521 470133171 471079521 471945992 473728333 475504837 476710434
$$ packed form
1389.7D80144730j030312j257629j128922r93156k456971l433799j429596j263008
1397.4D67151337j565132k998429j420593o48079j582298j334648j225853k434693
1405.1D53941612k638054j164093j244049j572265j317673j206894r09538j208573
1412.8D42680473n35736m53453j133461j018219q47702J24283k432137r7770J551666
1421.5D37837944L28560M03671m89883J105766J374893J71585O01616N2872N30281
1430.2D41917305R30328J480103J459312J262017J950302J596946L72429Q70552K767449
1438.9D54606743J341591R86061J741981P27463J347771J277351J749802J316528Q77762
1447.6D65973053Q06084Q59947J635437Q58650R46350Q66471J782341J776504J205597
$$ plain form
1456.2 476710434 477566757 476379433 479464340 481160088 483395576 484835815 485508270 487600479 488098640
1464.9 488098640 490212479 492855911 495602455 497780190 499579926 502020874 503161430 504267731
1472.6 504267731 505519867 508542824 511899986 513820000 515833588 518190689 519984207 521485863
1480.3 521485863 522982101 524170570 525698318 526836472 527248154 528131218 528572960 528755569 530428276
1489 530428276 531019745 530108223 530830688 531749916 531355934 530539589 529308128 524452896 525552254
1497.7 525552254 525622711 522936630 523346367 523103409 522237015 521775856 522361450 521802673 515229187
1506.4 515229187 511670723 513553429 515533295 515041084 516040993 515992928 514767494 515239182 514365425
1515.1 514365425 513468742 511345711 509092712 511234665 513287544 511853294 508556824 509607010
$$ packed form
1456.2D76710434Q56323j187324L084907J695748K235488J440239O72455K092209M98161
1464.9D88098640K113839K643432K746544K177735J799736K440948J140556J106301
1472.6E04267731J252136L022957L357162J920014K013588K357101J793518J501656
1480.3E21485863J496238J188469J527748J138154M11682Q83064M41742J82609J672707
1489E30428276N91469r11522P22465R19228l93982q16345j231461m855232J099358
1497.7E25552254P0457k686081M09737k42958q66394m61159N85594n58777o573486
1506.4E15229187l558464J882706J979866m92211R99909m8065j225434M71688q73757
1515.1E14365425q96683k123031k252999K141953K052879j434250l296470J050186
$$ plain form
1522.8 509607010 511587791 512958603 511857719 512573776 513768921 513614159 514120483 515130005 516092949
1531.5 516092949 516676369 516536407 515133820 516944580 518064461 518384094 519164925 513659210 510643387
1540.1 510643387 515596695 517808876 516978951 518398018 519605827 518297043 519714127 520102615 520670242
1548.8 520670242 520410728 518945656 519830551 520426598 521490288 518871498 518634987 521029015 522859535
1557.5 522859535 518665695 511142006 513262711 513514290 514607887 514219398 513561287 511284676 509289742
1566.2 509289742 508588600 506760101 506296921 499374390 497384453 496006165 493030052 490733223 488379288
1574.9 488379288 487573929 476598358 475771370 474488335 471493530 468590813 463903847 460436134
1582.6 460436134 455363045 452232285 448188400 445018997 441849480 437512245 434735374 429739151
$$ packed form
1522.8E09607010J980781J370812j100884P16057J195145j54762N06324J009522R62944
1531.5E16092949N83420j39962j402587J810760J119881L19633P80831n505715l015823
1540.1E10643387M953308K212181q29925J419067J207809j308784J417084L88488N67627
1548.8E20670242k59514j465072Q84895N96047J063690k618790k36511K394028J830520
1557.5E22859535m193840p523689K120705K51579J093597l88489o58111k276611j994934
1566.2E09289742p01142j828499m63180o922531j989937j378288k976113k296829k353935
1574.9D88379288q05359j0975571q26988j283035k994805k902717m686966l467713
1582.6D60436134n073089l130760m043885l169403l169517m337235k776871m996223
$$ plain form
1590.3 429739151 426826859 422164955 419304352 416147308 411974449 409624786 405202103 403245392
1598 403245392 399623604 397721100 394627380 391468277 389514618 386069069 385275650 382023582 380736389
1606.7 380736389 378084946 376769943 375908470 373185577 373259621 371331444 371417084 369312630 369072533
1615.4 369072533 368817787 362842865 364539261 364250526 365892563 364589577 365229797 365623322 363654976
1624 363654976 364922256 364533272 366399918 364985352 365520287 366369171 366771355 367728577 367977180
1632.7 367977180 370425377 371265182 372014236 370546608 372964020 374265175 375229950 377329979 377851143
1641.4 377851143 380253906 380250664 382150269 384093628 383464508 385667305 384820213 388022079 389329872
1650.1 389329872 392080231 395089073 395550117 391127434 392571640 396837234 398480453 400804138
$$ packed form
1590.3D29739151k912292m661904k860603l157044m172859k349663m422683j956711
1598D03245392l621788j902504l093720l159103j953659l445549p93419l252068j287193
1606.7C80736389k651443j315003q61473k722893P4044j928177Q5640k104454k40097
1615.4C69072533k54746n974922J696396k88735J642037j302986O40220L93525j968346
1624C63654976J267280l88984J866646j414566N34935Q48884M02184R57222K48603
1632.7C67977180K448197Q39805P49054j467628K417412J301155R64775K100029N21164
1641.4C77851143K402763l242J899605J943359o29120K202797q47092L201866J307793
1650.1C89329872K750359L008842M61044m422683J444206M265594J643219K323685
$$ plain form
1657.8 400804138 401680374 402986450 404530602 406204948 408566818 408396683 412235222 414696007 417039375
1666.5 417039375 419266052 421674538 424037209 424229088 428307800 429852142 433245926 437097397
1674.2 437097397 439662361 441528320 444860344 449258118 451339798 454403992 456467705 460226173
1681.9 460226173 465232048 465987015 467561951 471082039 477377281 481947784 485182381 488737602
1689.6 488737602 491815567 495523872 498684845 502190514 506627960 511296272 510488815 515141487
1697.3 515141487 520713120 525784264 531190910 528541756 534197884 538549194 541154709 542968521
1705 542968521 545824928 548818245 551660194 555827751 558430595 559976654 561837769 563437424 565639687
1713.7 565639687 565697021 565465584 569071503 571696701 567790337 570635033 574380646 576632729 578139687
$$ packed form
1657.8D00804138Q76236J306076J544152J674346K361870j70135L838539K460785K343368
1666.5D17039375K226677K408486K362671J91879M078712J544342L393784L851471
1674.2D37097397K564964J865959L332024M397774K081680L064194K063713L758468
1681.9D60226173N005875P54967J574936L520088O295242M570503L234597L555221
1689.6D88737602L077965L708305L160973L505669M437446M668312q07457M652672
1697.3E15141487N571633N071144N406646k649154N656128M351310K605515J813812
1705E42968521K856407K993317K841949M167557K602844J546059J861115J599655K202263
1713.7E65639687N7334k31437L605919K625198l906364K844696L745613K252083J506958
$$ plain form
1722.4 578139687 578657341 578890724 579966354 581266251 582068977 583115768 585033340 584770546 584653053
1731.1 584653053 587907372 591656723 591292038 585889282 589674759 593235016 594470139 596910362
1738.8 596910362 597283859 596435280 600547600 603702660 604979134 606426544 609151382 611572189 613175659
1747.5 613175659 615100555 616390533 620767365 623308220 624134712 628659439 631693230 634562302
1755.2 634562302 637520294 637347298 638926353 641681213 643971252 647052078 646900558 647530594 651332779
1763.9 651332779 653216095 654376678 656302872 657836304 655713120 657307434 661063766 660964279 659526825
1772.5 659526825 658901749 662806015 665588150 665218430 666990891 667679901 668726959 669248505 668658447
1781.2 668658447 670023956 671766739 673325653 673304291 673822403 675324783 676085129 676454849 677486572
$$ packed form
1722.4E78139687N17654K33383J075630J299897Q02726J046791J917572k62794j17493
1731.1E84653053L254319L749351l64685n402756L785477L560257J235123K440223
1738.8E96910362L73497q48579M112320L155060J276474J447410K724838K420807J603470
1747.5F13175659J924896J289978M376832K540855Q26492M524727L033791K869072
1755.2F34562302K957992j72996J579055K754860K290039L080826j51520O30036L802185
1763.9F51332779J883316J160583J926194J533432k123184J594314L756332r9487j437454
1772.5F59526825o25076L904266K782135l69720J772461O89010J047058N21546n90058
1781.2F68658447J365509J742783J558914k1362N18112J502380P60346L69720J031723
$$ plain form
1789.9 677486572 677820053 678168488 676699142 675959702 679612198 681354675 681269836 682661819 684518051
1798.6 684518051 684802475 683677292 685199509 684682693 684889145 686571045 687025452 688220749 689244156
1807.3 689244156 689716644 690496674 691410370 690397415 690648575 691678314 691845932 692659683 692977066
1815.9 692977066 693934097 694084854 694831161 696031342 696101074 696959076 696551819 697342758 698128815 695090714
1825.6 695090714 694880066 697137070 699480972 699704208 697477798 698686447 701063690 701406403 701173859
1834.3 701173859 701033478 700997467 700858459 700721741 702104263 702362442 703121414 703822327 704721756 705510406
1843.9 705510406 700337143 701930542 704532089 704427872 703888626 704317322 705362778 705709534 706638336
1852.6 706638336 706890488 707157898 707087097 706763916 707133865 706899490 707368851 707514801 707805786 708058090
$$ packed form
1789.9F77486572L33481L48435j469346p39440L652496J742477q4839J391983J856232
1798.6F84518051K84424j125183J522217n16816K06452J681900M54407J195297J023407
1807.3F89244156M72488P80030R13696j012955K51160J029739J67618Q13751L17383
1815.9F92977066R57031J50757P46307J200181O9732Q58002m07257P90939P86057l038101
1825.6F95090714k10648K257004K343902K23236k226410J208649K377243L42713k32544
1834.3G01173859j40381l6011j39008j36718J382522K58179P58972P00913Q99429P88650
1843.9G05510406n173263J593399K601547j04217n39246M28696J045456L46756R28802
1852.6G06638336K52152K67410p0801l23181L69949k34375M69361J45950K90985K52304
$$ plain form
1862.2 708058090 708652267 709319687 709164886 709547653 709033279 709352722 708749390 707095871 707767563
1870.9 707767563 709053268 710121002 710258179 711032486 711408005 711622238 711711884 711290665 711094284
1879.6 711094284 710727997 711271057 711429520 711781387 711906891 711960526 712646866 712472229 713202896 712918320
1889.2 712918320 711067200 711540756 712631302 712732010 713041687 713256149 712642441 713430099 713718872
1897.9 713718872 713842239 714100418 713742599 713467255 713037033 713355026 713336258 713737335 714160919 714007111
1907.6 714007111 714241409 714107819 714052200 714316101 714841537 714141235 714024506 714329987 714440994 715921326
1917.2 715921326 714705353 713998871 715105667 715338364 715435333 714421310 713856735 714269333 714585953
1925.9 714585953 714611435 714873581 715087662 715468063 715738678 715295410 715167923 714899597 715142593 715110779
$$ packed form
1862.2G08058090N94177O67420j54801L82767n14374L19443o03332j653519O71692
1870.9G07767563J285705J067734J37177P74307L75519K14233Q9646m21219j96381
1879.6G11094284l66287N43060J58463L51867J25504N3635O86340j74637P30667k84576
1889.2G12918320j851120M73556J090546J00708L09677K14462o13708P87658K88773
1897.9G13718872J23367K58179l57819k75344m30222L17993j8768M01077M23584j53808
1907.6G14007111K34298j33590n5619K63901N25436p00302j16729L05481J11007J480332
1917.2G15921326j215973p06482J106796K32697R6969j014023n64575M12598L16620
1925.9G14585953K5482K62146K14081L80401K70615m43268j27487k68326K42996l1814
$$ plain form
1935.5 715110779 714764557 714504318 714340515 715215149 715565643 716267776 715781479 713935318 714484558
1944.2 714484558 714649734 714269638 714383621 714556656 714522247 714747162 714831924 714809418 715078354 715065308
1953.8 715065308 715015335 714619446 714564362 714466324 714206848 714200516 713990250 714173889 714463654 714780960
1963.5 714780960 714418259 714194794 714591980 713936768 713207550 713534698 713985138 713677292 713679352 713774414
1973.1 713774414 713783188 714130783 714409103 714532394 714133835 713964233 713600006 713508682 713551178 713147888
1982.8 713147888 713339691 713456879 713454895 713192749 713421631 713385010 712954941 713716812 713710175 712585144
1992.4 712585144 711967773 712160263 712053223 711947861 712491531 712835083 712910614 712421265 712285385 711845474
2002.1 711845474 711600342 711880875 711505051 711380463 711333466 711601486 711525955 711446915 711390076 711002884
$$ packed form
1935.5G15110779l46222k60239j63803Q74634L50494P02133m86297j846161N49240
1944.2G14484558J65176l80096J13983J73035l4409K24915Q4762k2506K68936j3046
1953.8G15065308m9973l95889n5084r8038k59476o332k10266J83639K89765L17306
1963.5G14780960l62701k23465L97186o55212p29218L27148M50440l07846K060R5062
1973.1G13774414Q774L47595K78320J23291l98559j69602l64227r1324M2496m03290
1982.8G13147888J91803J17188j984k62146K28882l6621m30069P61871o637j125031
1992.4G12585144o17371J92490j07040j05362N43670L43552P5531m89349j35880m39911
2002.1G11845474k45132K80533l75824j24588m6997K68020p5531p9040n6839l87192
$$ plain form
2011.7 711002884 711120453 710757980 710673523 710694656 710513840 710122757 709829712 710157013 710166245 710310822
2021.3 710310822 710082932 709889374 709907303 709931641 709926910 709462280 709187241 708807068 709066086 709115524
2031 709115524 708740997 708748016 708692780 708827362 708634567 708457336 708182220 707990341 707545776 706895752
2040.6 706895752 706756592 706973877 707610016 707399063 707427673 707704468 707516861 707198181 706639557 706632080
2050.3 706632080 706429596 706445847 706115799 705979156 706346741 705963287 705961456 706106186 706530228 706291504
2059.9 706291504 705860291 705940475 705679550 705791626 705607758 705426788 705297699 705524292 705671539 705349121
2069.6 705349121 705360947 705174561 705030441 704533234 704612808 704970932 705106888 705341263 704920197 705007706
2079.2 705007706 705142975 705108185 704890442 704437561 703999100 703608627 703658676 703600464 704027939 704132767
$$ packed form
2011.7G11002884J17569l62473q4457K1133j80816l91083k93045L27301R232J44577
2021.3G10310822k27890j93558J7929K4338m731m64630k75039l80173K59018M9438
2031G09115524l74527P019n5236J34582j92795j77231k75116j91879m44565o50024
2040.6G06895752j39160K17285O36139k10953K8610K76795j87607l18680n58624p477
2050.3G06632080k02484J6251l30048j36643L67585l83454j831J44730M24042k38724
2059.9G06291504m31213Q0184k60925J12076j83868j80970j29089K26593J47247l22418
2069.6G05349121J1826j86386j44120m97207P9574L58124J35956K34375m21066Q7509
2079.2G05007706J35269l4790k17743m52881m38461l90473N0049n8212M27475J04828
$$ plain form
2088.9 704132767 703870697 703823700 703653336 703625565 703563843 703329697 702588196 702613449 702668610 702559662
2098.5 702559662 702777863 702602615 702826614 702598572 702554092 702473526 702139359 701789246 701123581 701273956
2108.1 701273956 701202469 701394806 701584396 701587601 701636810 701156082 701085663 700849609 700810852 700680923 700611801
2118.7 700611801 700538254 700256042 700716324 700706406 700679321 700742874 700464783 699981461 699802780 699985199
2128.4 699985199 699733047 699576111 699368362 699615479 699789810 700093918 700700226 700534210 700347290 699900894
2138 699900894 699686508 699482880 699375610 699674606 699731522 699785385 699573517 699679871 699840622 700149384
2147.7 700149384 700239258 699729919 699451065 699244690 699317322 699412689 699965057 700408096 700362473 700232086
2157.3 700232086 700003052 699936829 699434052 699279785 699123611 699008789 699083786 699196472 700032349 700464249
$$ packed form
2088.9G04132767k62070m6997j70364k7771o1722k34146p41501K5253N5161j08948
2098.5G02559662K18201j75248K23999k28042m4480q0566l34167l50113o65665J50375
2108.1G01273956p1487J92337J89590L205M9209m80728p0419k36054l8757j29929o9122
2118.7G00611801p3547k82212M60282r918k7085O3553k78091m83322j78681J82419
2128.4F99985199k52152j56936k07749K47117J74331L04108O06308j66016j86920m46396
2138F99900894k14386k03628j07270K98996N6916N3863k11868J06354J60751L08762
2147.7G00149384Q9874n09339k78854k06375P2632R5367N52368M43039m5623j30387
2157.3G00232086k29034o6223n02777j54267j56174j14822P4997J12686Q35877M31900
$$ plain form
2167 700464249 700441513 699752655 699450760 699819183 699585800 699315643 699147720 699301376 699583130 700148544
2176.6 700148544 700273285 700335236 700769882 700435181 699991074 699463043 699472733 699598923 699764404 700151520
2186.3 700151520 699868774 700090561 700496597 700412979 700098877 700177460 700304947 700134048 699909134 699691315
2195.9 699691315 700103683 700176315 700450897 700814667 700903549 701006317 700372238 699988861 699903336 700343399
2205.5 700343399 700650406 700482559 700313721 700188522 700718613 701023712 701462326 701530838 701255493 701039047
2215.2 701039047 700613327 700547714 700151443 700193634 700313034 700578308 701061249 701042786 701232681 700893173
2224.8 700893173 700463562 700244980 700186691 700233154 700183640 700070953 700122986 700876160 701011353 700834351
2234.5 700834351 700734329 700485840 700335693 700261841 700102005 699725952 700173950 700402145 700417786 700512009
$$ packed form
2167G00464249k2736o88858l01895L68423k33383k70157j67923J53656K81754N65414
2176.6G00148544J24741O1951M34646l34701m44107n28031R690J26190J65481L87116
2186.3G00151520k82746K21787M06036q3618l14102P8583J27487j70899k24914k17819
2195.9F99691315M12368P2632K74582L63770Q8882J02768o34079l83377q5525M40063
2205.5G00343399L07007j67847j68838j25199N30091L05099M38614O8512k75345k16446
2215.2G01039047m25720o5613l96271M2191J19400K65274M82941j8463J89895l39508
2224.8G00893173m29611k18582n8289M6463m9514j12687N2033P53174J35193j77002
2234.5G00834351j00022k48489j50147p3852j59836l76053M47998K28195J5641R4223
$$ plain form
2244.1 700512009 700565796 700891495 700520706 700395737 700001984 699395294 699265594 699486771 700140457 700491638
2253.8 700491638 700684204 700474396 700582352 700435791 699984131 699881973 699686432 699923553 699663925 699680023
2263.4 699680023 699901810 699799118 699646606 699333954 699808273 700098801 700080795 699879227 699640121 699477768
2273 699477768 699475098 699727097 699494629 699519806 699414444 699392929 699147186 698626862 698464432 698330307 698721848
2283.7 698721848 698757553 699051361 699181900 699118652 699243393 698654556 698780975 698627319 698413925 698535309
2293.3 698535309 698504257 698396759 697952728 698397827 698724976 698672256 698366547 698084717 697903976 697620621
2302.9 697620621 697985840 697935638 698146439 698090820 697792053 697842789 697711182 698162155 698169708 698013229
2312.6 698013229 697250366 697055588 697954407 697679901 697752075 698335876 698239746 697490616 697316132 697693787
$$ packed form
2244.1G00512009N3787L25699l70789j24969l93753o06690j29700K21177O53686L51181
2253.8G00491638J92566k09808J07956j46561m51660j02158j95541K37121k59628J6098
2263.4F99680023K21787j02692j52512l12652M74319K90528j8006k01568k39106j62353
2273F99477768k670K51999k32468K5177j05362k1515k45743n20324j62430j34125L91541
2283.7F98721848L5705K93808J30539o3248J24741n88837J26419j53656k13394J21384
2293.3F98535309l1052j07498m44031M45099L27149n2720l05709k81830j80741k83355
2302.9F97620621L65219n0202K10801n5619k98767N0736j31607M50973P553j56479
2312.6F98013229p62863j94778Q98819k74506P2174N83801r6130p49130j74484L77655
$$ plain form
2322.2 697693787 697925415 698030472 697846909 698526840 698664169 697738876 697448044 698261032 698152695 697218857
2331.9 697218857 697387695 696846161 696137848 695954819 696602097 697899246 698407211 698601685 698616409 698351440
2341.5 698351440 697896423 697440567 696849747 696335373 695480499 694290771 693723679 694547195 695504913
2350.2 695504913 695192184 696580048 697686691 697420502 697522888 696847382 697509155 696424408 696065903
2358.9 696065903 696840515 696085358 696080093 696518097 696505432 694642715 695261154 697037582 696518784 694032898
2368.5 694032898 692253647 692589569 692701035 693001328 691551590 690631638 691247787 690766296 690248795
2377.2 690248795 689536743 688804245 688249435 688331604 688455505 688178482 688132858 687999573 688068924 687707367
2386.8 687707367 687248917 686919250 686452484 686317444 686279831 686230392 685762863 685587311 685928192 686318359
$$ packed form
2322.2F97693787K31628J05057j83563O79931J37329r25293k90832Q12988j08337r33838
2331.9F97218857J68838n41534p08313j83029O47278J297149N07965J94474J4724k64969
2341.5F98351440m55017m55856n90820n14374q54874j189728n67092Q23516R57718
2350.2F95504913l12729J387864J106643k66189J02386o75506O61773j084747l58505
2358.9F96065903P74612p55157n265M38004j2665j862717O18439J776428n18798k485886
2368.5F94032898j779251L35922J11466L00293j449738r19952O16149m81491n17501
2377.2F90248795p12052p32498n54810Q2169J23901k77023m5624j33285O9351l61557
2386.8F87707367m58450l29667m66766j35040l7613m9439m67529j75552L40881L90167
$$ plain form
2396.5 686318359 686153412 685415192 685116882 684736633 684337234 683948593 683490372 683445435 684029999 684471359
2406.1 684471359 684179077 684003143 683542175 683041687 682706375 682334442 681837540 681359482 681651154 681648407
2415.8 681648407 681433258 681247406 681131592 681164474 680918808 680837402 680290756 679599762 679126587 678814621
2425.4 678814621 678680573 678466797 678392563 678460236 678915176 678724899 677910233 677333298 676862030 676581421
2435.1 676581421 676327820 676020737 675761566 675883789 675701752 675490417 675491257 675182877 675048752 674595413
2444.7 674595413 674079208 673651199 673218689 672900314 672855148 672977066 672537079 672459183 672473831 672164764
2454.3 672164764 671715546 670966187 670485687 670292358 670167313 669875870 669896164 669872360 669845047 670030823
2464 670030823 669377441 668371429 667802353 667783737 667576752 667173386 666999207 667214432 667438431 666645889
$$ packed form
2396.5F86318359j64947p38220k98310l80249l99399l88641m58221m4937N84564M41360
2406.1F84471359k92282j75934m60968n00488l35312l71933m96902m78058K91672k747
2415.8F81648407k15149j85852j15814L2882k45666q1406n46646o90994m73175l11966
2425.4F78814621j34048k13776p4234O7673M54940j90277q14666n76935m71268k80609
2435.1F76581421k53601l07083k59171J22223j82037k11335Q40l08380j34125m53339
2444.7F74595413n16205m28009m32510l18375m5166J21918m39987p7896J4648l09067
2454.3F72164764m49218p49359m80500j93329j25045k91443K0294k3804k7313J85776
2464F70030823o53382j006012n69076j8616k06985m03366j74179K15225K23999p92542
$$ plain form
2473.6 666645889 665903549 665605927 665325699 664924698 664560242 664162598 663694687 663786621 663375854 662905884
2483.3 662905884 662534943 662068024 662162170 661887741 661462708 660913315 660428009 660192566 659997482 659913177
2492.9 659913177 659554062 659075546 658637314 658545303 658350906 658115311 657734756 656993179 656723328 656591721
2502.6 656591721 656330414 655913086 655627441 655156097 654638519 654303360 653802414 653691330 653289795 653039322
2512.2 653039322 652926559 652670441 652582321 651919479 651544113 651323700 651029968 650893784 650683289 650332489
2521.9 650332489 649863129 649734497 649353714 648913269 648556442 648253860 648154831 647830505 647369461 646841278
2531.5 646841278 646592026 646326981 646197510 646169052 645699692 645411835 645274506 644822159 644396973 644331131
2541.1 644331131 643903198 643397064 643138809 642800369 642622223 642454987 642293396 642049561 641897354 641377487
$$ packed form
2473.6F66645889p42340k97622k80228m01001l64456l97644m67911R1934m10767m69970
2483.3F62905884l70941m66919R4146k74429m25033n49393m85306k35443j95084q4305
2492.9F59913177l59115m78516m38232r2011j94397k35595l80555p41577k69851j31607
2502.6F56591721k61307m17328k85645m71344n17578l35159n00946j11084m01535k50473
2512.2F53039322j12763k56118q8120o62842l75366k20413k93732j36184k10495l50800
2521.9F50332489m69360j28632l80783m40445l56827l02582r9029l24326m61044n28183
2531.5F46841278k49252k65045j29471k8458m69360k87857j37329m52347m25186o5842
2541.1F44331131m27933n06134k58255l38440j78146j67236j61591k43835j52207n19867
$$ plain form
2550.8 641377487 640919266 640603180 639710464 639479446 639286194 639030113 638919487 638413925 638181458 637935791
2560.4 637935791 637718811 637610779 637346115 636722107 636422958 636281853 635793037 635541267 635136414 634977913
2570.1 634977913 634724846 634706306 634949303 634384193 633914604 633328323 632628632 632227859 632110939 631856308
2579.7 631856308 631641922 631766930 631209335 630608215 630343552 630341148 630091171 629700203 629772072 629390945
2589.4 629390945 628640976 627827492 627597847 627413712 627131653 627215042 627047882 627024002 626607018 625956688
2599 625956688 625105591 624679108 624883614 624494476 624497757 623986855 622999916 622972221 623148766 622816277
2608.6 622816277 622049141 621739616 621721725 621552620 621028328 620486069 620237541 619739304 619312973 619148941
2618.3 619148941 618938980 618519325 618064957 617551193 617126579 617015724 616784439 616115341 615632629 615644073
$$ packed form
2550.8F41377487m58221l16086q92716k31018j93252k56081j10626n05562k32467k45667
2560.4F37935791k16980j08032k64664o24008k99149j41105m88816k51770m04853j58501
2570.1F34977913k53067j8540K42997n65110m69589n86281o99691m00773j16920k54631
2579.7F31856308k14386J25008n57595o01120k64663k404k49977l90968P1869l81127
2589.4F29390945p49969q13484k29645j84135k82059Q3389j67160k3880m16984o50330
2599F25956688q51097m26483K04506l89138L281n10902r86939k7695J76545l32489
2608.6F22816277p67136l09525j7891j69105n24292n42259k48528m98237m26331j64032
2618.3F19148941k09961m19655m54368n13764m24614j10855k31285o69098m82712J1444
$$ plain form
2627.9 615644073 615077591 614488182 614327927 613957977 613524170 613330498 613222389 612701912 612469597 611794281
2637.6 611794281 610922089 611068306 611076736 610730209 610135727 609796638 609255371 608500786 608188286 607774239
2647.2 607774239 607856407 607362480 606555824 606729393 606649818 606181488 605916138 605839767 605515594 604986763
2656.9 604986763 604536705 604185753 603823166 603561783 603439140 603154335 602741241 602158051 601788330 601615143
2666.5 601615143 601731949 601784019 601191750 600610657 600233688 600185356 599775429 599213181 599208069 599204674 599099846
2677.1 599099846 598870811 598645821 598037949 597495537 597283134 597074280 596937218 596601753 596298637 595522537
2686.8 595522537 594912872 595062943 595376930 595386734 594774780 594169426 593656120 593757477 593982582 593652840
2696.4 593652840 593025856 592445259 592247353 591511612 591200562 591397514 591339035 591115074 590411377 590162849
$$ packed form
2627.9F15644073n66482n89409j60255l69950m33807j93672j08109n20477k32315o75316
2637.6F11794281q72192J46217Q430l46527n94482l39089n41267p54585l12500m14047
2647.2F07774239Q2168m93927q06656J73569p9575m68330k65350p6371l24173n28831
2656.9F04986763m50058l50952l62587k61383j22643k84805m13094n83190l69721j73187
2666.5F01615143J16806N2070n92269n81093l76969m8332m09927n62248n112l395j04828
2677.1E99099846k29035k24990o07872n42412k12403k08854j37062l35465l03116p76100
2686.8E95522537o09665J50071L13987R804o11954o05354n13306J01357K25105l29742
2696.4E93652840o26984n80597j97906p35741l11050J96952n8479k23961p03697k48528
$$ plain form
2706 590162849 590127258 590032082 590075989 590132446 589729958 589021645 588871498 588658867 588377419 587895050 587537956
2716.6 587537956 587531586 587333755 587205772 587048492 586819534 586108856 585679207 585689011 585416603 585223045
2726.3 585223045 585037537 585102654 585093994 585084457 585171509 584903564 584398346 584051132 583987083 583889160 583949013
2736.9 583949013 583489227 583064003 582910576 582356796 582273598 582169647 582289009 582545891 582390480 582353859
2746.5 582353859 581757431 580882187 580644531 580690842 580580597 580543518 580445023 580311890 580265770 580217667
2756.2 580217667 580016937 579421501 579035301 578606911 578249397 578049660 577740402 577852516 577811317 577636909
2765.8 577636909 577416420 577197456 577041321 576498184 576065674 576042023 575948792 575455627 575426674 575672073
2775.5 575672073 575446396 575007782 574444504 573898468 573466759 573326035 572825890 572284851 571946754 571352844
$$ packed form
2706E90162849l5591r5176M3907N6457m02488p08313j50147k12631k81448m82369l57094
2716.6E87537956o370j97831j27983j57280k28958p10678m29649R804k72408j93558
2726.3E85223045j85508O5117q660r537Q7052k67945n05218l47214o4049r7923N9853
2736.9E83949013m59786m25224j53427n53780q3198j03951J19362K56882j55411l6621
2746.5E82353859n96428q75244k37656M6311j10245l7079r8495j33133m6120m8103
2756.2E80217667k00730n95436l86200m28390l57514j99737l09258J12114m1199j74408
2765.8E77636909k20489k18964j56135n43137m32510k3651r3231m93165k8953K45399
2775.5E75672073k25677m38614n63278n46036m31709j40724n00145n41039l38097n93910
$$ plain form
2785.1 571352844 571108665 570753784 570507965 570619202 570439186 570032158 569846458 569504509 568666344 568324089
2794.8 568324089 568055420 567540817 566930695 566363144 565893784 565208359 565143585 565050850 564698372 564498978
2804.4 564498978 564119492 563571167 562909660 562611275 562065849 561273270 560366402 559528427 559393921 559223175
2814 559223175 558765678 557927895 557141609 556692238 556309433 555846710 555020332 554446487 554034538 553546028
2823.7 553546028 553198051 552531166 551594009 551090851 550710869 549960480 549083252 548287201 547833061 547203217
2833.3 547203217 546330490 545354691 544514885 544067230 543121986 542077599 541012535 539770813 538639526
2842 538639526 537467613 536379395 534953423 533366203 531849289 530438881 528657990 526602631 525129585
2850.7 525129585 523987541 523502998 523103333 522714195 522563820 522110100 522306404 522471313 521793976
$$ packed form
2785.1E71352844k44179l54881k45819J11237j80016m07028j85700l41949q38165l42255
2794.8E68324089k68669n14603o10122n67551m69360o85425o4774r2735l52478j99394
2804.4E64498978l79486n48325o61507k98385n45426p92579r06868q37975j34506j70746
2814E59223175m57497q37783p86286m49371l82805m62723q26378n73845m11949m88510
2823.7E53546028l47977o66885r37157n03158l79982p50389q77228p96051m54140o29844
2833.3E47203217q72727r75799q39806m47655r45244j044387j065064j241722j131287
2842E38639526j171913j088218j425972j587220j516914j410408j780891k055359j473046
2850.7E25129585j142044m84543l99665l89138j50375m53720J96304J64909o77337
$$ plain form
2859.4 521793976 521459846 521684532 521643524 521348267 520846939 520277405 520153198 519810448 518930359 518002930
2869 518002930 517613297 517203522 516445465 516067619 515547600 515213661 514983063 514179268 513430290 513022079
2878.7 513022079 512804298 512144279 511059074 510336876 510091820 509847679 509263535 508366356 507675362
2887.3 507675362 507121658 506233444 505751190 505438194 504794006 503885880 502758255 502103195 501477661
2896 501477661 500550804 499709854 499109116 498741035 498367081 497865143 497268677 496847115 496162415 495187683
2905.7 495187683 494590302 494415436 494126396 493291473 492542152 491905136 490858803 489798126 488694763
2914.3 488694763 487144012 485722961 484454956 483289757 482681961 481789207 480466766 479196091 478547592
2923 478547592 478502502 478265839 478216286 478048706 478047180 478557014 478847046 478759155 478282700 478299370 478872261
$$ packed form
2859.4E21793976l34130K24686m1008k95257n01328n69534j24207l42750q80089r27429
2869E18002930l89633m09775p58057l77846n20019l33939k30598q03795p48978m08211
2878.7E13022079k17781o60019j085205p22198k45056k44141n84144q97179o90994
2887.3E07675362n53704q88214m82254l12996o44188r08126j127625o55060o25534
2896E01477661r26857q40950o00738l68081l73954n01938n96466m21562o84700r74732
2905.7D95187683n97381j74866k89040q34923p49321o37016j046333j060677j103363
2914.3D88694763j550751j421051j268005j165199o07796q92754j322441j270675o48499
2923D78547592m5090k36663m9553j67580j526N09834K90032q7891m76455J6670N72891
$$ plain form
2933.6 478872261 479352646 479822350 480437584 481157913 481708832 482207642 482613792 482849998 483182907 483803711
2943.3 483803711 484368629 484699097 485221291 485720444 485925407 486779633 487992134 488040657 488005638 488202171
2952.9 488202171 488187752 488478279 488499451 488805275 489048386 489025955 489433212 490080185 491134758 491766090
2962.6 491766090 491749992 492009964 493063812 493670502 493417778 493550148 494017601 495007362 496128998
2971.2 496128998 497010574 497567978 497951012 498183289 498073578 498646049 498968849 498815193 499131699 499691391
2980.9 499691391 500003891 499884338 500048256 500399323 501147423 501423492 501039124 501223030 501335030 501207809
2990.5 501207809 501120300 501519699 501469536 500749207 500446625 500362282 500687752 500685501 500196991 499525108
3000.2 499525108 498975258 498800545 498490562 498340988 498013000 497665977 497416115 497027359 496588097 495890999
$$ packed form
2933.6D78872261M80385M69704O15234P20329N50919M98810M06150K36206L32909O20804
2943.3D83803711N64918L30468N22194M99153K04963Q54226J212501M8523l5019J96533
2952.9D88202171j4419K90527K1172L05824K43111k2431M07257O46973J054573O31332
2962.6D91766090j6098K59972J053848O06690k52724J32370M67453R89761J121636
2971.2D96128998Q81576N57404L83034K32277j09711N72471L22800j53656L16506N59692
2980.9D99691391L12500j19553J63918L51067P48100K76069l84368J83906J12000j27221
2990.5E01207809q7509L99399n0163p20329l02582q4343L25470k251m88510o71883
3000.2D99525108n49850j74713l09983j49574l27988l47023k49862l88756m39262o97098
$$ plain form
3009.8 495890999 495382118 495227585 494965782 494151344 493447685 492917480 492508659 492406540 491956863 491529312
3019.5 491529312 491133919 490787468 490122719 489319534 489049301 488365402 488059921 488174477 487552414 486736336
3029.1 486736336 486190376 485647240 484743767 483976860 483294373 482594643 482358284 481958847 481448708 481242371
3038.7 481242371 480617638 480043716 479661331 479001732 478542061 477624016 476518326 475820351 475344429
3047.4 475344429 475122032 474629860 474017105 473287735 472598419 472063560 471509209 470572662 469493141
3056.1 469493141 469445686 469375343 468830643 468007584 467219963 466860466 466379280 466014175 465058899 464202881
3065.7 464202881 463691750 462990341 462766609 462395477 462245026 461983910 461515617 461100388 460244408 459575539
3075.4 459575539 459095078 458803520 458178329 457543907 457439461 457070389 456677856 456376877 455738869 454616203
$$ packed form
3009.8D95890999n08881j54533k61803q14438p03659n30205m08821j02119m49677m27551
3019.5D91529312l95393l46451o64749q03185k70233o83899l05481J14556o22063q16078
3029.1D86736336n45960n43136r03473p66907o82487o99730k36359l99437n10139k06337
3038.7D81242371o24733n73922l82385o59599m59671r18045j105690o97975m75922
3047.4D75344429k22397m92172o12755p29370o89316n34859n54351r36547j079521
3056.1D69493141m7455p0343n44700q23059p87621l59497m81186l65105r55276q56018
3065.7D64202881n11131p01409k23732l71132j50451k61116m68293m15229q55980o68869
3075.4D59575539m80461k91558o25191o34422j04446l69072l92533l00979o38008j122666
$$ plain form
3085 454616203 453841896 453314285 452458534 451897087 451540070 451149788 450800323 450726280 450654221 450033684
3094.7 450033684 448998756 448190422 447736206 447308159 447068138 446424141 445533829 445138893 445081062 444746628
3104.3 444746628 443860245 443180351 442599373 442145653 441567383 440688820 440443344 440221977 439743996 439308205
3114 439308205 438717728 438028297 437304955 436868439 436558914 435883942 435220680 434977303 434384995 433106461
3123.6 433106461 432232971 431955147 431179466 430141296 429721565 429613266 429214211 428203163 427621498
3132.3 427621498 427590065 427087708 426681900 426462364 425848770 424894829 423911896 422990952 422550125 422326088
3141.9 422326088 421757164 421271858 420673103 420028992 419347916 418603935 417919655 417385216 417243919 416675110
3151.6 416675110 415728683 414781036 414452133 414534149 413782997 412908020 412268524 411733360 410944862 410049362
$$ packed form
3085D54616203p74307n27611q55751n61447l57017l90282l49465p4043p2059o20537
3094.7D50033684j034928q08334m54216m28047k40021o43997q90312l94936n7831l34434
3104.3D44746628q86383o79894n80978m53720n78270q78563k45476k21367m77981m35791
3114D39308205n90477o89431p23342m36516l09525o74972o63262k43377n92308j278534
3123.6D33106461q73490k77824p75681j038170m19731j08299l99055j011048n81665
3132.3D27621498l1433n02357m05808k19536o13594r53941r82933r20944m40827k24037
3141.9D22326088n68924m85306n98755o44111o81076p43981o84280n34439j41297n68809
3151.6D16675110r46427r47647l28903Q2016p51152q74977o39496n35164p88498q95500
$$ plain form
3161.2 410049362 409519997 408983269 408393173 407671623 407229614 406439819 405533600 405212173 404656296 404342651
3170.9 404342651 404007034 403295975 402576256 401723557 400934677 400681534 400375977 399439507 399203186 398965340
3180.5 398965340 398173599 397624245 396894341 396176605 395248566 394377136 394078484 393853607 393409882 392662506
3190.1 392662506 392061310 391726608 391047325 390226898 389824371 389454346 388966904 388123283 387365646 387018127
3199.8 387018127 386268539 385789223 385387535 384763718 384382591 384159813 383795242 382732620 382106590
3208.5 382106590 381705132 381299133 381480980 380749741 379831886 379653320 379051018 378211594 377800255 377530670
3218.1 377530670 377034073 376165199 375637283 375721779 375242805 374617805 374080544 373375015 373102989 372782402
3227.8 372782402 372218971 371547012 370936699 370476761 370205116 369872360 369133263 368853874 368571701 367900543
$$ packed form
3161.2D10049362n29365n36728n90096p21550m42009p89795r06219l21427n55877l13645
3170.9D04342651l35617p11059p19719q52699p88880k53143l05557r36470k36321k37846
3180.5C98965340p91741n49354p29904p17736r28039q71430k98652k24877m43725p47376
3190.1C92662506o01196l34702o79283q20427m02527l70025m87442q43621p57637l47519
3199.8C87018127p49588m79316m01688o23817l81127k22778l64571j062622o26030
3208.5C82106590m01458m05999J81847p31239r17855j78566o02302q39424m11339k69585
3218.1C77530670m96597q68874n27916Q4496m78974o25000n37261p05529k72026l20587
3227.8C72782402n63431o71959o10313m59938k71645l32756p39097k79389k82173o71158
$$ plain form
3237.4 367900543 367692757 367568245 367089615 366343498 365553589 365160637 365284538 365400734 364971542 364012070
3247 364012070 363037338 362457809 362070389 361625328 361416664 361213150 360252609 359850578 360147896 359747810
3256.7 359747810 359497643 359340363 358590050 357896194 357742195 357488365 356804314 356445045 356343231 356123848
3266.3 356123848 355700798 355478134 355502434 355029526 354542389 354562225 354362373 353634453 352936897 352271805
3276 352271805 351803436 351786194 351735382 351487732 351074982 350729713 350381699 349985924 349823112 349504852
3285.6 349504852 348817711 348515091 348762970 348656120 348341713 348313866 348375511 348081970 347615700 347288818
3295.3 347288818 346612625 346024590 345507088 345039940 344969177 344911423 345038033 344756165 344138069 343558731
3304.9 343558731 343024254 343176346 343089561 342258568 341593513 341198082 340842590 340866203 340885696 340270042
$$ packed form
3237.4C67900543k07786j24512m78630p46117p89909l92952J23901J16196m29192r59472
3247C64012070r74732n79529l87420m45061k08664k03514r60541m02031K97318m00086
3256.7C59747810k50167j57280p50313o93856j53999k53830o84051l59269j01814k19383
3266.3C56123848m23050k22664K4300m72908m87137J9836j99852p27920o97556o65092
3276C52271805m68369j7242n0812k47650m12750l45269l48014l95775j62812l18260
3285.6C49504852o87141l02620K47879j06850l14407k7847O1645k93541m66270l26882
3295.3C47288818o76193n88035n17502m67148p0763n7754J26610k81868o18096n79338
3304.9C43558731n34477J52092q6785q30993o65055l95431l55492K3613J9493o15654
$$ plain form
3314.6 340270042 339711990 339678764 339490395 338564072 337833328 337454262 337013779 336663399 336054001 335814362
3324.2 335814362 335619926 335174522 334890289 334219360 333696136 333336792 332772102 332241554 331821785 331313057
3333.8 331313057 330569687 330090637 329602890 329111366 328769455 328197289 327668533 326917419 325918274 325407867
3343.5 325407867 325231361 324974976 324455414 323851509 323866920 323754539 323084373 322704353 322218208 321795807
3353.1 321795807 321586533 321149559 320580025 319905853 319695759 319641094 319334068 318948326 318233166 317593880
3362.8 317593880 317326317 317428684 317534237 317180176 316710892 316151447 315529442 315159550 315214386 315499191
3372.4 315499191 315337219 314826202 314605694 314509315 313884468 313178787 313255653 313182945 312462902 311836281
3382.1 311836281 311587219 311891479 312148838 312109776 311949787 311546459 311631393 311807976 311238022 310705109
$$ packed form
3314.6C40270042n58052l3226j88369r26323p30744l79066m40483l50380o09398k39639
3324.2C35814362j94436m45404k84233o70929n23224l59344n64690n30548m19769n08728
3333.8C31313057p43370m79050m87747m91524l41911n72166n28756p51114r99145n10407
3343.5C25407867j76506k56385n19562o03905J5411j12381o70166l80020m86145m22401
3353.1C21795807k09274m36974n69534o74172k10094n4665l07026l85742p15160o39286
3362.8C17593880k67563J02367J05553l54061m69284n59445o22005l69892N4836K84805
3372.4C15499191j61972n11017k20508r6379o24847p05681P6866p2708p20043o26621
3382.1C11836281k49062L04260K57359l9062j59989m03328Q4934J76583n69954n32913
$$ plain form
3391.7 310705109 310583305 310295601 309823055 309930153 310362911 310140266 309867001 309813366 309745827 309867649
3401.3 309867649 309731503 309577847 309087620 308643417 309032745 308927040 308827209 308998661 309022865 309256954
3411 309256954 309119911 309261360 309361706 308640270 308075562 308475647 309132938 309150925 309370499 309894485
3420.6 309894485 310270176 310117779 309605141 309851665 310502701 310488472 309966927 310291595 310874672 311059742
3430.3 311059742 311197376 311180286 311583729 311509686 311259632 311936855 312796268 313283367 313543644 313860073
3439.9 313860073 313913708 314471359 314982224 314545364 314399319 315201321 316255226 315822811 315905533 317047749
3449.6 317047749 317552528 317774525 317853127 318442459 318982964 319311047 319695301 320014038 321114731 321861153
3459.2 321861153 322219200 322829056 323456383 324001350 324192467 324674606 325253639 325993652 326424217 326103821
$$ packed form
3391.7C10705109j21804k87704m72546J07098M32758k22645k73265n3635o7539J21822
3401.3C09867649j36146j53656m90227m44203L89328j05705r9831J71452K4204K34089
3411C09256954j37043J41449J00346p21436n64708M00085O57291J7987K19574N23986
3420.6C09894485L75691j52397n12638K46524O51036j4229n21545L24668N83077J85070
3430.3C11059742J37634j7090M03443p4043k50054O77223Q59413M87099K60277L16429
3439.9C13860073N3635N57651N10865m36860j46045Q02002J053905m32415Q2722J142216
3449.6C17047749N04779K21997P8602N89332N40505L28083L84254L18737J100693P46422
3459.2C21861153L58047O09856O27327N44967J91117M82139N79033P40013M30565l20396
$$ plain form
3468.8 326103821 326651268 327691269 328329659 329210625 329800453 329860687 330389519 331404915 332350159
3477.5 332350159 332881050 333078461 333477020 334078979 334633484 335441513 336860466 338199043 338723755
3486.2 338723755 339127121 339661674 340058784 340771294 341328125 341831818 342903061 343588638 344445381
3494.9 344445381 345466843 345770187 346211586 346964493 348089523 348552437 348830299 349984970 350461273
3503.6 350461273 351098595 352486649 353519440 354016037 354922981 355907898 356169205 357071419 358119202
3512.2 358119202 359040146 359960594 360703087 361325912 361559639 362252426 363547058 364552040 365090981
3520.9 365090981 366375771 367317123 367004128 368275414 370270996 371606445 372129784 372305260 372961502
3529.6 372961502 374130554 375262833 376407928 377982788 378680115 380029411 381576767 381288223 381912346
$$ packed form
3468.8C26103821N47447J040001O38390Q80966N89828O0234N28832J015396R45244
3477.5C32350159N30891J97411L98559O01959N54505Q08029J418953J338577N24712
3486.2C38723755M03366N34553L97110P12510N56831N03693J071243O85577Q56743
3494.9C44445381J021462L03344M41399P52907J125030M62914K77862J154671M76303
3503.6C50461273O37322J388054J032791M96597R06944R84917K61307R02214J047783
3512.2C58119202R20944R20448P42493O22825K33727O92787J294632J004982N38941
3520.9C65090981J284790R41352l12995J271286J995582J335449N23339J75476O56242
3529.6C72961502J169052J132279J145095J574860O97327J349296J547356k88544O24123
$$ plain form
3538.3 381912346 383147545 384240875 385471535 387145462 388393517 389238091 390254402 390889549 392528992
3547 392528992 393001823 393762970 395415993 396875801 398563843 398557396 399873047 401307793 402841759
3555.6 402841759 405000496 405189819 406357651 408285675 410229530 411167793 412060928 413556328 414227829
3564.3 414227829 416927147 418140564 418963203 420101013 419663200 422419510 424385986 425701675 427141266
3573 427141266 428557854 430108757 431443214 433264809 434033623 436161232 437789841 438361664 440889549
3581.7 440889549 443163376 444366379 445438576 449091797 450610161 449176102 451769981 451903419
3589.4 451903419 453749847 456441803 459459000 461712990 461918831 464741287 464906731 466543961 469852676
3598.1 469852676 470619926 473443565 474466019 474832268 477369499 479304695 481100998 484246063 487622681
$$ packed form
3538.3C81912346J235199J093330J230660J673927J248055Q44574J016311O35147J639443
3547C92528992M72831P61147J653023J459808J688042o447J315651J434746J533966
3555.6D02841759K158737J89323J167832J928024J943855R38263Q93135J495400O71501
3564.3D14227829K699318J213417Q22639J137810m37813K756310J966476J315689J439591
3573D27141266J416588J550903J334457J821595P68814K127609J628609N71823K527885
3581.7D40889549K273827J203003J072197L653221J518364j434059K593879J33438
3589.4D51903419J846428K691956L017197K253990K05841K822456J65444J637230L308715
3598.1D69852676P67250K823639J022454L66249K537231J935196J796303L145065L376618
$$ plain form
3606.8 487622681 487437744 490098305 490483589 489613609 495840530 497874489 496958351 501140366 500792542
3615.4 500792542 503488388 507817535 508506622 510572357 510914955 512631149 516110878 517956657 519956055
3624.1 519956055 522627144 524593735 526805496 533016472 535069427 525926208 529089966 533950424
3631.8 533950424 539456978 541897736 540624695 542697983 546109200 549241982 550375214 552232399
3639.5 552232399 555070190 557431259 558799095 559269333 561713181 565203934 570252228 569969025 568439903
3648.2 568439903 575346680 575499191 573259850 572536583 576993332 581528587 585459175 590818291 583794174
3656.9 583794174 584606819 589604149 590857544 593359222 595002708 597719803 599287720 600221443 601679726
3665.6 601679726 601973038 606102867 609704437 610057526 610232277 603100433 604468460 612894478 622987175
$$ packed form
3606.8D87622681j84937K660561L85284q69980O226921K033959r16138M182015l47824
3615.4E00792542K695846M329147O89087K065735L42598J716194L479729J845779J999398
3624.1E19956055K671089J966591K211761O210976K052955r143219L163758M860458
3631.8E33950424N506554K440758j273041K073288L411217L132782J133232J857185
3639.5E52232399K837791K361069J367836M70238K443848L490753N048294k83203j529122
3648.2E68439903O906777J52511k239341p23267M456749M535255L930588N359116p024117
3656.9E83794174Q12645M997330J253395K501678J643486K717095J567917R33723J458283
3665.6F01679726K93312M129829L601570L53089J74751p131844J368027Q426018J0092697
$$ plain form
3674.3 622987175 626058311 609067268 608383560 615096817 619491501 617896461 618533096 621160202
3682 621160202 622570610 623957977 624712563 625167274 629269028 636625366 629624405 624453163 631967468
3690.6 631967468 627975388 626923065 631356544 632100449 633874855 634375877 633918839 634723320 634689980
3699.3 634689980 636862335 640208893 635484619 632798691 637805214 639175797 639208412 639949570 642156982
3708 642156982 646687241 639549179 642516022 649470673 636970444 638947411 642663879 643063660 643766708
3716.7 643766708 645581665 646854095 644227448 645649490 651534042 648313141 642130432 646271744
3724.4 646271744 648449707 648546600 645770035 644986115 648145676 648856201 654507523 652873611 645240250
3733.1 645240250 653289413 653274689 644427567 645283051 648141937 648441086 649579544 652419968 650242844
$$ packed form
3674.3F22987175L071136j6991043o83708O713257M394684j595040O36635K627106
3682F21160202J410408J387367P54586M54711M101754P356338p000961n171242P514305
3690.6F31967468l992080j052323M433479P43905J774406N01022m57038Q04481l3340
3699.3F34689980K172355L346558m724274k685928N006523J370583L2615P41158K207412
3708F42156982M530259p138062K966843O954651j2500229J976967L716468L99781P03048
3716.7F43766708J814957J272430k626647J422042N884552l220901o182709M141312
3724.4F46271744K177963R6893k776565p83920L159561P10525N651322j633912p633361
3733.1F45240250Q049163j4724q847122Q55484K858886K99149J138458K840424k177124
$$ plain form
3741.8 650242844 653114014 664806137 660702972 639594154 646226349 652144623 658232193 655772476
3749.5 655772476 646175766 657715225 655689850 646583405 650761566 654694748 658196182 653178406
3757.2 653178406 654385605 660126801 653013611 650567169 654692841 656138077 656368256 659421082
3764.9 659421082 656841125 652457428 655593185 660975494 662427979 653841019 654465485 656857910
3772.6 656857910 656840057 657614212 657333755 658548126 658934402 661717987 663259888 655650635 656468964
3781.3 656468964 658773499 660239334 661957855 658502731 657490616 659021225 659665985 660266953 660396805
3790 660396805 660817871 660889435 660850830 660093765 661268311 664782562 661075363 656396408 658213882
3798.7 658213882 662733841 669482040 663561172 652073822 655763702 658396225 662426605 669046555
$$ packed form
3741.8F50242844K871170J1692123m103165k1108818O632195N918274O087570k459717
3749.5F55772476r596710J1539459k025375r106445M178161L933182L501434n017776
3757.2F53178406J207199N741196p113190k446442M125672J445236K30179L052826
3764.9F59421082k579957m383697L135757N382309J452485q586960O24466K392425
3772.6F56857910j7853P74155k80457J214371L86276K783585J541901p609253Q18329
3781.3F56468964K304535J465835J718521l455124j012115J530609O44760O00968J29852
3790F60396805M21066P1564l8605p57065J174546L514251l707199m678955J817474
3798.7F58213882M519959O748199n920868j1487350L689880K632523M030380O619950
$$ plain form
3806.4 669046555 661201248 655152130 659297562 661502762 661893463 661983795 662006683 663049088 668359146
3815.1 668359146 668005753 652940521 656890106 663243256 668470383 671553574 655498123 654730453
3822.8 654730453 658542023 660839539 663885345 663772354 659740677 659719620 662007370 665249710 666528931
3831.4 666528931 658066483 659938889 666761017 661240311 660930862 669316483 662341690 656180725
3839.2 656180725 662476501 658759079 658779297 666320114 665283813 660785599 662247925 662931519 662646942
3847.8 662646942 664484711 663994980 665821533 671191483 664268417 665729370 654508362 652664108
3855.6 652664108 663176880 663370361 660112762 661453857 664086304 666968002 661660995 661798553
3863.3 661798553 669942017 665673294 658073578 660647354 665291061 671990814 666854324 656455307
$$ packed form
3806.4F69046555p845307o049118M145432K205200L90701R0332K2888J042405N310058
3815.1F68359146l53393j5065232L949585O353150N227127L083191j6055451p67670
3822.8F54730453L811570K297516L045806j12991m031677k1057K287750L242340J279221
3831.4F66528931q462448J872406O822128n520706l09449Q385621o974793o160965
3839.2F56180725O295776l717422K0218P540817j036301m498214J462326O83594k84577
3847.8F62646942J837769m89731J826553N369950o923066J460953j1221008j844254
3855.6F52664108J0512772J93481l257599J341095K632447K881698n307007J37558
3863.3F61798553Q143464m268723p599716K573776M643707O699753n136490j0399017
$$ plain form
3871 656455307 659057159 665354462 670223389 661044312 659798203 663010178 662821808 665155792 670122223
3879.7 670122223 665574417 656175308 660904617 663023224 664970703 670805817 657800827 657280502
3887.4 657280502 661530380 662194672 666590424 667403412 659919281 660167389 663213654 661593094 662677765
3896.1 662677765 663991547 665762329 668394089 659069214 662692795 665747757 660161285 664246063
3903.8 664246063 662468262 660365143 659743500 660119781 662827835 663228989 663234406 662751236 662647247
3912.5 662647247 662577972 662582779 664003906 665776138 662856750 659384613 663794022 663972626 659638748
3921.1 659638748 661288605 663076706 664823685 663316345 660008774 660633163 661662064 662655563 662008743
3929.8 662008743 662351761 664245148 661601562 659608536 660909424 661752243 662397308 662638321 661896515
$$ packed form
3871F56455307K601852O297303M868927r179077j246109L211975j88370K333984M966431
3879.7F70122223m547806r399109M729309K118607J947479N835114j3004990n20325
3887.4F57280502M249878O64292M395752Q12988p484131K48108L046265j620560J084671
3896.1F62677765J313782J770782K631760r324875L623581L054962n586472M084778
3903.8F64246063j777801k103119o21643L76281K708054M01154N417m83170j03989
3912.5F62647247o9275M807J421127J772232k919388l472137M409409J78604m333878
3921.1F59638748J649857J788101J746979j507340l307571O24389J028901R93499o46820
3929.8F62008743L43018J893387k643586j993026J300888Q42819O45065K41013p41806
$$ plain form
3938.5 661896515 661383667 661004868 662457504 664223328 660709915 659349365 660557022 661683655 663116760
3947.2 663116760 660569382 660082932 660733566 659206085 660859680 661776962 661116562 660621948 660990982
3955.8 660990982 662068253 661726761 661531067 661236572 661738968 662281342 661188736 660917130 661083603
3964.5 661083603 661296387 661747971 661954727 661862793 661311569 660916061 661403198 661232681 660507355 660403214
3974.2 660403214 660071564 660423965 660954056 661280975 661330032 661292801 662121048 662026062 661278305 660908661
3983.8 660908661 661315384 661547699 661230392 661203308 660955887 661579666 661504745 660898056 660727005 660174332
3993.5 660174332 660597458 661428452 662439957 662333450 661294708 660809937 660728607
4000.2 660728607
$$ packed form
3938.5F61896515n12848l78799J452636J765824l513413j360550J207657J126633J433105
3947.2F63116760k547378m86450O50634j527481J653595R17282o60400m94614L69034
3955.8F60990982J077271l41492j95694k94495N02396N42374j092606k71606J66473
3964.5F61083603K12784M51584K06756r1934n51224l95508M87137j70517p25326j04141
3974.2F60403214l31650L52401N30091L26919M9057l7231Q28247r4986p47757l69644
3983.8F60908661M06723K32315l17307k7084k47421O23779p4921o06689j71051n52673
3993.5F60174332M23126Q30994J011505j06507j038742m84771q1330
4000.2F60728607
##END=$$ End of the data block
