##TITLE=$$ Begin of the data block
##JCAMP-DX=5.00 $$ ACD/SpecManager v 10.08
##SPECTROMETER/DATA SYSTEM=Varian
##DATE=14 Jan 2013 10:40:58
##DATA TYPE=INFRARED SPECTRUM
##DATA CLASS=XYDATA
##ORIGIN=
##OWNER=
##NPOINTS=3735
##FIRSTX=399.26403809
##LASTX=4000.35498047
##MAXX=4000.35498047
##MINX=399.26403809
##MAXY=71.86601257
##MINY=30.99615097
##XFACTOR=1.0000000000
##YFACTOR=0.000000100000000
##FIRSTY=49.27219391
##DELTAX=0.96440572
##XUNITS=1/CM
##YUNITS=TRANSMITTANCE
##XYDATA=(X++(Y..Y))
$$ plain form
399.3 492721939 494482269 502584839 506132812 506511307 506715126 502293167 501261330 494906616 494264221
407.9 494264221 491883011 483558807 483972588 490979652 500057640 502605820 498369331 489266434 489733162
416.6 489733162 499192276 498016357 489372063 490734138 494163322 490519867 484335442 485424309
424.3 485424309 491263885 495353165 496083450 498545570 497721405 501480522 505557213 500512619 495085869
433 495085869 492810211 489810295 486780090 491549149 492119293 489344101 487806587 489328766 494012032
441.7 494012032 493421478 494823761 495805969 495747528 490280304 487868652 495977135 495725098 494347496
450.4 494347496 493583908 491675110 492058945 488937607 487321167 488279991 489062614 486743965 488680763
459.1 488680763 489717064 486842194 486634827 489272995 489497147 485962944 485463600 487827225 488502960
$$ packed form
399.3D92721939J760330Q102570L547973L78495K03819m421959j031837o354714o42395
407.9D94264221k381210q324204M13781P007064R077988K548180m236489r102897M66728
416.6D89733162R459114j175919q644294J362075L429184l643455o184425J088867
424.3D85424309N839576M089280P30285K462120q24165L759117M076691n044594n426750
433D95085869k275658k999916l030205M769059N70144k775192j537514J522179M683266
441.7D94012032n90554J402283R82208n8441n467224k411652Q108483k52037j377602
450.4D94347496p63588j908798L83835l121338j616440R58824P82623k318649J936798
459.1D88680763J036301k874870k07367K638168K24152l534203m99344K363625O75735
$$ plain form
467.7 488502960 483358116 478521461 480643501 486892929 493365593 491126938 489835167 488358879
475.5 488358879 486676369 484476166 481595764 483452644 481555481 478566933 478206978 479989319 480387993
484.1 480387993 475945587 476138000 478870087 479933128 478899574 479258423 480894890 482017174 482755890
492.8 482755890 481981239 481701736 479989967 478640327 475972366 473671112 476115570 477414322 475534897
501.5 475534897 474680176 477172279 475525970 472474709 471818581 473574944 476010246 474549522 472554359
510.2 472554359 470769577 472058182 471495895 466856918 465552063 465633850 468014984 469377556 469956703
518.9 469956703 470302200 467592659 464426918 463382759 465684319 465683250 464693184 464282913 464386559
527.5 464386559 464253807 463301811 463712120 463227310 464069290 464311295 462935181 462350197 463046036 464684448
$$ packed form
467.7D88502960n144844m836655K122040O249428O472664k238655j291771j476288
475.5D88358879j682510k200203k880402J856880j897163k988548l59955J782341L98674
484.1D80387993m442406J92413K732087J063041j033554L58849J636467J122284P38716
492.8D82755890p74651k79503j711769j349640k667961k301254K444458J298752j879425
501.5D75534897q54721K492103j646309l051261o56128J756363K435302j460724j995163
510.2D72554359j784782J288605n62287m638977j304855Q1787K381134J362572N79147
518.9D69956703L45497k709541l165741j044159K301560j069r90066m10271J03646
527.5D64386559j32752r51996M10309m84810Q41980K42005j376114n84984O95839J638412
$$ plain form
537.2 464684448 463393898 461807137 461635475 461772461 459800758 458256645 458932762 457928696 458213959
545.9 458213959 457974815 457612228 458478241 458810921 458219223 456512756 456394882 455870895 455385818 455471535
555.5 455471535 456468544 457411118 456380539 455941811 455093803 455048599 455213585 455993156 456826134 455181732
565.1 455181732 453938599 452948914 453470612 455086403 456018372 455456696 455379829 456249161 455007935
573.8 455007935 454532127 454216080 454142418 455249443 455173759 453366356 452149467 454139977 455071907
582.5 455071907 454882927 453331871 452431374 455284805 456161537 454777145 454873505 456374016 456106682
591.2 456106682 454915047 455207291 455291595 456547203 458054047 457751160 457045593 457103462 457120094 457329254
600.8 457329254 457752113 457907677 457618561 456016960 455032310 454731140 454571190 454327621 453273315
$$ packed form
537.2D64684448j290550j586761j71662J36986j971703j544113O76117j004066K85263
545.9D58213959k39144l62587Q66013L32680n91698j706467j17874n23987m85077Q5717
555.5D55471535R97009R42574j030579m38728q48008m5204J64986P79571Q32978j644402
565.1D55181732j243133r89685N21698J615791R31969n61676p6867Q69332j241226
573.8D55007935m75808l16047p3662J107025p5684j807403j216889J990510R31930
582.5D55071907j88980j551056r00497K853431Q76732j384392R6360J500511k67334
591.2D56106682j191635K92244Q4304J255608J506844l02887p05567N7869J6632K09160
600.8D57329254M22859J55564k89116j601601r84650l01170j59950k43569j054306
$$ plain form
609.5 453273315 452547455 452216301 451988411 450737686 450457726 451358643 451649933 451555672 450320091 449683571
619.2 449683571 449856873 451133156 453183556 454639854 455650558 456522942 457379036 457722511 458440666
627.8 458440666 458917084 459480095 460641670 462170601 463643188 463992424 465221825 466066093 466642532
636.5 466642532 468488121 469852753 470467186 470677986 472116547 473849335 474847336 475819359 476208801
645.2 476208801 476094055 476194801 477667961 479400291 480346298 480428314 480200539 480924263 482017899
653.9 482017899 482722855 482811966 483182297 482445717 481019974 482104492 482926865 481948471 481537361 481633759
663.5 481633759 480462646 480257072 482917557 486796799 488794479 485012054 483177071 483284950 483922577
672.2 483922577 483971939 485381813 486827049 487647858 489701881 490409775 489700699 489821892 490891418
$$ packed form
609.5D53273315p25860l31154k27890j250725k79960R00917K91290r4261j235581o36520
619.2D49683571J73302J276283K050400J456298J010704Q72384Q56094L43475P18155
627.8D58440666M76418N63011J161575J528931J472587L49236J229401Q44268N76439
636.5D66642532J845589J364632O14433K10800J438561J732788R98001R72023L89442
645.2D76208801j14746J00746J473160J732330R46007Q2016k27775P23724J093636
653.9D82017899P04956Q9111L70331p36580j425743J084518Q22373r78394m11110R6398
663.5D81633759j171113k05574K660485L879242J997680l782425j834983J07879O37627
672.2D83922577M9362J409874J445236Q20809K054023P07894p09076J21193J069526
$$ plain form
680.9 490891418 492906265 494310226 494610214 495555763 497672920 498853912 498683891 498619652 499509468
689.6 499509468 500826073 500687027 500391045 501149178 502398453 503286133 503664322 504900665 505102005
698.2 505102005 504932976 506042480 505658455 504742699 505572395 507154541 507882080 508028526 508905220
706.9 508905220 510550957 512134666 512687721 512948456 513410950 513530006 513170395 512137375 512173843
715.6 512173843 513962898 515644150 516838036 517686844 517847633 517586060 517324677 517355156 517711182
724.3 517711182 518193016 519378853 520568695 520875664 522174797 524041977 524616127 525250320 525845833
733 525845833 525297127 524648018 524803009 525477257 526171074 527157249 528011208 529255524 530636902 530213585
742.6 530213585 530273476 530148430 528549690 528644028 529313202 530311928 531712303 532643280 533890419 534786530
$$ packed form
680.9D90891418K014847J403961K99988R45549K117157J180992j70021o4239Q89816
689.6D99509468J316605j39046k95982P58133J249275Q87680L78189J236343K01340
698.2E05102005j69029J109504l84025r15756Q29696J582146P27539J46446Q76694
706.9E08905220J645737J583709N53055K60735M62494J19056l59611j033020L6468
715.6E12173843J789055J681252J193886Q48808J60789k61573k61383L0479L56026
724.3E17711182M81834J185837J189842L06969J299133J867180N74150O34193N95513
733E25845833n48706o49109J54991O74248O93817R86175Q53959J244316J381378m23317
742.6E30213585N9891j25046j598740R4338O69174R98726J400375R30977J247139Q96111
$$ plain form
752.2 534786530 535914879 536152420 535535393 535923729 535686302 535320015 536536598 538616180 540251503
760.9 540251503 541484032 542832794 543624306 543595314 543810425 544466591 544096680 543235664 542845039 542890892
770.6 542890892 543827629 545112038 545713310 546276817 546741028 545738525 544897003 544940224 544864426 544621315
780.2 544621315 544228210 544444389 545071449 545952606 547118492 548233871 548333244 547751236 547929077 548396111
789.9 548396111 548867950 547936440 547325058 548353539 548669052 548831902 548651848 548695030 548757248 547175179
799.5 547175179 545076981 544012566 543223190 542051163 542393608 542551079 541441460 540140991 538562660
808.2 538562660 537837868 536920662 535153503 533787079 532487030 531327705 531113930 530510063 529908485
816.9 529908485 529860992 529251213 529388161 529576149 529218063 529763718 530900879 532055321 534085693
$$ packed form
752.2E34786530J128349K37541o17027L88336k37427l66287J216583K079582J635323
760.9E40251503J232529J348762P91512k8992K15111O56166l69911q61016l90625M5853
770.6E42890892R36737J284409O01272N63507M64211j002503q41522M3221p5798k43111
780.2E44621315l93105K16179O27060Q81157J165886J115379R9373n82008J77841M67034
789.9E48396111M71839r31510o11382J028481L15513J62850j80054M3182O2218j582069
799.5E47175179k098198j064415p89376j172027L42445J57471j109619j300469j578331
808.2E38562660p24792r17206j767159j366424j300049j159325k13775o03867o01578
816.9E29908485m7493o09779J36948J87988l58086N45655J137161J154442K030372
$$ plain form
825.5 534085693 537211037 540531731 544112701 545991478 546741562 548498688 550197983 552770348 554778290
834.2 554778290 556195107 558552589 561093063 563477974 564708138 566246643 568226318 569890251
841.9 569890251 570269241 569988174 570656776 571377678 573029709 574284706 575246124 576501274 577309341
850.6 577309341 577987823 578743019 579836769 579295578 579436684 580885353 581995468 583392296 584540749
859.3 584540749 585973930 586932220 587390556 587400589 587539406 587273827 586303749 585909538 585713043 586673126
868.9 586673126 586885033 586015816 585118065 584157486 582814713 580831032 579957008 579370689 579448776 578713531
878.6 578713531 577270470 577138367 577393951 577931290 577149696 576549683 576198883 575049057 573726845
887.3 573726845 572459755 572196503 571267700 570368614 571427345 573798637 574201813 573459396 573978500
$$ packed form
825.5E34085693L125344L320694L580970J878777P50084J757126J699295K572365K007942
834.2E54778290J416817K357482K540474K384911J230164J538505J979675J663933
841.9E69890251L78990k81067O68602P20902J652031J254997R61418J255150Q08067
850.6E77309341O78482P55196J093750n41191J41106J448669J110115J396828J148453
859.3E84540749J433181R58290M58336J0033J38817k65579r70078l94211j96495R60083
868.9E86673126K11907q69217q97751r60579j342773j983681q74024n86319P8087p35245
878.6E78713531j443061j32103K55584N37339p81594o00013l50800j149826j322212
887.3E73726845j267090k63252r28803q99086J058731K371292M03176p42417N19104
$$ plain form
895.9 573978500 573182983 571587296 570363693 570092850 569482231 568950043 569214745 568713684 570008659
904.6 570008659 571808929 573180046 575094795 576411629 576513443 576039581 576831169 577068558 577073517
913.3 577073517 577413139 577512131 577136612 575303841 573161774 571127357 569560127 567190971 564869614
922 564869614 563376007 560709991 557751350 555659561 554327164 551913986 548497581 545908241 544289246
930.7 544289246 542379150 539788589 538012772 536908226 536244774 535564308 534336014 533357048 532299309
939.3 532299309 530851784 530120506 530138626 529552956 528545609 527322655 526591263 526792336 527046852
948 527046852 527199020 526794930 527042885 527597771 526874580 525851021 525193405 524690590 523121071 521577950
957.7 521577950 520753098 519328499 517390747 514599724 512387619 511452522 509724503 507684135 506552162
$$ packed form
895.9E73978500p95517j595687j223603k70843o10619n32188K64702n01061J294975
904.6E70008659J800270J371117J914749J316834J01814m73862P91588K37389M959
913.3E77073517L39622R8992l75519j832771k142067k034417j567230k369156k321357
922E64869614j493607k666016k958641k091789j332397k413178l416405k589340j618995
930.7E44289246j910096k590561j775817j104546o63452o80466j228294r78966j057739
939.3E32299309j447525p31278J8120n85670j007347j222954p31392K01073K54516
948E27046852J52168m04090K47955N54886p23191j023559o57616n02815j569519j543121
957.7E21577950q24852j424599j937752k791023k212105r35097j728019k040368j131973
$$ plain form
966.3 506552162 505653725 504472733 503251724 501732483 499238129 496209526 493495102 491587486 489389763
975 489389763 486047440 482847862 479758224 477092628 474212303 470113945 466022263 462514915 459153862
983.7 459153862 454891815 451335602 447991867 443982124 440746498 437509079 434668922 431558876
991.4 431558876 428277245 425832787 424364853 422766609 420002861 417555466 415240250 413128777
999.1 413128777 410881233 408624535 406883469 405123825 403419876 402063370 400950508 398875008
1006.8 398875008 397280235 396197205 395142365 394370956 393074989 391402359 389538002 388654327 387171860
1015.5 387171860 385084152 382764816 380620651 379657936 377628441 375973396 374702797 373248215
1023.2 373248215 371577072 369860573 368798027 367753868 366862831 364837227 364102402 364209518 363804588
$$ packed form
966.3E06552162q98437j180992j221009j519241k494354l028603k714424j907616k197723
975D89389763l342323l199578l089638k665596k880325m098358m091682l507348l361053
983.7D59153862m262047l556213l343735m009743l235626l237419k840157l110046
991.4D31558876l281631k444458j467934j598244k763748k447395k315216k111473
999.1D13128777k247544k256698j741066j759644j703949j356506j112862k075500
1006.8C98875008j594773j083030j054840p71409j295967j672630j864357q83675j482467
1015.5C87171860k087708k319336k144165r62715k029495j655045j270599j454582
1023.2C73248215j671143j716499j062546j044159q91037k025604p34825J07116m04930
$$ plain form
1031.9 363804588 363018379 361790771 362139130 362274284 363042984 363988457 365268784 367081985 368015633
1040.6 368015633 368997803 369614487 371014900 371241608 370719032 370408936 369671021 368920212 367520065
1049.3 367520065 367259140 366754112 366219444 365275459 364271889 363759079 362324600 361664772 361071091
1058 361071091 361830139 362075272 362595863 364737663 366177711 368124924 369724426 371545601 372523804
1066.6 372523804 374129181 375842361 376126671 377057228 377722893 378784676 378894272 379115372 378989983
1075.3 378989983 379012070 380489502 380936317 381930771 381984673 382505074 383530846 383511314 383724594 384481621
1085 384481621 386371155 386979065 387885513 388870659 389447136 390087471 390528488 392299881 393467636
1093.6 393467636 394476013 395676498 397737503 399233093 399602318 400924187 401544991 402355003 403278198
$$ packed form
1031.9C63804588p86209j227608L48359J35154P68700R45473J280327J813201R33648
1040.6C68015633R82170O16684J400413K26708n22576l10096p37915p50809j400147
1049.3C67520065k60925n05028n34668r43985j003570n12810j434479o59828n93681
1058C61071091P59048K45133N20591K141800J440048J947213J599502J821175R78203
1066.6C72523804J605377J713180K84310R30557O65665J061783J09596K21100j25389
1075.3C78989983K2087J477432M46815R94454N3902N20401J025772j9532K13280P57027
1085C84481621J889534O07910R06448R85146N76477O40335M41017J771393J167755
1093.6C93467636J008377J200485K061005J495590L69225J321869O20804Q10012R23195
$$ plain form
1102.3 403278198 404634094 406020889 406368294 406686630 407789841 409710197 410019646 410707512 412145081
1111 412145081 412788582 412890511 412369843 412973480 413844643 414486961 414824905 414881821 414980202 414953537
1120.6 414953537 414815369 414584274 414997292 414427032 413884621 414468498 415414658 416644249 417897758
1129.3 417897758 419634933 421102295 423084259 424920425 426568832 428277702 429149780 430587463
1137 430587463 432058678 433816338 435546875 436492538 437936287 439911423 441863708 442703056 442210808
1145.7 442210808 441970253 442426529 442616158 443044128 443499756 443692780 444459267 444621773 444603920 444783783
1155.4 444783783 444581490 444051018 442881927 441700935 440840340 440943489 441408195 441870422 443067017
1164 443067017 444267082 445091515 446003342 447608604 449397392 450676498 451892052 454079781 456460724
$$ packed form
1102.3D03278198J355896J386795L47405L18336J103211J920356L09449O87866J437569
1111D12145081O43501J01929n20668O03637Q71163O42318L37944N6916R8381k6665
1120.6D14953537j38168k31095M13018n70260n42411N83877R46160J229591J253509
1129.3D17897758J737175J467362J981964J836166J648407J708870Q72078J437683
1137D30587463J471215J757660J730537R45663J443749J975136J952285Q39348m92248
1145.7D42210808k40555M56276J89629M27970M55628J93024P66487J62506j7853J79863
1155.4D44783783k02293n30472j169091j180992q60595J03149M64706M62227J196595
1164D43067017J200065Q24433R11827J605262J788788J279106J215554K187729K380943
$$ plain form
1172.7 456460724 458772202 461991768 464920464 467101097 469501686 472191124 473909950 474906387
1180.4 474906387 476472702 478097305 479409561 481075668 482552528 483869209 485565376 486888351
1188.1 486888351 488088455 488689957 488519592 488081703 487699890 487942581 487819252 487280884 486998367
1196.8 486998367 486600266 485856285 485556145 485379105 484011040 482584152 481955338 481352501 480335464
1205.5 480335464 479297638 478852272 478780594 478785172 478335533 477715607 477627144 477400246 476875572 476219597
1215.1 476219597 475448685 474862099 474642448 474450455 474193192 474352837 474339828 473807297 472925835 472108688
1224.8 472108688 471695213 471172180 470263634 469209518 468672867 467868462 466912689 466753159 466612701
1233.5 466612701 466371155 465640297 465243111 465110664 464608841 464299889 463677711 463752975 463701782 463303490
$$ packed form
1172.7D56460724K311478L219566K928696K180633K400589K689438J718826R96437
1180.4D74906387J566315J624603J312256J666107J476860J316681J696167J322975
1188.1D86888351J200104O01502j70365m37889l81813K42691j23329n38368k82517
1196.8D86998367l98101p43981l00140j77040j368065j426888o28814o02837j017037
1205.5D80335464j037826m45366p1678M578m49639o19926q8463k26898n24674o55975
1215.1D76219597p70912n86586k19651j91993k57263J59645j3009n32531q81462q17147
1224.8D72108688m13475n23033r08546j054116n36651q04405r55773j59530j40458
1233.5D66612701k41546p30858l97186j32447n01823l08952o22178P5264n1193l98292
$$ plain form
1243.1 463303490 463612442 463569946 463387222 463014793 462665443 462323303 461839485 461706619 461681137 461646118
1252.8 461646118 461300659 460871849 460843239 461087761 460972366 460888557 460714302 460513992 461235924 461669693
1262.4 461669693 461879616 462162018 462599564 463175125 463429375 464029350 464735947 465384712 465607567 465977440
1272 465977440 467096901 468011322 468793716 469760818 470881081 471686707 472507095 473525581 474382668
1280.7 474382668 475307922 476332512 477803841 479408112 480604439 481651039 482490044 483323708 484318428
1289.4 484318428 485093269 486026726 487046089 487964630 488942947 489616127 490105247 490649490 491227951
1298.1 491227951 491668739 491978073 492052498 492083778 492178383 492202263 492527962 492469254 492039146 492173500
1307.7 492173500 491816635 490740891 490845146 491291924 490608368 489574509 488980370 489312706 489339523
$$ packed form
1243.1D63303490L08952m2496j82724l72429l49350l42140m83818j32866k5482l5019
1252.8D61646118l45459m28810k8610K44522j15395q3809j74255k00310P21932M33769
1262.4D61669693K09923K82402M37546N75561K54250N99975P06597O48765K22855L69873
1272D65977440J119461R14421P82394R67102J120263Q05626Q20388J018486Q57087
1280.7D74382668R25254J024590J471329J604271J196327J046600Q39005Q33664R94720
1289.4D84318428P74841R33457J019363R18541R78317O73180M89120N44243N78461
1298.1D91227951M40788L09334P4425L1280R4605K3880L25699n8708m30108J34354
1307.7D92173500l56865j075744J04255M46778o83556j033859n94139L32336K6817
$$ plain form
1316.4 489339523 488983955 489395294 489604874 489950066 491034355 491670113 491743240 492300072 492787971 492918205
1326 492918205 493227921 493553429 493851547 493471794 493054047 492740822 492434273 492421989 492215462 492276688
1335.7 492276688 491816864 491015968 490700378 490949783 491180229 491367111 492599602 493497276 494275055
1344.4 494275055 494986000 495289383 496034737 496112099 496057625 496095810 496118774 495656509 495141792 495051880
1354 495051880 494536324 494908943 495390816 495289917 494637604 494333839 494089355 492873154 492486458 491756516
1363.7 491756516 491864624 492454758 492408447 492254982 491667252 491365623 491178246 491169205 490713730 490019989
1373.3 490019989 489885025 489483604 489493103 489847031 490575027 490587807 490410957 490142250 489350967 488353615
1382.9 488353615 486518288 485139809 484302483 483482933 481608849 480832138 480700264 479456291 478662758
$$ packed form
1316.4D89339523l55568M11339K09580L45192J084289O35758P3127N56832M87899J30234
1326D92918205L09716L25508K98118l79753m17747l13225l06549j2284k06527O1226
1335.7D92276688m59824q00896l15590K49405K30446J86882J232491Q97674P77779
1344.4D94275055P10945L03383P45354P7362n4474L8185K2964m62265n14717q9912
1354D95051880n15556L72619M81873j00899o52313l03765k44484j216201l86696p29942
1363.7D91756516J08108N90134m6311j53465n87730l01629j87377r041m55475o93741
1373.3D90019989j34964m01421R499L53928P27996J2780j76850k68707p91283r97352
1382.9D88353615j835327j378479q37326q19550j874084p76711j31874j243973p93533
$$ plain form
1391.6 478662758 477689705 476625023 473799553 469632683 468286400 467194290 466098480 463131371
1399.3 463131371 461299248 460889893 459157028 457613640 456707573 454693565 452448425 451196594 449405746
1408 449405746 447705345 446541214 445050583 444026146 443200150 442834015 442461929 441647377 440872841
1416.7 440872841 439716454 439546280 436915054 436398659 438094330 438679276 439161224 438950500 439978943
1425.4 439978943 441223488 441447105 442161369 442458153 442830582 443738632 445339813 446451569 447322884
1434.1 447322884 448924217 450356178 451674080 452691574 455038567 456190414 457077179 458704987
1441.8 458704987 459878120 461525917 462285194 463535538 464959145 466165390 467069778 468299637 469785957
1450.5 469785957 470010719 471167946 472403526 474427376 476424904 477434311 477424660 475864639 479908714
$$ packed form
1391.6D78662758r73053j064682k825470m166870j346283j092110j095810k967109
1399.3D63131371j832123m09355j732865j543388r06067k014008k245140j251831j790848
1408D49405746j700401j164131j490631j024437q25996l66135l72086q14552p74536
1416.7D40872841j156387j70174k631226n16395J695671N84946M81948k10724J028443
1425.4D39978943J244545K23617P14264K96784L72429R08050J601181J111756Q71315
1434.1D47322884J601333J431961J317902J017494K346993J151847Q86765J627808
1441.8D58704987J173133J647797P59277J250344J423607J206245R04388J229859J486320
1450.5D69785957K24762J157227J235580K023850J997528J009407r651j560021M044075
$$ plain form
1459.1 479908714 482043762 484252281 485618019 486381302 488917236 489721069 491506462 493613701 495946350
1467.8 495946350 498068504 499970131 502678795 504020882 505319290 506497803 509313698 512574272
1475.5 512574272 514186325 516256638 518864517 521097755 523054008 524490013 525180016 526284752
1483.2 526284752 527224884 527804489 528981667 529412766 529529953 531085892 531256027 530734634 531508560
1491.9 531508560 532154045 531493874 530360336 529233513 524706879 525782318 526226006 523551140 523653870
1500.6 523653870 523333359 522579422 522065506 522595253 522376442 514823036 510408783 512837715 515255089
1509.3 515255089 515775604 517051582 517018967 515967331 516633377 515844383 514503899 512454720 510020142
1518 510020142 511768684 513727188 512414398 509484787 510291405 512253456 514211349 513900719 514149132
$$ packed form
1459.1D79908714K135048K208519J365738P63283K535934Q03833J785393K107239K332649
1467.8D95946350K122154J901627K708664J342087J298408J178513K815895L260574
1475.5E12574272J612053K070313K607879K233238J956253J436005O90003J104736
1483.2E26284752R40132N79605J177178M31099J17187J555939J70135n21393P73926
1491.9E31508560O45485o60171j133538j126823m526634J075439M43688k674866J02730
1500.6E23653870l20511p53937n13916N29747k18811p553406m414253K428932K417374
1509.3E15255089N20515J275978l2615j051636O66046p88994j340484k049179k434578
1518E10020142J748542J958504j312790k929611Q06618J962051J957893l10630K48413
$$ plain form
1526.6 514149132 514662437 514118042 514829750 516236877 517075615 517694969 518337288 516715431 518179779
1535.3 518179779 518970032 519127808 520572128 517523804 514025574 517185631 518296928 517164383 519127617
1544 519127617 520617409 519464607 521008453 521405487 521923370 521401443 520254745 521472168 521757927
1552.7 521757927 522407990 519704437 519419212 521722527 524015350 520396309 510375290 513178368
1560.4 513178368 514239960 516060600 515802841 514511948 511968460 510425148 510230217 508343773 506756210
1569.1 506756210 498707123 497697105 497172394 494397163 491950684 489415474 489051208 479210129 477600021
1577.7 477600021 475962448 472672501 469486237 465132790 461992416 456747093 453403511 449127083
1585.5 449127083 445599747 442452698 438286018 435305290 430258179 427994194 423625565 420019341
$$ packed form
1526.6E14149132N13305n44395P11708J407127Q38738O19354O42319j621857J464348
1535.3E18179779P90253J57776J444320l048324l498230L160057J111297j132545J963234
1544E19127617J489792j152802J543846L97034N17883n21927j146698J217423K85759
1552.7E21757927O50063k703553k85225K303315K292823l619041j0021019K803078
1560.4E13178368J061592J820640k57759j290893k543488j543312j94931j886444j587563
1569.1E06756210q049087j010018n24711k775231k446479k535210l64266r841079j610108
1577.7D77600021j637573l289947l186264m353447l140374n245323l343582m276428
1585.5D49127083l527336l147049m166680k980728n047111k263985m368629l606224
$$ plain form
1593.2 420019341 416331406 412319527 410337486 406205444 404172134 400227814 398243446 395638084
1600.9 395638084 392798767 390764923 386877251 385650826 382695160 381580582 378922539 377749939
1608.6 377749939 376834488 374208717 374071846 371550674 371479607 369821663 370127373 370711327 364983215
1617.3 364983215 365776711 364857674 365973053 364850311 365868607 366064911 364333687 365647202 365085754
1626 365085754 366774139 365132675 366002808 367289124 368069077 368775902 368317566 370483971 371589737
1634.6 371589737 373312988 370989227 372838898 374423256 375574684 377488136 377678337 380463524
1642.4 380463524 381222878 383262825 385300331 384757729 386818352 386183357 389091377 390281563 393032150
1651 393032150 395781784 396116066 392748947 394327621 398499985 399555740 401427536 402439690 403800278
$$ packed form
1593.2D20019341l687935m011879j982041m132042k033310l944320j984368k605362
1600.9C95638084k839317k033844l887672j226425k955666j114578k658043j172600
1608.6C77749939r15451k625771j36871k521172p1067j657944L05710N83954n728112
1617.3C64983215P93496r19037J115379j122742J018296J96304j731224J313515n61448
1626C65085754J688385j641464Q70133J286316P79953P06825m58336K166405J105766
1634.6C71589737J723251k323761J849671J584358J151428J913452J90201K785187
1642.4C80463524P59354K039947K037506n42602K060623o34995K908020J190186K750587
1651C93032150K749634L34282l367119J578674M172364J055755J871796J012154J360588
$$ plain form
1659.7 403800278 405490303 407164116 409235573 409170074 412899170 415257339 417717705 420423660 423092918
1668.4 423092918 424625854 425060196 429017143 430285797 434214096 438303146 440646172 442496948
1676.1 442496948 445677490 449969444 452522278 455879364 457794113 461504173 465980339 465906715 467562485
1684.8 467562485 471589813 477952843 482405357 486229782 490071678 492995720 496630859 499862785
1692.5 499862785 503727837 507764206 511575241 511212196 515959244 522101250 527992477 533320122
1700.2 533320122 528682823 534904785 539885063 542779732 544781418 547096252 549702415 552827263
1707.9 552827263 556726189 559192352 560926056 562861481 564304543 566325722 566610146 566258507 570028572
1716.6 570028572 573362389 569253922 571588593 575097313 577555885 579414673 579779625 579802856 581244545
$$ packed form
1659.7D03800278J690025J673813K071457o5499L729096K358169K460366K705955K669258
1668.4D23092918J532936M34342L956947J268654L928299M089050K343026J850776
1676.1D42496948L180542M291954K552834L357086J914749L710060M476166p3624J655770
1684.8D67562485M027328O363030M452514L824425L841896K924042L635139L231926
1692.5D99862785L865052M036369L811035l63045M747048O142006N891227N327645
1700.2E33320122m637299O221962M980278K894669K001686K314834K606163L124848
1707.9E52827263L898926K466163J733704J935425J443062K021179K84424l51639L770065
1716.6E70028572L333817m108467K334671L508720K458572J858788L64952K3231J441689
$$ plain form
1725.3 581244545 582895927 583639297 584391098 585993767 585995255 586427727 589756813 592746887 590667496
1734 590667496 586448860 590615311 594115715 595639191 598398857 598762016 597442513 601663971 604966812
1742.7 604966812 605686378 607046700 610075378 612635727 614431305 616337471 617798271 622323914
1750.4 622323914 624545212 625164948 629854317 633247070 636155930 638907776 638492661 640054855 642897263
1759 642897263 645282593 649018936 649043808 648756180 652287827 654379044 656065750 658021011 659514694
1767.7 659514694 657649078 658919220 662137604 661756134 660534134 659723129 663786087 666821518 666554565
1776.4 666554565 668318787 669032669 670302658 670768051 669971313 671325073 673162918 674773941 674552689
1785.1 674552689 675086212 676717911 677498703 677734680 678705444 679080811 679477768 678728027 678354492
$$ packed form
1725.3E81244545J651382P43370P51801J602669J488M32472L329086K990074k079391
1734E90667496m218636M166451L500404J523476K759666L63159j319503M221458L302841
1742.7F04966812P19566J360322L028678K560349J795578J906166J460800M525643
1750.4F22323914K221298O19736M689369L392753K908860K751846m15115J562194K842408
1759F42897263K385330L736343K4872k87628L531647K091217J686706J955261J493683
1767.7F59514694j865616J270142L218384l81470j222000q11005M062958L035431k66953
1776.4F66554565J764222P13882J269989M65393p96738J353760J837845J611023k21252
1785.1F74552689N33523J631699P80792K35977R70764L75367L96957p49741l73535
$$ plain form
1793.8 678354492 681650162 682857971 682629471 684050369 685752411 685961075 684964676 686822739 686746902
1802.4 686746902 687011719 688439941 688880997 690074844 690903473 691480331 692383881 693472214 692271576
1811.1 692271576 692039261 693184280 693712387 694797134 694904861 695379028 695454483 696456909 697881470
1819.8 697881470 697996292 698866425 698539429 699494400 700199738 697029190 697145920 699372635 701524963
1828.5 701524963 701602478 699045181 700154877 702349777 702575378 702556915 702867355 703182373 703038559
1837.2 703038559 702844696 704181061 704288330 704791336 705238113 706445389 707965851 702929382 704151154
1845.8 704151154 706262207 706014175 706092148 706955948 707875519 707833405 708658066 708965225 709104614 708968658
1855.5 708968658 708548737 708769608 708590240 709119110 709373322 709833450 710080566 710589294 711213608 711130142
$$ packed form
1793.8F78354492L295670J207809k28500J420898J702042K08664r96399J858063p5837
1802.4F86746902K64817J428222M41056J193847Q28629N76858R03550J088333j200638
1811.1F92271576k32315J145019N28107J084747J07727M74167P5455J002426J424561
1819.8F97881470J14822Q70133l26996R54971P05338l170548J16730K226715K152328
1828.5G01524963P7515k557297J109696K194900K25601j8463L10440L15018j43814
1837.2G03038559j93863J336365J07269N03006M46777J207276J520462n036469J221772
1845.8G04151154K111053k48032P7973Q63800R19571m2114Q24661L07159J39389j35956
1855.5G08968658m19921K20871j79368N28870K54212M60128K47116N08728O24314q3466
$$ plain form
1865.1 711130142 711409836 710728912 711240158 710673218 709156265 710107422 711330185 712480011 712802582
1873.8 712802582 713202209 713277588 713683624 713812714 713322525 713166733 712796478 713259048 713432159 713829575
1883.4 713829575 713888168 713907013 714590759 714642029 715564880 715189667 713247070 713477478 714390640 714463959
1893.1 714463959 714735565 715103760 714709778 715668259 716104507 716052094 715997543 715562897 715373077 715191193
1902.7 715191193 715708694 715726318 715971146 716232147 716177750 716483078 716700134 716513138 716056747 716780396
1912.4 716780396 716572876 716457748 716409683 716322021 717800369 716425247 715834198 717150497 717743225
1921.1 717743225 718013000 716876984 716098251 716222916 716601868 716638336 716769791 717025681 717584991 718133316
1930.7 718133316 717766876 717322159 716584854 716757660 716841278 716642151 716648560 716532364 717196579 717629013
$$ packed form
1865.1G11130142K79694o80924N11246n66940j516953R51157J222763J149826L22571
1873.8G12802582L99627P5379M06036J29090m90189j55792l70255M62570J73111L97416
1883.4G13829575N8593J8845O83746N1270R22851l75213j942597K30408R13162P3319
1893.1G14463959K71606L68195l93982R58481M36248n2413n4551m34646j89820j81884
1902.7G15191193N17501J7624K44828K61001n4397L05328K17056j86996m56391P23649
1912.4G16780396k07520j15128m8065q7662J478348j375122n91049J316299N92728
1921.1G17743225K69775j136016p78733J24665L78952L6468J31455K55890N59310N48325
1930.7G18133316l66440m44717p37305J72806Q3618j99127O409j16196O64215M32434
$$ plain form
1940.3 717629013 718660126 718089752 716246872 716970825 717312393 716914749 716493149 716491699 716485825 716571732
1950 716571732 716593857 716763306 717298737 717308426 717227783 716586227 716547318 716623611 716344070 716451950 716187515
1960.6 716187515 716284256 716448364 716649399 716562119 716642761 716820526 715985718 715361786 715497437 716050491
1970.2 716050491 715817032 715733414 715916138 716006927 716636963 716903915 716921768 716379700 716200485 716080475
1979.9 716080475 715675430 715473709 715201187 715549393 715414124 715314789 715612488 715669632 715272751 714892578
1989.5 714892578 715517578 715652542 714798203 714262543 714748611 715054703 714928818 714956436 714785843 714930344
1999.2 714930344 714857864 714835434 714472351 714255371 714328613 713794022 713548889 713314667 713471451 713490448
2008.8 713490448 713464661 713560791 713687363 713929520 713214340 713028259 712967300 712691803 712396545 712167358
$$ packed form
1940.3G17629013J031113n70374j842880P23953L41568l97644m21600j450n874Q5907
1950G16571732K2125J69449N35431R689q0643o41556l8909P6293k79541J07880k64435
1960.6G16187515R6741J64108K01035q7280Q0642J77765q34808o23932J35651N53054
1970.2G16050491k33459q3618J82724R0789O30036K66952J7853n42068j79215j20010
1979.9G16080475m05045k01721k72522L48206j35269r9335K97699N7144l96881l80173
1989.5G14892578O25000J34964q54339n35660M86068L06092j25885K7618j70593J44501
1999.2G14930344p2480k2430l63083k16980P3242n34591k45133k34222J56784J8997
2008.8G13490448k5787R6130J26572K42157p15180j86081o0959k75497k95258k29187
$$ plain form
2018.5 712167358 712404861 712211380 712523346 712526321 712336502 712339706 712074585 711852798 711422043 711320343
2028.1 711320343 711000595 710913315 710738754 710778961 711485977 711517944 711522980 711262894 710707474 710348282
2037.7 710348282 710228043 709895248 709701691 709750671 709531479 709747543 709453201 709438553 709804916 709863892
2047.4 709863892 709748688 709056015 708746185 708535919 708614655 708537979 708385696 708523178 708588257 708897095
2057 708897095 708808594 708946838 708609009 708197479 708070068 707644730 707858047 707776718 707589264 707644196
2066.7 707644196 708016357 708048477 707584991 707416382 707274475 707172012 706709976 707080841 707359009 707157059
2076.3 707157059 707553940 707665787 707678146 707508087 707622452 707318268 706752930 706414642 706032104 705943680
2086 705943680 705799026 706396484 706445160 706213150 706448135 706271667 706010666 705567245 705354462 704930801
$$ packed form
2018.5G12167358K37503j93481L11966K975j89819L204k65121k21787m30755j01700
2028.1G11320343l19748q7280j74561M0207P07016L1967N036k60086n55420l59192
2037.7G10348282j20239l32795j93557M8980k19192K16064k94342j4648L66363N8976
2047.4G09863892j15204o92673l09830k10266P8736p6676j52283J37482O5079L08838
2057G08897095q8501J38244l37829m11530j27411m25338K13317q1329j87454N4932
2066.7G07644196L72161L2120m63486j68609j41907j02463m62036L70865K78168k01950
2076.3G07157059L96881J11847J2359j70059J14365l04184n65338l38288l82538q8424
2086G05943680j44654N97458M8676k32010K34985j76468k61001m43421k12783m23661
$$ plain form
2095.6 704930801 705003128 705274124 705521011 705782013 705128403 704824753 704719543 704954071 704771576 704336853
2105.2 704336853 704534531 704405746 704200134 703815155 703947372 704228363 704492798 704288177 703533096 703305130
2114.9 703305130 702928772 702832031 702590179 702793121 703026276 702911987 703336792 703129120 703020782 702719345
2124.5 702719345 702443466 702413406 702226944 702184372 702035065 702182007 702125168 702469711 702630157 702878571
2134.2 702878571 703542938 703231354 702838287 702189102 701684418 701598434 701817627 702181244 702288818 702359619
2143.8 702359619 702480164 702941971 702629471 702289429 702069244 701807327 701853867 701547165 701621094 701548309
2153.5 701548309 701923599 702236710 702154236 702546616 702516556 702283630 701641159 701440353 701638107 701766739
2163.1 701766739 702107544 702263184 702455521 702641296 702856445 702497406 702257996 701974335 701620560 701879349
$$ packed form
2095.6G04930801P2327K70996K46887K61002o53610l03650j05210K34528j82495m34723
2105.2G04336853J97678j28785k05612l84979J32217K80991K64435k04621p55081k27966
2114.9G03305130l76358r6741k41852K02942K33155j14289M24805k07672j08338l01437
2124.5G02719345k75879l0060j86462m2572j49307J46942n6839L44543J60446K48414
2134.2G02878571O64367l11584l93067o49185n04684q5984K19193L63617J07574P0801
2143.8G02359619J20545M61807l12500l40042k20185k61917M6540l06702P3929p2785
2153.5G01548309L75290L13111q2474L92380l0060k32926o42471k00806J97754J28632
2163.1G01766739L40805J55640J92337J85775K15149l59039k39410k83661l53775K58789
$$ plain form
2172.8 701879349 701856766 701981964 702108383 702580109 703006287 703112717 703120575 702835846 702925262 702424622
2182.4 702424622 701981964 701993103 702164993 702247162 702322311 703107605 703300858 703058624 702833481 703049545
2192 703049545 702903519 702040710 701892090 702086334 702489548 702789993 703078232 702936172 703078766 703534698
2201.7 703534698 703100662 702774658 702483673 702596283 702549820 702688904 702974701 702892303 703607483 703967285
2211.3 703967285 704125671 703788300 703422470 703219299 702803879 702908707 702606277 702765884 702847519 703165131
2221 703165131 703554916 703430939 703897858 703677902 703531799 703243332 702846146 702784042 702444839 702404480
2230.6 702404480 702635880 703211365 703253250 703303070 703046722 702551346 702689362 702536621 702510834 702451630
2240.3 702451630 702769470 702978058 703104324 703591080 703542557 703525162 703209991 702701492 702227707 701848679
$$ packed form
2172.8G01879349k2583J25198J26419M71726M26178J06430P858k84729Q9416n00640
2182.4G02424622m42658J1139J71890Q2169P5149P85294J93253k42234k25143K16064
2192G03049545j46026q62809j48620J94244M03214L00445K88239j42060J42594M55932
2201.7G03534698m34036l26004k90985J12610m6463J39084K85797q2398P15180L59802
2211.3G03967285J58386l37371l65830k03171m15420J04828l02430J59607Q1635L17612
2221G03165131L89785j23977M66919k19956j46103k88467l97186o2104l39203m0359
2230.6G02404480K31400N75485M1885M9820k56348m95376J38016j52741k5787n9204
2240.3G02451630L17840K08588J26266M86756m8523j7395l15171n08499m73785l79028
$$ plain form
2249.9 701848679 701608658 701904984 702671509 702975693 703116837 703053970 703197861 702910233 702633133 702644501
2259.5 702644501 702225647 702275620 702230911 702291107 702076797 701874161 702013168 702056274 702366638 702327347
2269.2 702327347 702310333 701977997 701995544 701946335 701730576 702032928 701803741 702030106 702123566 702388763
2278.8 702388763 702234497 701410065 701255722 700912781 701110229 701514511 702074051 701939468 701701965 702047577
2288.5 702047577 701417160 701421585 701181107 700783234 700860062 700927200 701028290 700891037 701314240 701025925
2298.1 701025925 700854034 700950317 700823441 700863800 700614319 700801239 700714035 700997696 701098175 701097870 701128006
2308.7 701128006 700352936 700684967 700833206 700605545 700034943 699332428 699816132 700416794 700882721 700981064
2318.4 700981064 701077881 700654755 700431900 700797882 700777817 701168671 700916901 700513229 700665283 700830841
$$ packed form
2249.9G01848679k40021K96326P66525L04184J41144o2867J43891k87628k77100J1368
2259.5G02644501m18854M9973m4709O0196k14310k02636J39007M3106L10364l9291
2269.2G02327347j7014l32336J7547m9209k15759L02352k29187K26365R3460K65197
2278.8G02388763j54266q24432j54343l42941J97448M04282N59540j34583k37503L45612
2288.5G02047577o30417M425k40478l97873P6828O7138J01090j37253M23203k88315
2298.1G01025925j71891R6283j26876M0359k49481J86920q7204K83661J00479l05L0136
2308.7G01128006p75070L32031J48239k27661n70602p02515M83704O00662M65927R8343
2318.4G00981064R6817m23126k22855L65982k0065L90854k51770m03672J52054J65558
$$ plain form
2328 700830841 700561218 699579391 699429092 700867996 701176224 699205246 698122025 698760681 699392548
2336.7 699392548 699238358 699895172 700222931 699509125 699700012 699622421 699437561 699114075 698794556 698483124
2346.3 698483124 697123642 695728760 696302032 698188934 698780746 699348984 699986954 699800720 698955460
2355 698955460 698787384 700479050 699748001 700019684 700631485 699873581 699577179 699444885 699467239 698265610
2364.7 698265610 698418121 697547379 695983810 694114380 693598175 694937897 694339066 694464264 694029694
2373.3 694029694 693990555 694587936 693606262 692512970 691532745 691301117 691090546 691091080 690877686 690569382
2383 690569382 690809402 690473404 690600204 690565567 689976578 689351044 688717422 688598328 688631668 688713989
2392.6 688713989 688444977 688248596 688278351 688507919 688540421 688088379 687849655 687405624 686939621 686301498
$$ packed form
2328G00830841k69623r81827j50299J438904L08228j970978j083221O38656O31867
2336.7F99392548j54190O56814L27759p13806J90887p7591j84860l23486l19519l11432
2346.3F98483124j359482j394882N73272J886902N91812N68238O37970j86234q45260
2355F98955460j68076J691666p31049K71683O11801p57904k96402j32294K2354j201629
2364.7F98265610J52511q70742j563569j869430n16205J339722n98831J25198m34570
2373.3F94029694l9139N97381r81674j093292r80225k31628k10571N34k13394l08304
2383F90569382K40020l35998J26800l4637n88989o25534o33622j19094L3340Q2321
2392.6F88713989k69012j96381K9755K29568L2502m52042k38724m44031m66003o38123
$$ plain form
2402.3 686301498 685932770 686143799 686443787 686635437 686379471 686232834 686106873 686057053 685614929 684987869
2411.9 684987869 684466705 683723755 683556213 683729553 684192581 684114685 683694153 683384018 682919388 682860641
2421.6 682860641 682399902 682072220 681682816 680952606 680798035 680992813 681025696 680927048 681186600 680926819
2431.2 680926819 680398254 679773254 679096832 678674927 678346710 678604584 678402710 678150635 678029709 677880859
2440.8 677880859 677825394 677072220 676609802 676374588 676157837 675889969 675436859 675130310 675284653 675623169
2450.5 675623169 675262604 675026703 674645615 674441452 674558182 673964081 673362732 672984848 672853851 672544327
2460.1 672544327 672299652 672347260 672004623 671475220 671191788 670925751 670483856 670232086 669735947 669377060
2469.8 669377060 668983917 668747177 669095230 668871155 668507690 667999268 667746735 667705841 667282791 666569901
$$ packed form
2402.3F86301498l68728K11029K99988J91650k55966j46637j25961m9820m42124o27060
2411.9F84987869n21164p42950j67542J73340M63028p7896m20532l10135m64630n8747
2421.6F82860641m60739l27682l89404p30210j54571J94778L2883r8648K59552k59781
2431.2F80926819n28565o25000o76422m21905l28217K57874k01874k52075j20926j48850
2440.8F77880859n5465p53174m62418k35214k16751k67868m53110l06549J54343L38516
2450.5F75623169l60565k35901l81088k04163J16730n94101o01349l77884j30997l09524
2460.1F72544327k44675M7608l42637n29403k83432k66037m41895k51770m96139l58887
2469.8F69377060l93143k36740L48053k24075l63465n08422k52533m0894m23050p12890
$$ plain form
2479.4 666569901 665842438 665885620 665617371 665496292 665433655 664859467 664399109 663881989 663718567 663258057
2489.1 663258057 662946548 662662125 662270355 662330170 662368088 662219696 661183243 660611649 660575409 660252228
2498.7 660252228 659705505 658996735 658918228 658697891 658597412 658416061 657915421 657574158 657045212 656414032
2508.3 656414032 655940170 656001968 655587692 655008774 654858093 654843903 654682465 654141693 654118042 653757706
2518 653757706 653135223 652806854 652538528 652387695 652148285 652218475 652026901 651567764 651213913 651009903
2527.6 651009903 650757370 650190353 649553070 649097824 648786774 648124542 647957458 647894211 647575760 647474136
2537.3 647474136 647463303 647544632 646947556 646452866 646013565 645681839 645470886 645135727 645211945 644666290
2546.9 644666290 644555511 644441071 643912811 643825150 643462372 642934036 641927948 641418304 641294174 641406555
$$ packed form
2479.4F66569901p27463M3182k68249j21079o2637n74188m60358n17120j63422m60510
2489.1F63258057l11509k84423l91770N9815L7918j48392j036453n71594l6240l23181
2498.7F60252228n46723p08770p8507k20337j00479j81351n00640l41263n28946o31180
2508.3F56414032m73862O1798m14276n78918j50681j4190j61438n40772k3651l60336
2518F53757706o22483l28369k68326j50833k39410P0190j91574m59137l53851k04010
2527.6F51009903k52533n67017o37283m55246l11050o62232j67084o3247l18451j01624
2537.3F47474136j0833Q1329n97076m94690m39301l31726k10953l35159P6218n45655
2546.9F44666290j10779j14440n28260q7661l62778n28336j006088n09644j24130J12381
$$ plain form
2556.6 641406555 641545258 640789337 640216064 639838448 639881172 639786263 639438782 639001541 638224716 637908592
2566.2 637908592 637460594 637144432 636928825 636721802 636811409 636939011 636833496 636089897 635532150 635196266
2575.9 635196266 635071220 634968071 634326897 633670883 633700714 633983498 633598862 633027382 632486725 632334862
2585.5 632334862 632264824 632281532 632136421 631079674 630476418 629856071 629457245 629513969 629381027 629453430
2595.1 629453430 629078178 628731918 628485451 628485603 628298874 627682381 627539253 627072296 626529045 626043701
2604.8 626043701 625394936 625014763 625111389 624979706 624218025 623894005 623784866 623508797 622974739 622520676
2614.4 622520676 622364616 622056427 621680946 621341629 621155205 620778389 620507965 620049553 619307404 619173431
2624.1 619173431 619146156 618666344 617887917 617398758 616926537 616451874 616147652 615807037 615553398 615255585
$$ packed form
2556.6F41406555J38703p55921n73273l77616M2724r4909l47481m37241p76825l16124
2566.2F37908592m47998l16162k15607k07023Q9607J27602j05515p43599n57747l35884
2575.9F35196266j25046j03149o41174o56014K9831K82784l84636n71480n40657j51863
2585.5F32334862p0038J6708j45111j056747o03256o20347l98826N6724j32942P2403
2595.1F29453430l75252l46260k46467J52j86729o16493j43128m66957n43251m85344
2604.8F26043701o48765l80173R6626j31683p61681l24020j09139k76069n34058m54063
2614.4F22520676j56060l08189l75481l39317j86424l76816k70424m58412p42149j33973
2624.1F19173431k7275m79812p78427m89159m72221m74663l04222l40615k53639k97813
$$ plain form
2633.7 615255585 615083542 614627571 614451218 614351387 613617668 613204384 613025169 612768478 612195892 611874962
2643.4 611874962 611716919 611269531 610945854 610465736 610021400 609527130 609308281 609078903 608517494 608280067
2653 608280067 607964020 607421036 606890755 606804237 606856575 606704559 606287880 605731735 605440063 604918900
2662.6 604918900 604436455 604229584 604191895 603970985 603657532 603563576 603166885 602904854 602614098 602199783
2672.3 602199783 601911049 601635246 601549149 601418457 601222801 600899124 600433159 600027390 599855576 599481049
2681.9 599481049 599115562 599023666 598625221 598294945 597908325 597481079 597164116 596978073 596880836 596730118
2691.6 596730118 596674500 596118546 595690536 595645256 595441704 594886551 594449005 594513664 594077110 593748741
2701.2 593748741 593372993 592883720 592920952 592736511 592668304 592647743 592258606 591967163 592232437 591906929
$$ packed form
2633.7F15255585j72043m55971j76353r9831p33719m13284j79215k56691n72586l20930
2643.4F11874962j58043m47388l23677m80118m44336m94270k18849k29378n61409k37427
2653F08280067l16047n42984n30281q6518N2338j52016m16679n56145k91672n21163
2662.6F04918900m82445k06871l7689k20910l13453r3956l96691k62031k90756m14315
2672.3F02199783k88734k75803q6097j30692j95656l23677m65965m05769j71814l74527
2681.9E99481049l65487r1896l98445l30276l86620m27246l16963j86043r7237j50718
2691.6E96730118n5618n55954m28010m5280k03552n55153m37546O4659m36554l28369
2701.2E93748741l75748m89273L7232j84441o8207k0561l89137k91443K65274l25508
$$ plain form
2710.9 591906929 591152267 591118584 590899963 590649490 590066338 589293442 589264412 589395180 589137535 589037170
2720.5 589037170 589323578 588834534 588313751 588273735 588040237 587588959 587150955 586988297 586637573 586638832
2730.2 586638832 586890144 586916962 586560593 586061707 585959053 585882149 586013031 585452538 584699173 584564934
2739.8 584564934 584455643 584648247 584758911 584814301 584572105 584358368 584299507 583738823 583187714 582923737
2749.4 582923737 582786407 582597275 582780380 582861137 582763557 582687988 582477264 582332420 581635780 581066551
2759.1 581066551 580438118 579757576 579678383 579808693 580167046 580106430 579807014 579476738 579345398 579164505
2768.7 579164505 578643684 578300896 578018341 578292313 578195152 577552834 577252998 577079773 576767578 576409378
2778.4 576409378 576366234 575842552 575463905 575230637 574582100 574156837 573700447 573490906 573230820 572913475
$$ packed form
2710.9E91906929p54662l3683k18621k50473n83152p72896k9030J30768k57645j00365
2720.5E89037170K86408m89044n20783m0016k33498m51278m38004j62658l50724J259
2730.2E86638832K51312K6818l56369m98886j02654p6904J30882n60493p53365j34239
2739.8E84564934j09291J92604J10664N5390k42196k13737n8861n60684n51109k63977
2749.4E82923737j37330j89132J83105Q0757r7580p5569k10724j44844o96640n69229
2759.1E81066551o28433o80542p9193J30310L58353o0616k99416l30276j31340j80893
2768.7E79164505n20821l42788k82555K73972r7161o42318k99836j73225l12195l58200
2778.4E76409378m3144n23682l78647k33268o48537m25263m56390k09541k60086l17345
$$ plain form
2788 572913475 572644501 572448463 572372437 571947021 571338348 570505295 570235062 570033684 569273376 568869705
2797.7 568869705 568604050 568184814 567867928 567770729 567280884 566543884 565935745 565743484 565840530 565193748
2807.3 565193748 564383011 563971825 563725510 563165512 562355118 561653328 561081238 560778961 560097275 559316940
2816.9 559316940 558761101 558313141 557744560 556644096 555844803 555718575 555562210 554843750 554099045
2825.6 554099045 553565102 553158340 552565765 551500397 550828667 550261345 549521866 548977585 548526306
2834.3 548526306 547570305 546337128 545771446 545019646 543895416 542939758 542110710 540895576 539410019
2843 539410019 538301697 536696434 534945068 533695602 532298546 530577126 529081116 527781601 526502800
2851.7 526502800 525690727 524903450 524726830 524764977 524050140 523611183 523401947 523361320 523390465 523125343
$$ packed form
2788E72913475k68974j96038p6026m25416o08673q33053k70233k01378p60308m03671
2797.7E68869705k65655m19236l16886r7199m89845p37000o08139j92261R7046o46782
2807.3E65193748q10737m11186k46315n59998q10394p01790n72090l02277o81686p80335
2816.9E59316940n55839m47960n68581j100464p99293j26228j56365p18460p44705
2825.6E54099045n33943m06762n92575j065368o71730n67322p39479n44281m51279
2834.3E48526306r56001j233177n65682p51800j124230r55658q29048j215134j485557
2843E39410019j108322j605263j751366j249466j397056j721420j496010j299515j278801
2851.7E26502800q12073p87277j76620L8147p14837m38957k09236m0627K9145k65122
$$ plain form
2861.3 523125343 522960663 522969627 522605858 522059479 521729698 521091423 520271149 519561386 519092522 518524628
2870.9 518524628 518008690 517661552 516973152 516749496 516627922 516037865 515147896 514440155 514351082 513899956
2880.6 513899956 512967186 512135277 511712418 511458321 511095505 510300636 509269295 508619576 507986984
2889.3 507986984 507524338 506937523 506331787 505462799 504428787 504149361 503131065 501945152 501479301
2897.9 501479301 500976219 500611801 500341072 499975128 499193573 498406868 497678261 497185822 496975517 496504784
2907.6 496504784 495617676 494409180 493705330 492808113 491986504 491540833 490271530 489062462 487926331
2916.3 487926331 486583519 485478592 484347801 483293114 482343483 481318169 480477524 480175362 480159073
2925 480159073 480287971 480148697 479790840 480184975 480830574 480610199 480242004 480454330 480678902 480986137
$$ packed form
2861.3E23125343j64680Q964l63769n46379l29781o38275q20274p09763m68864n67894
2870.9E18524628n15938l47138o88400k23656j21574n90057q89969p07741q9073m51126
2880.6E13899956r32770q31909m22859k54097l62816p94869j031341o49719o32592
2889.3E07986984m62646n86815o05736q68988j034012k79426j018296j185913m65851
2897.9E01479301n03082l64418k70729l65944p81555p86705p28607m92439k10305m70733
2907.6D96504784q87108j208496p03850q97217q21609m45671j269303j209068j136131
2916.3D87926331j342812j104927j130791j054687r49631j025314q40645l02162j6289
2925D80159073J28898j39274l57857L94135O45599k20375l68195K12326K24572L07235
$$ plain form
2934.6 480986137 481620789 482439308 482724533 482658577 483314400 484340286 485271339 485648155 485679550 485855598
2944.2 485855598 486427917 487275467 487688103 488295670 488985939 489329605 489418793 489603615 490107079 490009613
2953.9 490009613 489834633 490153961 490553436 490647469 490915031 491708450 492255974 492839584 493499947 494094200
2963.5 494094200 494855499 495447578 495328789 495143318 495603981 496249352 497058258 497830162 498731003 499388962
2973.2 499388962 499910622 500532265 500373230 500361786 500460358 500632553 501053886 501380463 501941032 502300034
2982.8 502300034 502714157 502868423 502849197 502741890 502580757 503092384 503341217 503566055 503788071 503489151
2992.5 503489151 503308144 503320045 503102264 502852402 502959785 502560196 502166061 502200508 501777573 501072006
3002.1 501072006 500416336 500332451 500425682 500011749 499537773 499291458 499142570 498813057 498234711 497818680
$$ packed form
2934.6D80986137O34652Q18519K85225o5956O55823J025886R31053L76816L1395J76048
2944.2D85855598N72319Q47550M12636O07567O90269L43666Q9188J84822N03464r7466
2953.9D90009613j74980L19328L99475R4033K67562P93419N47524N83610O60363N94253
2963.5D94094200P61299N92079j18789j85471M60663O45371Q08906P71904R00841O57959
2973.2D99388962N21660O21643j59035j1444R8572J72195M21333L26577N60569L59002
2982.8E02300034M14123J54266j9226j07307j61133N11627K48833K24838K22016k98920
2992.5E03489151j81007J1901k17781k49862J07383l99589l94135L4447m22935p05567
3002.1E01072006o55670q3885R3231m13933m73976k46315j48888l29513n78346m16031
$$ plain form
3011.7 497818680 497161865 496031876 495608559 495586433 495454979 495350838 494877472 494057503 493231316 492884102
3021.4 492884102 492502060 491981621 491611671 490979309 490306282 489633064 488862228 488470650 488356476 487464943
3031 487464943 486707726 486717949 486225204 485441246 484680328 484309692 484162483 483556252 482790031 482264633
3040.7 482264633 481860504 481110916 480220528 479419594 478756332 477918358 477321892 477232704 476871719 476322937
3050.3 476322937 475375519 474394531 473902321 473953667 473608093 472592468 472206802 471631813 471121712 470671997
3060 470671997 469771423 468899078 468175735 468197327 467861176 467422180 466833611 465676155 465240440 464873276
3069.6 464873276 464507713 463998489 463407516 463002472 462391624 461709671 461068153 461029167 460986938 460382309
3079.2 460382309 459590836 459048233 458663101 458142128 457523232 456745872 456302109 455595741 455151329 455359039
$$ packed form
3011.7D97818680o56815j129989m23317k2126j31454j04141m73366q19969q26187l47214
3021.4D92884102l82042n20439l69950o32362o73027o73218p70836l91578j14174q91533
3031D87464943p57217J0223m92745p83958p60918l70636j47209o06231p66221n25398
3040.7D82264633m04129p49588q90388q00934o63262q37974n96466q9188l60985n48782
3050.3D76322937r47418r80988m92210N1346l45574j015625l85666n74989n10101m49715
3060D70671997r00574q72345p23343K1592l36151m38996n88569j157456m35715l67164
3069.6D64873276l65563n09224n90973m05044o10848o81953o41518l8986m2229o04629
3079.2D60382309p91473n42603l85132n20973o18896p77360m43763p06368m44412K07710
$$ plain form
3088.9 455359039 454776840 453790665 453192253 452939339 452465782 452017632 451568336 450980759 450703888 450287743
3098.5 450287743 449772034 448772011 447767868 447330971 447000732 446681099 445942612 445256538 444844933
3107.2 444844933 444418640 443946304 443599472 443176422 442555962 442210388 441525192 440646629 439934349 439261284
3116.9 439261284 438620949 437935371 437650299 437286835 436650848 435957146 435098038 434757996 434622459 433450470
3126.5 433450470 432352448 432205887 432083549 431812897 430985298 430310020 429835701 428924332 428368759
3135.2 428368759 428024826 427906723 427158165 426060371 425507317 424789848 424379082 423830032 422994118
3143.9 422994118 422567291 422451782 422119255 421141624 420278893 419934654 419713173 418857079 417598152
3152.5 417598152 416906204 416600990 416008530 415395088 414942360 414247780 413808403 413113632 412185860 411602478
$$ packed form
3088.9D55359039n82199r86175n98412k52914m73557m48150m49296n87577k76871m16145
3098.5D50287743n15709j000023j004143m36897l30239l19633p38487o86074m11605
3107.2D44844933m26293m72336l46832m23050o20460l45574o85196q78563p12280o73065
3116.9D39261284o40335o85578k85072l63464o35987o93702q59108l40042j35537j171989
3126.5D33450470j098022j46561j22338k70652q27599o75278m74319r11369n55573
3135.2D28368759l43933j18103p48558j097794n53054p17469m10766n49050q35914
3143.9D22994118m26827j15509l32527r77631q62731l44239k21481q56094j258927
3152.5D17598152o91948l05214n92460o13442m52728o94580m39377o94771r27772n83382
$$ plain form
3162.2 411602478 411209488 411212463 410499954 409491005 408874321 408441811 408480797 407911301 406921692 406158104
3171.8 406158104 405375252 404694099 403894272 402953339 402516289 402417450 401841011 401339569 400946808 400071564
3181.5 400071564 399422607 399206886 398578606 397607994 396918030 396375885 395841866 395387611 395008583 394415970
3191.1 394415970 393810310 393353615 392760353 392120667 391443520 390850220 390114708 389714966 389331589 388302612
3200.8 388302612 387815857 387507439 387100487 386836166 386156769 385197563 384580193 384297867 383814850 383535767
3210.4 383535767 382877045 382199631 382223473 381846085 381287918 380558319 379575729 379022179 378879585 378387260
3220 378387260 377541161 377042732 376820297 376445122 375704269 375482254 375241394 374633484 374167747 373282394
3229.7 373282394 372808990 372738457 372678871 372307091 371661453 371332130 370877151 370250397 369266090 368770409
$$ packed form
3162.2D11602478l92990K975p12509j008949o16684m32510L8986n69496r89609p63588
3171.8D06158104p82852o81153p99827r40933m37050r8839n76439n01442l92761q75244
3181.5D00071564o48957k15721o28280r70612o89964n42145n34019m54255l79028n92613
3191.1C94415970o05660m56695n93262o39686o77147n93300p35512l99742l83377j028977
3200.8C88302612m86755l08418m06952k64321o79397r59206o17370k82326m83017k79083
3210.4C83535767o58722o77414K3842l77388n58167p29599r82590n53550j42594m92325
3220C78387260q46099m98429k22435l75175p40853k22015k40860o07910m65737q85353
3229.7C73282394m73404p0533n9586l71780o45638l29323m54979o26754r84307m95681
$$ plain form
3239.3 368770409 368544159 368084564 367834015 367518654 367746086 367407913 366400681 365608215 364828491
3248 364828491 364612312 364174614 363240929 362812767 363099937 363063202 362810745 362649384 362032623 361338387
3257.7 361338387 360441208 359678078 359469185 359828148 359931831 359279938 358536148 357784767 357865715 358021851
3267.3 358021851 357559242 357444191 357472916 356887016 356009750 355658913 354871445 354335861 354288864 353684807
3276.9 353684807 353590965 353687630 353470993 353138313 352787781 352446251 352332611 352116241 351221237 350666237
3286.6 350666237 350548668 350906410 350941200 350236168 350081673 349601288 348930397 348865356 348611794 348135338
3296.2 348135338 347876358 347678146 347551193 347344360 346834869 346887856 346935997 346465111 346031837 345295868
3305.9 345295868 344550972 344312973 344285011 343814240 343040047 342391167 342179718 341809006 340911903 340999489
$$ packed form
3239.3C68770409k26250m59595k50549l15361K27432l38173j007232p92466p79724
3248C64828491k16179m37698r33685m28162K87170l6735k52457j61361o16761o94236
3257.7C61338387q97179p63130k08893L58963J03683o51893p43790p51381Q0948J56136
3267.3C58021851m62609j15051K8725n85900q77266l50837p87468n35584m6997o04057
3276.9C53684807r3842R6665k16637l32680l50532l41530j13640k16370q95004n55000
3286.6C50666237j17569L57742L4790p05032j54495m80385o70891o5041k53562m76456
3296.2C48135338k58980j98212j26953k06833n09491N2987M8141m70886m33274p35969
3305.9C45295868p44896k37999k7962m70771p74193o48880k11449l70712q97103Q7586
$$ plain form
3315.5 340999489 341565514 341265144 340454140 339885674 339616470 339067307 338292847 337867203 337951584 337241135
3325.2 337241135 336211700 336072311 335771790 335307083 335034561 334366913 333034096 332441330 332887764
3333.8 332887764 332672195 332017097 331396217 330535316 329759712 329487762 329287605 328963661 328636208 327794266
3343.5 327794266 326880569 326251640 325880737 325395966 324940300 324881973 324488029 324272079 324292488 323869667
3353.1 323869667 323092651 322412567 322004967 321677246 321654282 321358414 320718079 320190277 320285645 320486221
3362.8 320486221 319738693 319260998 318766327 318234558 318372250 317999573 317427235 317029324 316812801 316620522
3372.4 316620522 316000881 315515766 315380173 315498638 315482483 315261421 315278759 315159550 314776402 314230824
3382.1 314230824 313557701 313346577 313450813 313473225 313335304 312971802 312901878 312930508 312592239 311990356
$$ packed form
3315.5C40999489N66025l00370q11004n68466k69204n49163p74460m25644Q4381p10449
3325.2C37241135j029435j39389l00521m64707k72522o67648j332817n92766M46434
3333.8C32887764k15569o55098o20880q60901p75604k71950k00157l23944l27453q41942
3343.5C27794266r13697o28929l70903m84771m55666n8327l93944k15950K0409m22821
3353.1C23869667p77016o80084m07600l27721k2964k95868o40335n27802R5368K00576
3362.8C20486221p47528m77695m94671n31769J37692l72677n72338l97911k16523j92279
3372.4C16620522o19641m85115j35593J18465j6155k21062J7338j19209l83148n45578
3382.1C14230824o73123k11124J04236K2412j37921l63502o9924K8630l38269o01883
$$ plain form
3391.7 311990356 311706486 312130966 312061558 311694832 312001591 312177067 311977978 311741009 311148109 310462551
3401.3 310462551 310456352 311029053 310888481 310303745 310493374 310590611 310458412 310604496 310935326 311404629
3411 311404629 311173992 310743370 310567837 310282173 309974289 309961510 310610695 311042633 311554432 312062588
3420.6 312062588 311624680 311481285 311746807 311749763 311576328 311726742 312232189 312743835 313098946 313104534
3430.3 313104534 313189507 313109112 312888222 313548317 314439754 314251423 313849678 313934002 314193077 314831486
3439.9 314831486 315449638 315981407 315929489 315740833 316366901 317129002 317853374 317878494 318227501 318930473
3449.6 318930473 319049931 319474087 319822731 320310326 320580826 320661125 321567917 322329140 322685814 323179932
3459.2 323179932 323625298 323773346 324398842 325108643 325755196 326796150 327471733 328067207 328153572 328351288
$$ packed form
3391.7C11990356k83870M24480o9408l66726L06759J75476j99089k36969n92900o85558
3401.3C10462551o199N72701j40572n84736J89629R7237j32199J46084L30830M69303
3411C11404629k30637m30622j75533k85664l07884j2779O49185M31938N11799N08156
3420.6C12062588m37908j43395K65522K956j73435J50414N05447N11646L55111N588
3430.3C13104534Q4973q0395k20890O60095Q91437j88331m01745Q4324K59075O38409
3439.9C14831486O18152N31769n1918j88656O26068P62101P24372K5120L49007P02972
3449.6C18930473J19458M24156L48644M87595K70500Q0299R06792P61223L56674M94118
3459.2C23179932M45366J48048O25496P09801O46553J040954O75583N95474Q6365J97716
$$ plain form
3468.8 328351288 329032211 329349060 329969940 330681686 331287994 331535683 332074051 333331108 334052429
3477.5 334052429 334540596 335179710 335659294 336182518 336828156 337199593 338321457 339856415 340371857
3486.2 340371857 340751915 340931778 341385689 342474327 343410225 344509277 345329323 345868988 346500816
3494.9 346500816 347205887 348217621 349156342 349660912 349930687 350282249 351161880 352213707 352651024
3503.6 352651024 353134956 354192810 355286636 355925369 356937866 357908592 358429337 359653587 360229149
3512.2 360229149 360637512 361232491 361978722 363534279 364232712 364910355 366062164 366714745 367601433
3520.9 367601433 369314919 370573616 370456276 371043587 371867676 372910042 374008446 374361839 375031509
3529.6 375031509 376146584 377593307 378941689 380027924 380449371 381734962 383270912 383386345 384823647
$$ packed form
3468.8C28351288O80923L16849O20880P11746O06308K47689N38368J257057P21321
3477.5C34052429M88167O39114M79584N23224O45638L71437J121864J534958N15442
3486.2C40371857L80058J79863M53911J088638R35898J099052Q20046N39665O31828
3494.9C46500816P05071J011734R38721N04570K69775L51562Q79631J051827M37317
3503.6C52651024M83932J057854J093826O38733J012497R70726N20745J224250N75562
3512.2C60229149M08363N94979P46231J555557O98433O77643J151809O52581Q86688
3520.9C67601433J713486J258697j17340N87311Q24089J042366J098404L53393O69670
3529.6C75031509J115075J446723J348382J086235M21447J285591J535950J15433J437302
$$ plain form
3538.3 384823647 386402473 387235184 388017921 389379158 391076508 391976395 392556381 393300591 395424156
3547 395424156 396237679 396713943 397883682 399230080 401520767 401800652 403145943 404516487 405351601
3555.6 405351601 407327499 407729263 409045372 410765915 412202301 413493576 414827499 415833092
3563.4 415833092 416671944 420858879 422661324 422407646 422698822 421975937 425019646 427311172 428681946
3572 428681946 430123596 431756058 432941208 434159966 436197319 436671143 439108353 441367493 442179565
3580.7 442179565 443824120 445573082 447674561 448975563 452881012 455212898 453425026 455088501
3588.4 455088501 455218925 457464790 460348625 463398819 465127449 465339546 467929192 467397461 469375801
3597.1 469375801 473111839 474586906 477528191 478371010 479204559 481481209 482526970 484316635 487905998
$$ packed form
3538.3C84823647J578826Q32711P82737J361237J697350Q99887N79986P44210K123565
3547C95424156Q13523M76264J169739J346398K290687K79885J345291J370544Q35114
3555.6D05351601J975898M01764J316109J720543J436386J291275J333923J005593
3563.4D15833092Q38852M186935J802445k53678K91176p22885L043709K291526J370774
3572D28681946J441650J632462J185150J218758K037353M73824K437210K259140Q12072
3580.7D42179565J644555J748962K101479J301002L905449K331886j787872J663475
3588.4D55088501J30424K245865K883835L050194J728630K12097K589646n31731J978340
3597.1D69375801L736038J475067K941285Q42819Q33549K276650J045761J789665L589363
$$ plain form
3605.8 487905998 490773468 490000153 492697487 493455772 492861862 499133644 501675949 500339699 503953323
3614.5 503953323 504064903 506934166 510918770 511892242 514590874 514476471 515766907 519673462 522074776
3623.1 522074776 523243065 525031433 528010406 531366959 537658310 539647102 530074844 532574921
3630.9 532574921 537763023 543785973 545784416 544442711 546814651 549896851 552811890 554249077
3638.6 554249077 555955162 558688049 561122398 562524529 563750343 566035919 568936424 574654884
3646.3 574654884 575341835 572677994 577674446 577857857 576738663 576422272 580828476 584735146 588391418
3655 588391418 594416008 588237915 588978462 594678001 596732216 598682747 599221840 601286507 603244057
3663.6 603244057 604726486 606100197 606205788 609706726 612105751 612264137 613581429 607536201 608770752
$$ packed form
3605.8D87905998K867470p73315K697334P58285n93910O271782K542305j336250L613624
3614.5E03953323J11580K869263L984604R73472K698632j14403J290436L906555K401314
3623.1E22074776J168289J788368K978973L356553O291351J988792r572258K500077
3630.9E32574921N188102O022950J998443j341705K371940L082200K915039J437187
3638.6E54249077J706085K732887K434349J402131J225814K285576K900505N718460
3646.3E74654884O86951k663841M996452J83411j119194l16391M406204L906670L656272
3655E88391418O024590o178093P40547N699539K054215J950531N39093K064667J957550
3663.6F03244057J482429J373711J05591L500938K399025J58386J317292o045228J234551
$$ plain form
3672.3 608770752 616605034 626432495 629331436 611191711 611204185 619033394 624301147 622381248
3680 622381248 622249107 624807434 626348457 627869949 628930550 629328995 633172989 639721527 630878677
3688.7 630878677 627490540 636303825 631512260 630658035 635702515 636612244 638572540 639359055 638748245
3697.4 638748245 639486809 639364433 641251526 644592133 640329742 637825699 642167206 643738556 644076004
3706.1 644076004 643813705 646079178 651056061 643389587 645684204 651399918 638875694 642075882
3713.8 642075882 646791611 647211227 648095551 650286102 650961914 647434082 648756409 654799271 651484146
3722.5 651484146 646691360 651155090 651743698 652086945 650537109 649804459 652931213 653909225 660203476
3731.2 660203476 658060913 649196854 657765884 657930069 648382950 649114761 651930542 652850800 654226608
$$ packed form
3672.3F08770752P834282R827461K898941j8139725J2474P829209N267753j919899
3680F22381248j32141K558327J541023J521492J060601L98445L843994O548538q842850
3688.7F30878677l388137Q813285m791565q54225N044480R09729J960296P86515o10810
3697.4F38748245P38564j22376J887093L340607m262391k504043M341507J571350L37448
3706.1F44076004k62299K265473M976883p666474K294617N715714j2524224L200188
3713.8F42075882M715729M19616Q84324K190551O75812l527832J322327O042862l315125
3722.5F51484146m792786M463730N88608L43247j549836p32650L126754R78012O294251
3731.2F60203476k142563q864059Q569030J64185r547119P31811K815781R20258J375808
$$ plain form
3739.8 654226608 656836853 654162292 656851730 669037323 663345184 643463593 651697311 657154083
3747.5 657154083 662648773 659112320 648294449 660910568 658630676 648214874 653569412 658338776
3755.3 658338776 661650848 657556152 659389648 664134521 656044388 654128418 658598480 660633621
3763 660633621 661287460 664032440 661540756 657200775 660078125 665627441 667914352 659145813 658800583
3771.7 658800583 661440659 662090530 663271103 663172226 663758087 663484573 666049652 666898804 659504700
3780.3 659504700 661156998 662996674 663842545 665911102 663241653 662534561 663827744 664734802 665775986
3789 665775986 665336838 665161362 665382614 665344620 664451141 665412903 668246536 664090042 659883957 662268677
3798.7 662268677 666757507 673983231 669871902 656907272 659889526 662811432 667050858 673555908
$$ packed form
3739.8F54226608K610245k674561K689438J2185593n692139j9881591Q233718N456772
3747.5F57154083N494690l536453j0817871J2616119k279892j0415802N354538M769364
3755.3F58338776L312072m094696J833496M744873q090133j915970M470062K035141
3763F60633621O53839K744980k491684m339981K877350N549316K286911q768539l45230
3771.7F58800583K640076O49871J180573r8877N85861k73514K565079Q49152p394104
3780.3F59504700J652298J839676Q45871K068557k669449p07092J293183R07058J041184
3789F65775986m39148j75476K21252l7994q93479R61762K833633m156494m206085K384720
3798.7F62268677M488830P225724m111329j2964630K982254K921906M239426O505050
$$ plain form
3806.4 673555908 665304337 659624252 663828583 665711060 665839539 666047821 665972672 666760941 671850281
3815.1 671850281 672188797 658755875 662103958 667966995 672244797 674518890 659852142 659406738
3822.8 659406738 664361725 666671143 669190826 668889084 663944016 663734436 665648575 668869247 670787430
3831.4 670787430 663452301 665761566 672319717 666188889 664463501 672515793 664918594 658425140
3839.2 658425140 666716080 663493042 662713547 669778824 667936707 663894424 666163635 667142410 667007980
3847.8 667007980 668872070 667796631 669649277 676297913 670861664 671293030 657101364 656080780
3855.6 656080780 666753464 666689453 664990540 667360153 669334869 671744080 666067200 665421143 673024521
3864.2 673024521 668076553 661611557 665048599 669602280 676792679 671744385 659880142 662352982
$$ packed form
3806.4F73555908q251571n680085M204331J882477J28479K08282p5149P88269N089340
3815.1F71850281L38516j3432922L348083N863037M277802K274093j4666748m45404
3822.8F59406738M954987K309418K519683l01742m945068k09580J914139L220672J918183
3831.4F70787430p335129K309265O558151o130828j725388Q052292p597199o493454
3839.2F58425140Q290940l223038p79495P065277j842117m042283K269211R78775j34430
3847.8F67007980J864090j075439J852646O648636n436249M31366j4191666j020584
3855.6F56080780J0672684o4011j698913K369613J974716K409211n676880o46057P603378
3864.2F73024521m947968o464996L437042M553681P190399n048294j1864243K472840
$$ plain form
3871.9 662352982 668876953 673906860 664518127 663598633 667491226 667064133 669158325 674794998 670275192
3880.6 670275192 660837326 665922012 668446426 670685349 676127167 662995911 662222214 666236954
3888.3 666236954 667718506 672713699 672737961 664133072 664261780 667580795 666457520 667895584 669251709
3897 669251709 670375595 671651459 662623215 667452621 671171722 665308533 668263779 665373154 663472900
3905.7 663472900 663746414 664319229 666548004 666713562 666940231 667122574 667547760 667753143 667563629
3914.4 667563629 668321686 669689178 666727448 663632507 667987671 667950516 664120712 666147385 667807693
3923.1 667807693 669024963 667211304 664224472 665662613 667111969 668081512 667483826 667086487 668686752
3931.7 668686752 666539154 664839401 665866547 665848694 666461639 666739349 665680237 665383759 665622559
$$ packed form
3871.9F62352982O523971N029907r388733r19494L892593m27093K094192N636673m519806
3880.6F70275192r437866N084686K524414K238923N441818j3131256p73697M014740
3888.3F66236954J481552M995193K4262q604889J28708L319015j123275J438064J356125
3897F69251709J123886J275864r028244M829406L719101n863189K955246k890625j900254
3905.7F63472900K73514N72815K228775J65558K26669J82343M25186K05383j89514
3914.4F67563629P58057J367492k961730l094941M355164l7155l829804K026673J660308
3923.1F67807693J217270j813659k986832J438141J449356R69543n97686l97339J600265
3931.7F68686752k147598j699753J027146j7853O12945K77710j059112k96478K38800
$$ plain form
3940.4 665622559 667339935 668499756 665268784 664508667 665483856 666316605 667637863 665767136 665567093
3949.1 665567093 665158768 662731094 664729233 666337280 665933304 665741043 666179123 666497955 665617599
3957.8 665617599 665808182 665952377 666805573 667654114 666224670 665374069 665120392 665068054 665438690 665755615
3967.4 665755615 665925598 665869675 665807190 666242065 666177673 665340805 665119095 665404892 666155243 666055145
3977.1 666055145 665690384 665414810 664934158 665686417 665828934 665381393 665146942 665202713 665502548 665552292
3986.7 665552292 666129990 666656036 667093048 666399612 665403900 665075378 664887238 665723648 666103058 666174011
3996.3 666174011 665972748 665559692 665642242 665729294
4000.2 665729294
$$ packed form
3940.4F65622559J717376J159821l230972p60117R75189Q32749J321258j870727k00043
3949.1F65567093m08325k427674J998139J608047m03976j92261M38080L18832q80356
3957.8F65617599J90583J44195Q53196Q48541j429444q50601k53677n2338L70636L16925
3967.4F65755615J69983n5923o2485M34875o4392q36868k21710K85797P50351j00098
3977.1F66055145l64761k75574m80652P52259J42517m47541k34451N5771K99835M9744
3986.7F65552292N77698N26046M37012o93436r95712l28522j88140Q36410L79410P0953
3996.3F66174011k01263m13056Q2550Q7052
4000.2F65729294
##END=$$ End of the data block
